2 czm412416440 czm412416440 于 2015.06.02 22:46 提问

hadoop编译报错,跪求解答

[WARNING] Error injecting: org.apache.maven.plugin.antrun.AntRunMojo
java.lang.NoClassDefFoundError: org/apache/tools/ant/BuildException
at java.lang.Class.getDeclaredConstructors0(Native Method)
at java.lang.Class.privateGetDeclaredConstructors(Class.java:2493)
at java.lang.Class.getDeclaredConstructors(Class.java:1901)
at com.google.inject.spi.InjectionPoint.forConstructorOf(InjectionPoint.java:245)
at com.google.inject.internal.ConstructorBindingImpl.create(ConstructorBindingImpl.java:99)
at com.google.inject.internal.InjectorImpl.createUninitializedBinding(InjectorImpl.java:653)
at com.google.inject.internal.InjectorImpl.createJustInTimeBinding(InjectorImpl.java:863)
at com.google.inject.internal.InjectorImpl.createJustInTimeBindingRecursive(InjectorImpl.java:790)
at com.google.inject.internal.InjectorImpl.getJustInTimeBinding(InjectorImpl.java:278)
at com.google.inject.internal.InjectorImpl.getBindingOrThrow(InjectorImpl.java:210)
at com.google.inject.internal.InjectorImpl.getProviderOrThrow(InjectorImpl.java:986)
at com.google.inject.internal.InjectorImpl.getProvider(InjectorImpl.java:1019)
at com.google.inject.internal.InjectorImpl.getProvider(InjectorImpl.java:982)
at com.google.inject.internal.InjectorImpl.getInstance(InjectorImpl.java:1032)
at org.eclipse.sisu.space.AbstractDeferredClass.get(AbstractDeferredClass.java:48)
at com.google.inject.internal.ProviderInternalFactory.provision(ProviderInternalFactory.java:86)
at com.google.inject.internal.InternalFactoryToInitializableAdapter.provision(InternalFactoryToInitializableAdapter.java:55)
at com.google.inject.internal.ProviderInternalFactory$1.call(ProviderInternalFactory.java:70)
at com.google.inject.internal.ProvisionListenerStackCallback$Provision.provision(ProvisionListenerStackCallback.java:100)
at org.eclipse.sisu.plexus.PlexusLifecycleManager.onProvision(PlexusLifecycleManager.java:133)
at com.google.inject.internal.ProvisionListenerStackCallback$Provision.provision(ProvisionListenerStackCallback.java:109)
at com.google.inject.internal.ProvisionListenerStackCallback.provision(ProvisionListenerStackCallback.java:55)
at com.google.inject.internal.ProviderInternalFactory.circularGet(ProviderInternalFactory.java:68)
at com.google.inject.internal.InternalFactoryToInitializableAdapter.get(InternalFactoryToInitializableAdapter.java:47)
at com.google.inject.internal.InjectorImpl$2$1.call(InjectorImpl.java:997)
at com.google.inject.internal.InjectorImpl.callInContext(InjectorImpl.java:1047)
at com.google.inject.internal.InjectorImpl$2.get(InjectorImpl.java:993)
at com.google.inject.Scopes$1$1.get(Scopes.java:59)
at org.eclipse.sisu.inject.LazyBeanEntry.getValue(LazyBeanEntry.java:82)
at org.eclipse.sisu.plexus.LazyPlexusBean.getValue(LazyPlexusBean.java:51)
at org.codehaus.plexus.DefaultPlexusContainer.lookup(DefaultPlexusContainer.java:260)
at org.codehaus.plexus.DefaultPlexusContainer.lookup(DefaultPlexusContainer.java:252)
at org.apache.maven.plugin.internal.DefaultMavenPluginManager.getConfiguredMojo(DefaultMavenPluginManager.java:459)
at org.apache.maven.plugin.DefaultBuildPluginManager.executeMojo(DefaultBuildPluginManager.java:97)
at org.apache.maven.lifecycle.internal.MojoExecutor.execute(MojoExecutor.java:208)
at org.apache.maven.lifecycle.internal.MojoExecutor.execute(MojoExecutor.java:153)
at org.apache.maven.lifecycle.internal.MojoExecutor.execute(MojoExecutor.java:145)
at org.apache.maven.lifecycle.internal.LifecycleModuleBuilder.buildProject(LifecycleModuleBuilder.java:84)
at org.apache.maven.lifecycle.internal.LifecycleModuleBuilder.buildProject(LifecycleModuleBuilder.java:59)
at org.apache.maven.lifecycle.internal.LifecycleStarter.singleThreadedBuild(LifecycleStarter.java:183)
at org.apache.maven.lifecycle.internal.LifecycleStarter.execute(LifecycleStarter.java:161)
at org.apache.maven.DefaultMaven.doExecute(DefaultMaven.java:317)
at org.apache.maven.DefaultMaven.execute(DefaultMaven.java:152)
at org.apache.maven.cli.MavenCli.execute(MavenCli.java:555)
at org.apache.maven.cli.MavenCli.doMain(MavenCli.java:214)
at org.apache.maven.cli.MavenCli.main(MavenCli.java:158)
at sun.reflect.NativeMethodAccessorImpl.invoke0(Native Method)
at sun.reflect.NativeMethodAccessorImpl.invoke(NativeMethodAccessorImpl.java:57)
at sun.reflect.DelegatingMethodAccessorImpl.invoke(DelegatingMethodAccessorImpl.java:43)
at java.lang.reflect.Method.invoke(Method.java:606)
at org.codehaus.plexus.classworlds.launcher.Launcher.launchEnhanced(Launcher.java:289)
at org.codehaus.plexus.classworlds.launcher.Launcher.launch(Launcher.java:229)
at org.codehaus.plexus.classworlds.launcher.Launcher.mainWithExitCode(Launcher.java:415)
at org.codehaus.plexus.classworlds.launcher.Launcher.main(Launcher.java:356)
Caused by: java.lang.ClassNotFoundException: org.apache.tools.ant.BuildException
at org.codehaus.plexus.classworlds.strategy.SelfFirstStrategy.loadClass(SelfFirstStrategy.java:50)
at org.codehaus.plexus.classworlds.realm.ClassRealm.unsynchronizedLoadClass(ClassRealm.java:259)
at org.codehaus.plexus.classworlds.realm.ClassRealm.loadClass(ClassRealm.java:235)
at org.codehaus.plexus.classworlds.realm.ClassRealm.loadClass(ClassRealm.java:227)
... 54 more
[INFO] ------------------------------------------------------------------------
[INFO] BUILD FAILURE
[INFO] ------------------------------------------------------------------------
[INFO] Total time: 25:49.952s
[INFO] Finished at: Tue Jun 02 22:43:33 CST 2015
[INFO] Final Memory: 10M/219M
[INFO] ------------------------------------------------------------------------
[ERROR] Failed to execute goal org.apache.maven.plugins:maven-antrun-plugin:1.7:run (create-testdirs) on project hadoop-maven-plugins: Execution create-testdirs of goal org.apache.maven.plugins:maven-antrun-plugin:1.7:run failed: A required class was missing while executing org.apache.maven.plugins
maven-antrun-plugin:1.7:run: org/apache/tools/ant/BuildException
[ERROR] -----------------------------------------------------
[ERROR] realm = plugin>org.apache.maven.plugins:maven-antrun-plugin:1.7
[ERROR] strategy = org.codehaus.plexus.classworlds.strategy.SelfFirstStrategy
[ERROR] urls[0] = file:/D:/hadoop-2.4.0/hadoop-maven-plugins/path/org/apache/maven/plugins/maven-antrun-plugin/1.7/maven-antrun-plugin-1.7.jar
[ERROR] urls[1] = file:/D:/hadoop-2.4.0/hadoop-maven-plugins/path/org/codehaus/plexus/plexus-interpolation/1.1/plexus-interpolation-1.1.jar
[ERROR] urls[2] = file:/D:/hadoop-2.4.0/hadoop-maven-plugins/path/junit/junit/3.8.1/junit-3.8.1.jar
[ERROR] urls[3] = file:/D:/hadoop-2.4.0/hadoop-maven-plugins/path/org/codehaus/plexus/plexus-utils/2.0.5/plexus-utils-2.0.5.jar
[ERROR] urls[4] = file:/D:/hadoop-2.4.0/hadoop-maven-plugins/path/org/apache/ant/ant/1.8.2/ant-1.8.2.jar
[ERROR] urls[5] = file:/D:/hadoop-2.4.0/hadoop-maven-plugins/path/org/apache/ant/ant-launcher/1.8.2/ant-launcher-1.8.2.jar
[ERROR] Number of foreign imports: 1
[ERROR] import: Entry[import from realm ClassRealm[project>org.apache.hadoop:hadoop-maven-plugins:2.4.0, parent: ClassRealm[maven.api, parent: null]]]
[ERROR]
[ERROR] -----------------------------------------------------: org.apache.tools.ant.BuildException
[ERROR] -> [Help 1]
[ERROR]
[ERROR] To see the full stack trace of the errors, re-run Maven with the -e switch.
[ERROR] Re-run Maven using the -X switch to enable full debug logging.
[ERROR]
[ERROR] For more information about the errors and possible solutions, please read the following articles:
[ERROR] [Help 1] http://cwiki.apache.org/confluence/display/MAVEN/PluginContainerException
D:\hadoop-2.4.0\hadoop-maven-plugins>m

1个回答

devmiao
devmiao   Ds   Rxr 2015.06.03 00:16

没找到类,看看jar包全不全

Csdn user default icon
上传中...
上传图片
插入图片