2 channelv186 channelv186 于 2015.06.08 23:08 提问

ubuntu 64位编译hadoop-2.6.0失败,网上看了好久,都没解决,大神速来解救

[exec] CMake Error at /usr/local/share/cmake-2.6/Modules/FindPackageHandleStandardArgs.cmake:52 (MESSAGE):
[exec] Could NOT find ZLIB
[exec] Call Stack (most recent call first):
[exec] /usr/local/share/cmake-2.6/Modules/FindZLIB.cmake:22 (FIND_PACKAGE_HANDLE_STANDARD_ARGS)
[exec] CMakeLists.txt:107 (find_package)

[ERROR] Failed to execute goal org.apache.maven.plugins:maven-antrun-plugin:1.7:run (make) on project hadoop-common: An Ant BuildException has occured: exec returned: 1
[ERROR] around Ant part ...... @ 4:139 in /home/cj/workspace/hadoop-2.6.0-src/hadoop-common-project/hadoop-common/target/antrun/build-main.xml
[ERROR] -> [Help 1]
[ERROR]
[ERROR] To see the full stack trace of the errors, re-run Maven with the -e switch.
[ERROR] Re-run Maven using the -X switch to enable full debug logging.
[ERROR]
[ERROR] For more information about the errors and possible solutions, please read the following articles:
[ERROR] [Help 1] http://cwiki.apache.org/confluence/display/MAVEN/MojoExecutionException
[ERROR]
[ERROR] After correcting the problems, you can resume the build with the command
[ERROR] mvn -rf :hadoop-common

好像是 Could NOT find ZLIB引起的

4个回答

channelv186
channelv186   2015.06.12 20:11
已采纳

重新装下findbugs

wyl550182402
wyl550182402   2015.11.05 11:08

楼主怎么解决这个问题的啊?

wang010366
wang010366   2015.11.22 09:18

[INFO] Apache Hadoop Main ................................. SUCCESS [ 1.381 s]
[INFO] Apache Hadoop Project POM .......................... FAILURE [ 0.416 s]
[INFO] Apache Hadoop Annotations .......................... SKIPPED
[INFO] Apache Hadoop Assemblies ........................... SKIPPED
[INFO] Apache Hadoop Project Dist POM ..................... SKIPPED
[INFO] Apache Hadoop Maven Plugins ........................ SKIPPED
[INFO] Apache Hadoop MiniKDC .............................. SKIPPED
[INFO] Apache Hadoop Auth ................................. SKIPPED
[INFO] Apache Hadoop Auth Examples ........................ SKIPPED
[INFO] Apache Hadoop Common ............................... SKIPPED
[INFO] Apache Hadoop NFS .................................. SKIPPED
[INFO] Apache Hadoop KMS .................................. SKIPPED
[INFO] Apache Hadoop Common Project ....................... SKIPPED
[INFO] Apache Hadoop HDFS ................................. SKIPPED
[INFO] Apache Hadoop HttpFS ............................... SKIPPED
[INFO] Apache Hadoop HDFS BookKeeper Journal .............. SKIPPED
[INFO] Apache Hadoop HDFS-NFS ............................. SKIPPED
[INFO] Apache Hadoop HDFS Project ......................... SKIPPED
[INFO] hadoop-yarn ........................................ SKIPPED
[INFO] hadoop-yarn-api .................................... SKIPPED
[INFO] hadoop-yarn-common ................................. SKIPPED
[INFO] hadoop-yarn-server ................................. SKIPPED
[INFO] hadoop-yarn-server-common .......................... SKIPPED
[INFO] hadoop-yarn-server-nodemanager ..................... SKIPPED
[INFO] hadoop-yarn-server-web-proxy ....................... SKIPPED
[INFO] hadoop-yarn-server-applicationhistoryservice ....... SKIPPED
[INFO] hadoop-yarn-server-resourcemanager ................. SKIPPED
[INFO] hadoop-yarn-server-tests ........................... SKIPPED
[INFO] hadoop-yarn-client ................................. SKIPPED
[INFO] hadoop-yarn-applications ........................... SKIPPED
[INFO] hadoop-yarn-applications-distributedshell .......... SKIPPED
[INFO] hadoop-yarn-applications-unmanaged-am-launcher ..... SKIPPED
[INFO] hadoop-yarn-site ................................... SKIPPED
[INFO] hadoop-yarn-registry ............................... SKIPPED
[INFO] hadoop-yarn-project ................................ SKIPPED
[INFO] hadoop-mapreduce-client ............................ SKIPPED
[INFO] hadoop-mapreduce-client-core ....................... SKIPPED
[INFO] hadoop-mapreduce-client-common ..................... SKIPPED
[INFO] hadoop-mapreduce-client-shuffle .................... SKIPPED
[INFO] hadoop-mapreduce-client-app ........................ SKIPPED
[INFO] hadoop-mapreduce-client-hs ......................... SKIPPED
[INFO] hadoop-mapreduce-client-jobclient .................. SKIPPED
[INFO] hadoop-mapreduce-client-hs-plugins ................. SKIPPED
[INFO] Apache Hadoop MapReduce Examples ................... SKIPPED
[INFO] hadoop-mapreduce ................................... SKIPPED
[INFO] Apache Hadoop MapReduce Streaming .................. SKIPPED
[INFO] Apache Hadoop Distributed Copy ..................... SKIPPED
[INFO] Apache Hadoop Archives ............................. SKIPPED
[INFO] Apache Hadoop Rumen ................................ SKIPPED
[INFO] Apache Hadoop Gridmix .............................. SKIPPED
[INFO] Apache Hadoop Data Join ............................ SKIPPED
[INFO] Apache Hadoop Ant Tasks ............................ SKIPPED
[INFO] Apache Hadoop Extras ............................... SKIPPED
[INFO] Apache Hadoop Pipes ................................ SKIPPED
[INFO] Apache Hadoop OpenStack support .................... SKIPPED
[INFO] Apache Hadoop Amazon Web Services support .......... SKIPPED
[INFO] Apache Hadoop Client ............................... SKIPPED
[INFO] Apache Hadoop Mini-Cluster ......................... SKIPPED
[INFO] Apache Hadoop Scheduler Load Simulator ............. SKIPPED
[INFO] Apache Hadoop Tools Dist ........................... SKIPPED
[INFO] Apache Hadoop Tools ................................ SKIPPED
[INFO] Apache Hadoop Distribution ......................... SKIPPED
[INFO] ------------------------------------------------------------------------
[INFO] BUILD FAILURE
[INFO] ------------------------------------------------------------------------
[INFO] Total time: 4.966 s
[INFO] Finished at: 2015-11-22T09:13:36+08:00
[INFO] Final Memory: 46M/361M
[INFO] ------------------------------------------------------------------------
[ERROR] Failed to execute goal org.apache.maven.plugins:maven-antrun-plugin:1.7:run (create-testdirs) on project hadoop-project: Error executing ant tasks: /usr/local/hadoop-2.6.0-src/hadoop-project/target/antrun/build-main.xml (No such file or directory) -> [Help 1]
[ERROR]
[ERROR] To see the full stack trace of the errors, re-run Maven with the -e switch.
[ERROR] Re-run Maven using the -X switch to enable full debug logging.
[ERROR]
[ERROR] For more information about the errors and possible solutions, please read the following articles:
[ERROR] [Help 1] http://cwiki.apache.org/confluence/display/MAVEN/MojoExecutionException
[ERROR]
[ERROR] After correcting the problems, you can resume the build with the command
[ERROR] mvn -rf :hadoop-project
不知道楼主如何解决此问题,十分感谢

zhangxueyang1
zhangxueyang1   2016.01.05 18:16
   这个是因为没有从网络上下载相关的文件,当你执行编译时会自动下一些文件,可能是你没下完中断了,

还有可能是hadoop文件自身有损坏倒是的没有下完整,重新下个hadoop再试试。实在不行给你个链接吧!
现在官网的native从之前的32位都改成64位了,所以之前的64位要自己编译,但现在32位的要自己编译,这
个是别人编译好了的32位。
http://pan.baidu.com/s/1sjsN0T3

Csdn user default icon
上传中...
上传图片
插入图片