2 l w b l_w_b 于 2016.01.20 16:47 提问

maven install时出错望好心人解决一下。小弟先谢谢了

T E S T S

Forking command line: cmd.exe /X /C ""C:\Program Files\Java\jdk1.7.0\jre\bin\java" -jar E:\工作\我的代码\workspaceCollab2\AAA\target\surefire\surefirebooter4742801322268775008.jar E:\工作\我的代码\workspaceCollab2\AAA\target\surefire\surefire6598622082065573176tmp E:\工作\我的代码\workspaceCollab2\AAA\target\surefire\surefire_07796347708207276805tmp"
����: ���Դ��ļ�E:\?�����\???��??\workspaceCollab2\AAA\target\surefire\surefirebooter4742801322268775008.jʱ�����������

Results :

Tests run: 0, Failures: 0, Errors: 0, Skipped: 0

[INFO] ------------------------------------------------------------------------
[INFO] BUILD FAILURE
[INFO] ------------------------------------------------------------------------
[INFO] Total time: 8.642 s
[INFO] Finished at: 2016-01-20T16:45:04+08:00
[INFO] Final Memory: 15M/38M
[INFO] ------------------------------------------------------------------------
[ERROR] Failed to execute goal org.apache.maven.plugins:maven-surefire-plugin:2.12.4:test (default-test) on project eosgi-report: Execution default-test of goal org.apache.maven.plugins:maven-surefire-plugin:2.12.4:test failed: The forked VM terminated without saying properly goodbye. VM crash or System.exit called ? -> [Help 1]
org.apache.maven.lifecycle.LifecycleExecutionException: Failed to execute goal org.apache.maven.plugins:maven-surefire-plugin:2.12.4:test (default-test) on project eosgi-report: Execution default-test of goal org.apache.maven.plugins:maven-surefire-plugin:2.12.4:test failed: The forked VM terminated without saying properly goodbye. VM crash or System.exit called ?
at org.apache.maven.lifecycle.internal.MojoExecutor.execute(MojoExecutor.java:224)
at org.apache.maven.lifecycle.internal.MojoExecutor.execute(MojoExecutor.java:153)
at org.apache.maven.lifecycle.internal.MojoExecutor.execute(MojoExecutor.java:145)
at org.apache.maven.lifecycle.internal.LifecycleModuleBuilder.buildProject(LifecycleModuleBuilder.java:116)
at org.apache.maven.lifecycle.internal.LifecycleModuleBuilder.buildProject(LifecycleModuleBuilder.java:80)
at org.apache.maven.lifecycle.internal.builder.singlethreaded.SingleThreadedBuilder.build(SingleThreadedBuilder.java:51)
at org.apache.maven.lifecycle.internal.LifecycleStarter.execute(LifecycleStarter.java:120)
at org.apache.maven.DefaultMaven.doExecute(DefaultMaven.java:347)
at org.apache.maven.DefaultMaven.execute(DefaultMaven.java:154)
at org.apache.maven.cli.MavenCli.execute(MavenCli.java:582)
at org.apache.maven.cli.MavenCli.doMain(MavenCli.java:214)
at org.apache.maven.cli.MavenCli.main(MavenCli.java:158)
at sun.reflect.NativeMethodAccessorImpl.invoke0(Native Method)
at sun.reflect.NativeMethodAccessorImpl.invoke(NativeMethodAccessorImpl.java:57)
at sun.reflect.DelegatingMethodAccessorImpl.invoke(DelegatingMethodAccessorImpl.java:43)
at java.lang.reflect.Method.invoke(Method.java:601)
at org.codehaus.plexus.classworlds.launcher.Launcher.launchEnhanced(Launcher.java:289)
at org.codehaus.plexus.classworlds.launcher.Launcher.launch(Launcher.java:229)
at org.codehaus.plexus.classworlds.launcher.Launcher.mainWithExitCode(Launcher.java:415)
at org.codehaus.plexus.classworlds.launcher.Launcher.main(Launcher.java:356)
at org.codehaus.classworlds.Launcher.main(Launcher.java:46)
Caused by: org.apache.maven.plugin.PluginExecutionException: Execution default-test of goal org.apache.maven.plugins:maven-surefire-plugin:2.12.4:test failed: The forked VM terminated without saying properly goodbye. VM crash or System.exit called ?
at org.apache.maven.plugin.DefaultBuildPluginManager.executeMojo(DefaultBuildPluginManager.java:143)
at org.apache.maven.lifecycle.internal.MojoExecutor.execute(MojoExecutor.java:208)
... 20 more
Caused by: java.lang.RuntimeException: The forked VM terminated without saying properly goodbye. VM crash or System.exit called ?
at org.apache.maven.plugin.surefire.booterclient.output.ForkClient.close(ForkClient.java:257)
at org.apache.maven.plugin.surefire.booterclient.ForkStarter.fork(ForkStarter.java:301)
at org.apache.maven.plugin.surefire.booterclient.ForkStarter.run(ForkStarter.java:116)
at org.apache.maven.plugin.surefire.AbstractSurefireMojo.executeProvider(AbstractSurefireMojo.java:740)
at org.apache.maven.plugin.surefire.AbstractSurefireMojo.executeAllProviders(AbstractSurefireMojo.java:682)
at org.apache.maven.plugin.surefire.AbstractSurefireMojo.executeAfterPreconditionsChecked(AbstractSurefireMojo.java:648)
at org.apache.maven.plugin.surefire.AbstractSurefireMojo.execute(AbstractSurefireMojo.java:586)
at org.apache.maven.plugin.DefaultBuildPluginManager.executeMojo(DefaultBuildPluginManager.java:132)
... 21 more
[ERROR]
[ERROR]
[ERROR] For more information about the errors and possible solutions, please read the following articles:
[ERROR] [Help 1] http://cwiki.apache.org/confluence/display/MAVEN/PluginExecutionException

1个回答

rui888
rui888   Ds   Rxr 2016.01.20 17:14
biyesheji51qqcom
biyesheji51qqcom 回复biyesheji51qqcom: I had the same issue today and for me the real problem was reported further up in the log with message Cannot use a threadCount parameter less than 1; 1 > 0. When adding <threadCount>1</threadCount> in the surefire-plugin config the other error disappeared. 这个可用
4 天之前 回复
biyesheji51qqcom
biyesheji51qqcom 多谢分享
4 天之前 回复
Csdn user default icon
上传中...
上传图片
插入图片
准确详细的回答,更有利于被提问者采纳,从而获得C币。复制、灌水、广告等回答会被删除,是时候展现真正的技术了!