2 baidu 19694879 baidu_19694879 于 2017.01.05 11:34 提问

android 打Apk包时异常,,求解答,是不是导入的jar包冲突了呢

com.android.build.api.transform.TransformException: com.android.ide.common.process.ProcessException: java.util.concurrent.ExecutionException: com.android.ide.common.process.ProcessException: org.gradle.process.internal.ExecException: Process 'command 'C:\Program Files\Java\jdk1.8.0_102\bin\java.exe'' finished with non-zero exit value 2
Information:BUILD FAILED
Information:Total time: 9 mins 2.497 secs
Information:2,754 errors
Information:0 warnings
Information:See complete output in console

2个回答

ljheee
ljheee   Rxr 2017.01.05 12:40

你去搜一下这个错误喽,原因在这--- finished with non-zero exit value 2

so_huangbo
so_huangbo   2017.01.05 17:23

如果你引入了library,就可能是library和你application中依赖的库有冲突,检查一下。

Csdn user default icon
上传中...
上传图片
插入图片
准确详细的回答,更有利于被提问者采纳,从而获得C币。复制、灌水、广告等回答会被删除,是时候展现真正的技术了!