idea npm install出现npm ERR! fatal: Could not read from remote repository.的问题

图片说明

Csdn user default icon
上传中...
上传图片
插入图片
抄袭、复制答案,以达到刷声望分或其他目的的行为,在CSDN问答是严格禁止的,一经发现立刻封号。是时候展现真正的技术了!
其他相关推荐
安装依赖时候报错,求大佬解决?

E:\wamp\www\vea>npm install npm ERR! Error while executing: npm ERR! C:\Program Files (x86)\Git\cmd\git.EXE ls-remote -h -t https://github.c om/nhnent/raphael.git npm ERR! npm ERR! fatal: unable to access 'https://github.com/nhnent/raphael.git/': error :1407742E:SSL routines:SSL23_GET_SERVER_HELLO:tlsv1 alert protocol version npm ERR! npm ERR! exited with error code: 128 npm ERR! A complete log of this run can be found in: npm ERR! C:\Users\Administrator\AppData\Roaming\npm-cache\_logs\2020-05-06T0 2_18_58_199Z-debug.log

从gitup上下了vue-element-admin-master的项目,但npm i却一直起不来,求大佬帮帮我

报错如下 npm WARN deprecated nomnom@1.8.1: Package no longer supported. Contact support@npmjs.com for more info. npm ERR! code ENOGIT npm ERR! Error while executing: npm ERR! undefined ls-remote -h -t ssh://git@github.com/sohee-lee7/Squire.git npm ERR! npm ERR! undefined npm ERR! No git binary found in $PATH npm ERR! npm ERR! Failed using git. npm ERR! Please check if you have git installed and in your PATH. npm ERR! A complete log of this run can be found in: npm ERR! C:\Users\admin\AppData\Roaming\npm-cache\_logs\2018-12-13T05_49_05_745Z-debug.log PS E:\fangGit\vue-element-admin>

npm 出现 fatal error C1083: 无法打开包括文件

\_canvas@1.6.13@canvas\src\canvas.h(19): fatal error C1083: 无法打开包括文件: “cairo.h”: No such file or directory (编译源文件 ..\src\ImageData.cc) 有没有人给支个招啊 \ [21/22] Installing nan@^2.10.0gyp ERR! build error gyp ERR! stack Error: `C:\Program Files (x86)\Microsoft Visual Studio\2017\BuildTools\MSBuild\15.0\Bin\MSBuild.exe` failed with exit code: 1 gyp ERR! stack at ChildProcess.onExit (C:\Users\xiaojian\AppData\Roaming\npm\node_modules\cnpm\node_modules\node-gyp\lib\build.js:262:23) gyp ERR! stack at ChildProcess.emit (events.js:182:13) gyp ERR! stack at Process.ChildProcess._handle.onexit (internal/child_process.js:240:12) gyp ERR! System Windows_NT 10.0.17134 gyp ERR! command "F:\\Program Files\\nodejs\\node.exe" "C:\\Users\\xiaojian\\AppData\\Roaming\\npm\\node_modules\\cnpm\\node_modules\\npminstall\\node-gyp-bin\\node-gyp.js" "rebuild" gyp ERR! cwd H:\项目\egg\node_modules\_canvas@1.6.13@canvas gyp ERR! node -v v10.11.0 gyp ERR! node-gyp -v v3.8.0 gyp ERR! not ok [npminstall:runscript:error] canvas@^1.6.11 has binding.gyp file, run "node-gyp rebuild" error: Error: Run "C:\WINDOWS\system32\cmd.exe /d /s /c node-gyp rebuild" error, exit code 1 × Install fail! Error: Run "C:\WINDOWS\system32\cmd.exe /d /s /c node-gyp rebuild" error, exit code 1 Error: Run "C:\WINDOWS\system32\cmd.exe /d /s /c node-gyp rebuild" error, exit code 1 at ChildProcess.proc.on.code (C:\Users\xiaojian\AppData\Roaming\npm\node_modules\cnpm\node_modules\runscript\index.js:74:21) at ChildProcess.emit (events.js:182:13) at maybeClose (internal/child_process.js:962:16) at Process.ChildProcess._handle.onexit (internal/child_process.js:251:5) npminstall version: 3.20.1 npminstall args: F:\Program Files\nodejs\node.exe C:\Users\xiaojian\AppData\Roaming\npm\node_modules\cnpm\node_modules\npminstall\bin\install.js --fix-bug-versions --china --userconfig=C:\Users\xiaojian\.cnpmrc --disturl=https://npm.taobao.org/mirrors/node --registry=https://registry.npm.taobao.org

Windows下没有Git环境,如何npm install

npm ERR! code ENOGIT npm ERR! Error while executing: npm ERR! undefined ls-remote -h -t ssh://git@github.com/sohee-lee7/Squire.git npm ERR! npm ERR! undefined npm ERR! No git binary found in $PATH npm ERR! npm ERR! Failed using git. npm ERR! Please check if you have git installed and in your PATH. npm ERR! A complete log of this run can be found in:

全局安装的npm 但是在运行npm install的时候就会出很多错误

![图片说明](https://img-ask.csdn.net/upload/202006/19/1592536010_34635.png)

npm安装一直有问题.查询不了

## 输入node -v正常....但是输入npm -v就出现下面这种情况![输入npm -v出现下面这种情况](https://img-ask.csdn.net/upload/201910/17/1571284739_958966.png) C:\Users\Administrator>npm -v Error: EINVAL: invalid argument, mkdir 'D:\SDE\Node8.9.4\node_globalF:\QQPCmgr\Professional\MSBuild\Microsoft\VisualStudio\NodeJs\node_global' TypeError: Cannot read property 'loaded' of undefined at exit (E:\node\node_modules\npm\lib\utils\error-handler.js:97:27) at errorHandler (E:\node\node_modules\npm\lib\utils\error-handler.js:216:3) at E:\node\node_modules\npm\bin\npm-cli.js:78:20 at cb (E:\node\node_modules\npm\lib\npm.js:225:22) at E:\node\node_modules\npm\lib\npm.js:263:24 at E:\node\node_modules\npm\lib\config\core.js:81:7 at Array.forEach (<anonymous>) at E:\node\node_modules\npm\lib\config\core.js:80:13 at f (E:\node\node_modules\npm\node_modules\once\once.js:25:25) at afterExtras (E:\node\node_modules\npm\lib\config\core.js:171:20) E:\node\node_modules\npm\lib\utils\error-handler.js:97 var doExit = npm.config.loaded ? npm.config.get('_exit') : true ^ TypeError: Cannot read property 'loaded' of undefined at exit (E:\node\node_modules\npm\lib\utils\error-handler.js:97:27) at process.errorHandler (E:\node\node_modules\npm\lib\utils\error-handler.js:216:3) at process.emit (events.js:210:5) at process._fatalException (internal/process/execution.js:150:25) 6.11.3 ## 可能是之前修改默认的全局目录好像位置输入错了....但是不知道怎么改回来

将git-submodule导入golang gae应用程序

<div class="post-text" itemprop="text"> <p>I have a submodule in my golang google-app-engine project that I would like to add to my path. </p> <pre><code>$ ls ./openid/src/openid discover.go integration verify.go discover_test.go nonce_store.go xrds.go discovery_cache.go nonce_store_test.go xrds_test.go fake_getter_test.go normalizer.go yadis_discovery.go getter.go normalizer_test.go yadis_discovery_test.go html_discovery.go redirect.go html_discovery_test.go redirect_test.go </code></pre> <p>In the example code for this package, it imports "openid". I'm new to golang's import rules, and I can't for the life of me figure out what I need to put in the import statement of my main file to import this package. I've tried "openid/src/openid", "myapp/openid/src/openid", etc. Can someone provide some clarification of how this works? Or do I need to actually modify the app.yaml file? </p> </div>

ubuntu下安装 hexo失败

执行 sudo npm install hexo -g时 报错 贴上报错 ``` npm WARN This failure might be due to the use of legacy binary "node" npm WARN For further explanations, please read /usr/share/doc/nodejs/README.Debian > dtrace-provider@0.6.0 install /usr/local/lib/node_modules/hexo/node_modules/hexo-log/node_modules/bunyan/node_modules/dtrace-provider > node scripts/install.js sh: 1: node: not found npm WARN This failure might be due to the use of legacy binary "node" npm WARN For further explanations, please read /usr/share/doc/nodejs/README.Debian npm WARN optional dep failed, continuing dtrace-provider@0.6.0 npm ERR! error rolling back Error: ENOTEMPTY, rmdir '/usr/local/lib/node_modules/hexo/node_modules/cheerio/node_modules/jsdom/node_modules/cssstyle/lib/properties' npm ERR! error rolling back hexo@3.2.0 { [Error: ENOTEMPTY, rmdir '/usr/local/lib/node_modules/hexo/node_modules/cheerio/node_modules/jsdom/node_modules/cssstyle/lib/properties'] npm ERR! error rolling back errno: 53, npm ERR! error rolling back code: 'ENOTEMPTY', npm ERR! error rolling back path: '/usr/local/lib/node_modules/hexo/node_modules/cheerio/node_modules/jsdom/node_modules/cssstyle/lib/properties' } npm ERR! spawn-sync@1.0.15 postinstall: `node postinstall` npm ERR! Exit status 127 npm ERR! npm ERR! Failed at the spawn-sync@1.0.15 postinstall script. npm ERR! This is most likely a problem with the spawn-sync package, npm ERR! not with npm itself. npm ERR! Tell the author that this fails on your system: npm ERR! node postinstall npm ERR! You can get their info via: npm ERR! npm owner ls spawn-sync npm ERR! There is likely additional logging output above. npm ERR! System Linux 3.19.0-51-generic npm ERR! command "/usr/bin/nodejs" "/usr/bin/npm" "install" "hexo" "-g" npm ERR! cwd /home/sjd/code npm ERR! node -v v0.10.25 npm ERR! npm -v 1.4.21 npm ERR! code ELIFECYCLE npm ERR! Error: ENOENT, open '/usr/local/lib/node_modules/hexo/node_modules/cheerio/node_modules/jsdom/node_modules/request/node_modules/hawk/lib/server.js' npm ERR! If you need help, you may report this *entire* log, npm ERR! including the npm and node versions, at: npm ERR! <http://github.com/npm/npm/issues> npm ERR! System Linux 3.19.0-51-generic npm ERR! command "/usr/bin/nodejs" "/usr/bin/npm" "install" "hexo" "-g" npm ERR! cwd /home/sjd/code npm ERR! node -v v0.10.25 npm ERR! npm -v 1.4.21 npm ERR! path /usr/local/lib/node_modules/hexo/node_modules/cheerio/node_modules/jsdom/node_modules/request/node_modules/hawk/lib/server.js npm ERR! code ENOENT npm ERR! errno 34 npm ERR! EEXIST, mkdir '/usr/local/lib/node_modules/hexo/node_modules/warehouse/node_modules/cuid/node_modules/core-js/library/fn/symbol' File exists: /usr/local/lib/node_modules/hexo/node_modules/warehouse/node_modules/cuid/node_modules/core-js/library/fn/symbol Move it away, and try again. npm ERR! System Linux 3.19.0-51-generic npm ERR! command "/usr/bin/nodejs" "/usr/bin/npm" "install" "hexo" "-g" npm ERR! cwd /home/sjd/code npm ERR! node -v v0.10.25 npm ERR! npm -v 1.4.21 npm ERR! path /usr/local/lib/node_modules/hexo/node_modules/warehouse/node_modules/cuid/node_modules/core-js/library/fn/symbol npm ERR! fstream_path /usr/local/lib/node_modules/hexo/node_modules/warehouse/node_modules/cuid/node_modules/core-js/library/fn/symbol/iterator.js npm ERR! fstream_type File npm ERR! fstream_class FileWriter npm ERR! code EEXIST npm ERR! errno 47 npm ERR! fstream_stack /usr/lib/nodejs/fstream/lib/writer.js:171:23 npm ERR! fstream_stack /usr/lib/nodejs/mkdirp/index.js:46:53 npm ERR! fstream_stack Object.oncomplete (fs.js:107:15) npm ERR! Error: ENOENT, lstat '/usr/local/lib/node_modules/hexo/node_modules/cheerio/node_modules/jsdom/node_modules/request/node_modules/aws4/node_modules/lru-cache/node_modules/yallist/LICENSE' npm ERR! If you need help, you may report this *entire* log, npm ERR! including the npm and node versions, at: npm ERR! <http://github.com/npm/npm/issues> npm ERR! System Linux 3.19.0-51-generic npm ERR! command "/usr/bin/nodejs" "/usr/bin/npm" "install" "hexo" "-g" npm ERR! cwd /home/sjd/code npm ERR! node -v v0.10.25 npm ERR! npm -v 1.4.21 npm ERR! path /usr/local/lib/node_modules/hexo/node_modules/cheerio/node_modules/jsdom/node_modules/request/node_modules/aws4/node_modules/lru-cache/node_modules/yallist/LICENSE npm ERR! fstream_path /usr/local/lib/node_modules/hexo/node_modules/cheerio/node_modules/jsdom/node_modules/request/node_modules/aws4/node_modules/lru-cache/node_modules/yallist/LICENSE npm ERR! fstream_type File npm ERR! fstream_class FileWriter npm ERR! code ENOENT npm ERR! errno 34 npm ERR! fstream_stack /usr/lib/nodejs/fstream/lib/writer.js:284:26 npm ERR! fstream_stack Object.oncomplete (evalmachine.<anonymous>:107:15) npm ERR! Error: ENOENT, lstat '/usr/local/lib/node_modules/hexo/node_modules/cheerio/node_modules/jsdom/node_modules/request/node_modules/form-data/node_modules/async/lib/async.js' npm ERR! If you need help, you may report this *entire* log, npm ERR! including the npm and node versions, at: npm ERR! <http://github.com/npm/npm/issues> npm ERR! System Linux 3.19.0-51-generic npm ERR! command "/usr/bin/nodejs" "/usr/bin/npm" "install" "hexo" "-g" npm ERR! cwd /home/sjd/code npm ERR! node -v v0.10.25 npm ERR! npm -v 1.4.21 npm ERR! path /usr/local/lib/node_modules/hexo/node_modules/cheerio/node_modules/jsdom/node_modules/request/node_modules/form-data/node_modules/async/lib/async.js npm ERR! fstream_path /usr/local/lib/node_modules/hexo/node_modules/cheerio/node_modules/jsdom/node_modules/request/node_modules/form-data/node_modules/async/lib/async.js npm ERR! fstream_type File npm ERR! fstream_class FileWriter npm ERR! code ENOENT npm ERR! errno 34 npm ERR! fstream_stack /usr/lib/nodejs/fstream/lib/writer.js:284:26 npm ERR! fstream_stack Object.oncomplete (evalmachine.<anonymous>:107:15) npm ERR! Error: ENOENT, lstat '/usr/local/lib/node_modules/hexo/node_modules/cheerio/node_modules/jsdom/node_modules/request/node_modules/bl/node_modules/readable-stream/doc/stream.markdown' npm ERR! If you need help, you may report this *entire* log, npm ERR! including the npm and node versions, at: npm ERR! <http://github.com/npm/npm/issues> ```

gulp . watch出现的问题

<--- JS stacktrace ---> Cannot get stack trace in GC. FATAL ERROR: MarkCompactCollector: semi-space copy, fallback in old gen Allocation failed - JavaScript heap out of memory sh: line 1: 35606 Abort trap: 6 NODE_ENV=localWillclass supervisor -i ./public,./build ./bin/twww npm ERR! Darwin 16.4.0 npm ERR! argv "/usr/local/bin/node" "/usr/local/bin/npm" "run" "localWillclass" npm ERR! node v6.1.0 npm ERR! npm v3.8.6 npm ERR! code ELIFECYCLE npm ERR! willclass@4.2.20170901 localWillclass: `NODE_ENV=localWillclass supervisor -i ./public,./build ./bin/twww && gulp deploy --silent` npm ERR! Exit status 134 npm ERR! npm ERR! Failed at the willclass@4.2.20170901 localWillclass script 'NODE_ENV=localWillclass supervisor -i ./public,./build ./bin/twww && gulp deploy --silent'. npm ERR! Make sure you have the latest version of node.js and npm installed. npm ERR! If you do, this is most likely a problem with the willclass package, npm ERR! not with npm itself. npm ERR! Tell the author that this fails on your system: npm ERR! NODE_ENV=localWillclass supervisor -i ./public,./build ./bin/twww && gulp deploy --silent npm ERR! You can get information on how to open an issue for this project with: npm ERR! npm bugs willclass npm ERR! Or if that isn't available, you can get their info via: npm ERR! npm owner ls willclass npm ERR! There is likely additional logging output above. npm ERR! Please include the following file with any support request: npm ERR! /Users/shuai/huitong/willclass/npm-debug.log

node安装之后,npm -v执行报错

* ![图片说明](https://img-ask.csdn.net/upload/202001/21/1579589799_983292.png) 存在的问题:node -v 执行成功,说明不是环境变量的问题,卸载重装也试过,注册表也清过,c盘的用户文件也删除过,进入npm所在的目录,进行命令行,执行npm -v 也是报相同的错误。

win7 X64,安装angular-cli报错

各位大神好,npm install -g @angular/cli 时报一个“CL.exe”不存在的错误,在环境变量添加了一下,然后又报了个新错误,求助大神解决。 注:cmd已用管理员用户打开 报错如下: ``` “C:\Program Files\nodejs\node_global\node_modules\@angular\cli\node_modules\nod e-sass\build\binding.sln”(默认目标) (1) -> “C:\Program Files\nodejs\node_global\node_modules\@angular\cli\node_modules\nod e-sass\build\binding.vcxproj.metaproj”(默认目标) (2) -> “C:\Program Files\nodejs\node_global\node_modules\@angular\cli\node_modules\nod e-sass\build\src\libsass.vcxproj”(默认目标) (3) -> (ClCompile 目标) -> cl : 命令行 warning D9024: 无法识别的源文件类型“EnumerateProviders”,假定为 对象文件 [C:\Program Fi les\nodejs\node_global\node_modules\@angular\cli\node_modules\node-sass\build\s rc\libsass.vcxproj] cl : 命令行 warning D9027: 源文件“EnumerateProviders”被忽略 [C:\Program File s\nodejs\n ode_global\node_modules\@angular\cli\node_modules\node-sass\build\src\libsass.v cxproj] cl : 命令行 warning D9024: 无法识别的源文件类型“EnumerateProviders”,假定为 对象文件 [C:\Program Fi les\nodejs\node_global\node_modules\@angular\cli\node_modules\node-sass\build\s rc\libsass.vcxproj] cl : 命令行 warning D9027: 源文件“EnumerateProviders”被忽略 [C:\Program File s\nodejs\n ode_global\node_modules\@angular\cli\node_modules\node-sass\build\src\libsass.v cxproj] cl : 命令行 warning D9024: 无法识别的源文件类型“EnumerateProviders”,假定为 对象文件 [C:\Program Fi les\nodejs\node_global\node_modules\@angular\cli\node_modules\node-sass\build\s rc\libsass.vcxproj] cl : 命令行 warning D9027: 源文件“EnumerateProviders”被忽略 [C:\Program File s\nodejs\n ode_global\node_modules\@angular\cli\node_modules\node-sass\build\src\libsass.v cxproj] “C:\Program Files\nodejs\node_global\node_modules\@angular\cli\node_modules\nod e-sass\build\binding.sln”(默认目标) (1) -> “C:\Program Files\nodejs\node_global\node_modules\@angular\cli\node_modules\nod e-sass\build\binding.vcxproj.metaproj”(默认目标) (2) -> “C:\Program Files\nodejs\node_global\node_modules\@angular\cli\node_modules\nod e-sass\build\src\libsass.vcxproj”(默认目标) (3) -> (ClCompile 目标) -> c1xx : fatal error C1081: “totalPro=18" \GF \Gm- \MT \GS \Gy \fp:precise \Zc: wchar_t \Zc:forScope \Zc:inline \GR- \FoRelease\obj\libsass\ \FdRelease\obj\lib sass\libsass.pdb \Gd \TP \wd4267 \wd4351 \wd4355 \wd4800 \wd4251 \errorReport:q ueue \GR \EHsc \MP ..\..\src\libsass\src\ast.cpp ..\..\src\libsass\src\ast_fwd_ decl.cpp ..\..\src\libsass\src\base64vlq.cpp ..\..\src\libsass\src\bind.cpp ..\ ..\src\libsass\src\check_nesting.cpp ..\..\src\libsass\src\color_maps.cpp ..\.. \src\libsass\src\constants.cpp ..\..\src\libsass\src\context.cpp ..\..\src\libs ass\src\cssize.cpp ..\..\src\libsass\src\emitter.cpp ..\..\src\libsass\src\envi ronment.cpp ..\..\src\libsass\src\error_handling.cpp ..\..\src\libsass\src\eval .cpp ..\..\src\libsass\src\expand.cpp ..\..\src\libsass\src\extend.cpp ..\..\sr c\libsass\src\file.cpp ..\..\src\libsass\src\functions.cpp ..\..\src\libsass\sr c\inspect.cpp ..\..\src\libsass\src\json.cpp ..\..\src\libsass\src\lexer.cpp .. \..\src\libsass\src\listize.cpp ..\..\src\libsass\src\memory\SharedPtr.cpp ..\. .\src\libsass\src\node.cpp ..\..\src\libsass\src\output.cpp ..\..\src\libsass\s rc\parser.cpp ..\..\src\libsass\src\plugins.cpp ..\..\src\libsass\src\position. cpp ..\..\src\libsass\src\prelexer.cpp ..\..\src\libsass\src\remove_placeholder s.cpp ..\..\src\libsass\src\sass.cpp ..\..\src\libsass\src\sass2scss.cpp ..\..\ src\libsass\src\sass_context.cpp ..\..\src\libsass\src\sass_functions.cpp ..\.. \src\libsass\src\sass_util.cpp ..\..\src\libsass\src\sass_values.cpp ..\..\src\ libsass\src\source_map.cpp ..\..\src\libsass\src\subset_map.cpp ..\..\src\libsa ss\src\to_c.cpp ..\..\src\libsass\src\to_value.cpp ..\..\src\libsass\src\units. cpp ..\..\src\libsass\src\utf8_string.cpp ..\..\src\libsass\src\util.cpp ..\..\ src\libsass\src\values.cpp”: 文件名太长 [C:\Program Files\nodejs\node_global\n ode_modules\@angular\cli\node_modules\node-sass\build\src\libsass.vcxproj] 6 个警告 1 个错误 已用时间 00:00:01.01 gyp ERR! build error gyp ERR! stack Error: `C:\Program Files (x86)\MSBuild\14.0\bin\msbuild.exe` fail ed with exit code: 1 gyp ERR! stack at ChildProcess.onExit (C:\Program Files\nodejs\node_global\n ode_modules\@angular\cli\node_modules\node-gyp\lib\build.js:258:23) gyp ERR! stack at emitTwo (events.js:125:13) gyp ERR! stack at ChildProcess.emit (events.js:213:7) gyp ERR! stack at Process.ChildProcess._handle.onexit (internal/child_proces s.js:200:12) gyp ERR! System Windows_NT 6.1.7601 gyp ERR! command "C:\\Program Files\\nodejs\\node.exe" "C:\\Program Files\\nodej s\\node_global\\node_modules\\@angular\\cli\\node_modules\\node-gyp\\bin\\node-g yp.js" "rebuild" "--verbose" "--libsass_ext=" "--libsass_cflags=" "--libsass_ldf lags=" "--libsass_library=" gyp ERR! cwd C:\Program Files\nodejs\node_global\node_modules\@angular\cli\node_ modules\node-sass gyp ERR! node -v v8.7.0 gyp ERR! node-gyp -v v3.6.2 gyp ERR! not ok Build failed with error code: 1 npm ERR! path C:\Program Files\nodejs\node_global\node_modules\@angular\cli\node _modules\scss-tokenizer\node_modules npm ERR! code EPERM npm ERR! errno -4048 npm ERR! syscall lstat npm ERR! Error: EPERM: operation not permitted, lstat 'C:\Program Files\nodejs\n ode_global\node_modules\@angular\cli\node_modules\scss-tokenizer\node_modules' npm ERR! { Error: EPERM: operation not permitted, lstat 'C:\Program Files\nodej s\node_global\node_modules\@angular\cli\node_modules\scss-tokenizer\node_modules ' npm ERR! stack: 'Error: EPERM: operation not permitted, lstat \'C:\\Program Fi les\\nodejs\\node_global\\node_modules\\@angular\\cli\\node_modules\\scss-tokeni zer\\node_modules\'', npm ERR! errno: -4048, npm ERR! code: 'EPERM', npm ERR! syscall: 'lstat', npm ERR! path: 'C:\\Program Files\\nodejs\\node_global\\node_modules\\@angular \\cli\\node_modules\\scss-tokenizer\\node_modules' } npm ERR! npm ERR! Please try running this command again as root/Administrator. npm ERR! A complete log of this run can be found in: npm ERR! C:\Program Files\nodejs\node_cache\_logs\2017-10-25T01_39_52_411Z-d ebug.log ```

Buffer.alloc is not a function 报错什么意思??

使用npm下载 包时,报错,报错内容如下: npm ERR! Buffer.alloc is not a function npm ERR! A complete log of this run can be found in: npm ERR! C:\Users\呵呵哒\AppData\Roaming\npm-cache\_logs\2017-10-10T03_19_17_976Z-debug.log 是node版本太低了嘛?还是什么原因

win10下 nodejs报错:error Windows_NT 10.0.14393

0 info it worked if it ends with ok 1 verbose cli [ 'D:\\Program Files\\nodejs\\node.exe', 1 verbose cli 'D:\\Program Files\\nodejs\\node_modules\\npm\\bin\\npm-cli.js', 1 verbose cli 'run', 1 verbose cli 'dev' ] 2 info using npm@3.10.9 3 info using node@v6.9.2 4 warn invalid config registry="registry" 5 warn invalid config Must be a full url with 'http://' 6 verbose run-script [ 'predev', 'dev', 'postdev' ] 7 info lifecycle vue@1.0.0~predev: vue@1.0.0 8 silly lifecycle vue@1.0.0~predev: no script for predev, continuing 9 info lifecycle vue@1.0.0~dev: vue@1.0.0 10 verbose lifecycle vue@1.0.0~dev: unsafe-perm in lifecycle true 11 verbose lifecycle vue@1.0.0~dev: PATH: D:\Program Files\nodejs\node_modules\npm\bin\node-gyp-bin;E:\WEB\vue\node_modules\.bin;C:\Program Files (x86)\Intel\iCLS Client\;C:\Program Files\Intel\iCLS Client\;C:\Windows\system32;C:\Windows;C:\Windows\System32\Wbem;C:\Windows\System32\WindowsPowerShell\v1.0\;C:\Program Files (x86)\Intel\Intel(R) Management Engine Components\DAL;C:\Program Files\Intel\Intel(R) Management Engine Components\DAL;C:\Program Files (x86)\Intel\Intel(R) Management Engine Components\IPT;C:\Program Files\Intel\Intel(R) Management Engine Components\IPT;C:\Program Files (x86)\NVIDIA Corporation\PhysX\Common;D:\Program Files\TortoiseSVN\bin;C:\WINDOWS\system32;C:\WINDOWS;C:\WINDOWS\System32\Wbem;C:\WINDOWS\System32\WindowsPowerShell\v1.0\;D:\Program Files (x86)\VisualSVN Server\bin;D:\Program Files\nodejs\;C:\Users\King\AppData\Local\Microsoft\WindowsApps;C:\Users\King\AppData\Roaming\npm 12 verbose lifecycle vue@1.0.0~dev: CWD: E:\WEB\vue 13 silly lifecycle vue@1.0.0~dev: Args: [ '/d /s /c', 'node build/dev-server.js' ] 14 silly lifecycle vue@1.0.0~dev: Returned: code: 1 signal: null 15 info lifecycle vue@1.0.0~dev: Failed to exec dev script 16 verbose stack Error: vue@1.0.0 dev: `node build/dev-server.js` 16 verbose stack Exit status 1 16 verbose stack at EventEmitter.<anonymous> (D:\Program Files\nodejs\node_modules\npm\lib\utils\lifecycle.js:255:16) 16 verbose stack at emitTwo (events.js:106:13) 16 verbose stack at EventEmitter.emit (events.js:191:7) 16 verbose stack at ChildProcess.<anonymous> (D:\Program Files\nodejs\node_modules\npm\lib\utils\spawn.js:40:14) 16 verbose stack at emitTwo (events.js:106:13) 16 verbose stack at ChildProcess.emit (events.js:191:7) 16 verbose stack at maybeClose (internal/child_process.js:877:16) 16 verbose stack at Process.ChildProcess._handle.onexit (internal/child_process.js:226:5) 17 verbose pkgid vue@1.0.0 18 verbose cwd E:\WEB\vue 19 error Windows_NT 10.0.14393 20 error argv "D:\\Program Files\\nodejs\\node.exe" "D:\\Program Files\\nodejs\\node_modules\\npm\\bin\\npm-cli.js" "run" "dev" 21 error node v6.9.2 22 error npm v3.10.9 23 error code ELIFECYCLE 24 error vue@1.0.0 dev: `node build/dev-server.js` 24 error Exit status 1 25 error Failed at the vue@1.0.0 dev script 'node build/dev-server.js'. 25 error Make sure you have the latest version of node.js and npm installed. 25 error If you do, this is most likely a problem with the vue package, 25 error not with npm itself. 25 error Tell the author that this fails on your system: 25 error node build/dev-server.js 25 error You can get information on how to open an issue for this project with: 25 error npm bugs vue 25 error Or if that isn't available, you can get their info via: 25 error npm owner ls vue 25 error There is likely additional logging output above. 26 verbose exit [ 1, true ] 全部内容如上,求各位大神支招

git 中 npm -v 正常 node -v 失败 怎末解绝

![图片说明](https://img-ask.csdn.net/upload/201810/07/1538884277_520952.png) npm -v 正常 node -v 失败 怎末解绝 新手勿喷

kafka-node报Snappy codec is not installed

consumer代码如下 ``` var http = require('http'); http.createServer(function (request, response) { // 发送 HTTP 头部 // HTTP 状态值: 200 : OK // 内容类型: text/plain response.writeHead(200, {'Content-Type': 'text/plain'}); var kafka = require('kafka-node'); var Consumer = kafka.Consumer; var Client = kafka.Client; var client = new Client("localhost:2181"); var consumer = new Consumer( client, [ { topic: 'fltest'} ], { autoCommit: false } ); consumer.on('message',function(message){ console.log(message); }); consumer.on('error',function(err){ console.log(err); }); // 发送响应数据 "Hello World" response.end('Hello World\n'); }).listen(9999); // 终端打印如下信息 console.log('Server running at http://127.0.0.1:9999/'); ``` Consumer老是报如下错误 ``` E:\node_modules\.1.0.7@kafka-node\lib\codec\snappy.js:9 throw new Error('Snappy codec is not installed'); ^ Error: Snappy codec is not installed at Object.unavailableCodec (E:\node_modules\.1.0.7@kafka-node\lib\codec\snap py.js:9:11) at Object.<anonymous> (E:\node_modules\.1.0.7@kafka-node\lib\protocol\protoc ol.js:183:17) at Object.self.tap (E:\node_modules\.0.3.0@binary\index.js:248:12) at decodeMessageSet (E:\node_modules\.1.0.7@kafka-node\lib\protocol\protocol .js:161:8) at Object.<anonymous> (E:\node_modules\.1.0.7@kafka-node\lib\protocol\protoc ol.js:128:26) at Object.self.tap (E:\node_modules\.0.3.0@binary\index.js:248:12) at Object.decodePartitions (E:\node_modules\.1.0.7@kafka-node\lib\protocol\p rotocol.js:123:8) at Object.self.loop (E:\node_modules\.0.3.0@binary\index.js:267:16) at Object.<anonymous> (E:\node_modules\.1.0.7@kafka-node\lib\protocol\protoc ol.js:57:8) at Object.self.loop (E:\node_modules\.0.3.0@binary\index.js:267:16) ``` 但在我的当前目录下有一个.5.0.5@snappy。我知道是怎么回事 在安装snapyy的时候也提示 ``` E:\node_modules\.5.0.5@snappy>node "C:\Users\Administrator\AppData\Roaming\npm\n ode_modules\cnpm\node_modules\npminstall\node-gyp-bin\\node-gyp.js" rebuild 在此解决方案中一次生成一个项目。若要启用并行生成,请添加“/m”开关。 CL : fatal error C1510: Cannot load language resource clui.dll. [E:\node_module s\.5.0.5@snappy\build\deps\snappy\snappy.vcxproj] gyp ERR! build error gyp ERR! stack Error: `C:\Windows\Microsoft.NET\Framework\v4.0.30319\msbuild.exe ` failed with exit code: 1 gyp ERR! stack at ChildProcess.onExit (C:\Users\Administrator\AppData\Roamin g\npm\node_modules\cnpm\node_modules\node-gyp\lib\build.js:276:23) gyp ERR! stack at emitTwo (events.js:106:13) gyp ERR! stack at ChildProcess.emit (events.js:191:7) gyp ERR! stack at Process.ChildProcess._handle.onexit (internal/child_proces s.js:215:12) gyp ERR! System Windows_NT 6.1.7601 gyp ERR! command "D:\\Application\\Node.js\\node.exe" "C:\\Users\\Administrator\ \AppData\\Roaming\\npm\\node_modules\\cnpm\\node_modules\\npminstall\\node-gyp-b in\\node-gyp.js" "rebuild" gyp ERR! cwd E:\node_modules\.5.0.5@snappy gyp ERR! node -v v6.9.3 gyp ERR! node-gyp -v v3.4.0 gyp ERR! not ok Error: post install error, please remove node_modules before retry! Run "C:\Windows\system32\cmd.exe /d /s /c node-gyp rebuild" error, exit code 1 at ChildProcess.proc.on.code (C:\Users\Administrator\AppData\Roaming\npm\nod e_modules\cnpm\node_modules\runscript\index.js:67:21) at emitTwo (events.js:106:13) at ChildProcess.emit (events.js:191:7) at maybeClose (internal/child_process.js:885:16) at Process.ChildProcess._handle.onexit (internal/child_process.js:226:5) npminstall version: 2.16.0 npminstall args: E:\node.exe C:\Users\Administrator\AppData\Roaming\npm\node_mod ules\cnpm\node_modules\npminstall\bin\install.js --china --userconfig=C:\Users\A dministrator\.cnpmrc --disturl=https://npm.taobao.org/mirrors/node --registry=ht tps://registry.npm.taobao.org snappy ``` 新写的代码如下 ``` var http = require('http'); http.createServer(function (request, response) { // 发送 HTTP 头部 // HTTP 状态值: 200 : OK // 内容类型: text/plain response.writeHead(200, {'Content-Type': 'text/plain'}); var kafka = require('kafka-node'), Consumer = kafka.Consumer, //HighLevelConsumer = kafka.HighLevelConsumer, client = new kafka.Client(), consumer = new Consumer( client, payloads = [ { topic:'fltest',partition:0}, { topic:'fltest',partition:1}, { topic:'fltest',partition:2} ], options = { groupId: 'kafka-node-group', autoCommit: false, fetchMaxWaitMs: 100, fetchMinBytes: 1, fetchMaxBytes: 1024 * 1024, fromOffset: false, encoding: 'utf8' } ); //consumer = new HighLevelConsumer( //client, //[ //{topic:'fltest'} //], //{ //groupId: 'kafka-node-group', //autoCommit: false, //fetchMaxWaitMs: 100, //fetchMinBytes: 1, //fetchMaxBytes: 1024 * 1024, //fromOffset: false, //encoding: 'utf8' //} //); consumer.on('message', function (message) { console.log(message); }); consumer.on('error', function (err) { //console.log(err); }); //consumer.on('offsetOutOfRange', function (err) { //console.log(err); //}); consumer.close(function(){}); // 发送响应数据 "Hello World" response.end('Hello World\n'); }).listen(9999); // 终端打印如下信息 console.log('Server running at http://127.0.0.1:9999/'); ``` 现在报错又变成了 ``` E:\node_modules\.0.2.2@node-zookeeper-client\lib\ConnectionManager.js:624 if (!this.socket.write(packet.request.toBuffer())) { ^ TypeError: Cannot read property 'write' of undefined at ConnectionManager.onPacketQueueReadable (E:\node_modules\.0.2.2@node-zook eeper-client\lib\ConnectionManager.js:624:25) at emitNone (events.js:86:13) at PacketQueue.emit (events.js:185:7) at PacketQueue.push (E:\node_modules\.0.2.2@node-zookeeper-client\lib\Packet Queue.js:35:10) at ConnectionManager.queue (E:\node_modules\.0.2.2@node-zookeeper-client\lib \ConnectionManager.js:711:30) at ConnectionManager.close (E:\node_modules\.0.2.2@node-zookeeper-client\lib \ConnectionManager.js:248:10) at Client.close (E:\node_modules\.0.2.2@node-zookeeper-client\index.js:229:2 8) at Zookeeper.close (E:\node_modules\.1.0.7@kafka-node\lib\zookeeper.js:468:1 5) at Client.close (E:\node_modules\.1.0.7@kafka-node\lib\client.js:163:11) at Consumer.close (E:\node_modules\.1.0.7@kafka-node\lib\consumer.js:264:17) ```

用node git clone github中的资源,报这个错,请问下,是什么问题

![图片说明](https://img-ask.csdn.net/upload/201607/14/1468474846_789948.png) 如图

git配置ssh问题,测试被拒绝了

我之前建了一个github号配了ssh,当时应该是配置成功了,后来我把之前的号删了,今天又建了一个github号, 测试了一下以前配的ssh,结果被拒绝了 $ ssh -T git@github.com ssh: connect to host ssh.github.com port 443: Connection refused 我把.ssh文件夹删了,重新配了个ssh,还是上面这样,求各位明白的给看一下T.T

新克隆的项目不能切到和远程分支develop对应的本地分支的问题请教

我从远程克隆了个项目到我本地,本地IDEA打开项目后,想切到和远程对应的某个分支(develop)报错了怎么回事呀? 我在IEEA右下角点击Git选择checkout as a new local branch后报如下错: Couldn't checkout origin/develop: The following untracked working tree files would be removed by checkout![图片说明](https://img-ask.csdn.net/upload/201803/13/1520920034_912680.jpg)

为什么nuxt.js无法安装node-sass?

1.npm 不管怎么样都安装不了 淘宝镜像也没用 2.每次安装后都卡在Downloading binary from https://github.com/sass/node-sass/releases/download/v4.12.0/win32-x64-64这里然后就报错 3.T.T小白求教 ``` PS E:\Users\FuYuHao\Desktop\sb\a\aaa> npm i node-sass > node-sass@4.12.0 install E:\Users\FuYuHao\Desktop\sb\a\aaa\node_modules\node-sass > node scripts/install.js Downloading binary from https://github.com/sass/node-sass/releases/download/v4.12.0/win32-x64-64_binding.node Cannot download "https://github.com/sass/node-sass/releases/download/v4.12.0/win32-x64-64_binding.node": connect ETIMEDOUT 52.216.135.19:443 Timed out whilst downloading the prebuilt binary Hint: If github.com is not accessible in your location try setting a proxy via HTTP_PROXY, e.g. export HTTP_PROXY=http://example.com:1234 or configure npm proxy via npm config set proxy http://example.com:8080 > node-sass@4.12.0 postinstall E:\Users\FuYuHao\Desktop\sb\a\aaa\node_modules\node-sass > node scripts/build.js Building: C:\Program Files\nodejs\node.exe E:\Users\FuYuHao\Desktop\sb\a\aaa\node_modules\node-gyp\bin\node-gyp.js rebuild --verbose --libsass_ext= --libsass_cflags= --libsass_ldflags= --libsass_library= gyp info it worked if it ends with ok gyp verb cli [ 'C:\\Program Files\\nodejs\\node.exe', gyp verb cli 'E:\\Users\\FuYuHao\\Desktop\\sb\\a\\aaa\\node_modules\\node-gyp\\bin\\node-gyp.js', gyp verb cli 'rebuild', gyp verb cli '--verbose', gyp verb cli '--libsass_ext=', gyp verb cli '--libsass_cflags=', gyp verb cli '--libsass_ldflags=', gyp verb cli '--libsass_library=' ] gyp info using node-gyp@3.8.0 gyp info using node@10.14.1 | win32 | x64 gyp verb command rebuild [] gyp verb command clean [] gyp verb clean removing "build" directory gyp verb command configure [] gyp verb check python checking for Python executable "python2" in the PATH gyp verb `which` failed Error: not found: python2 gyp verb `which` failed at getNotFoundError (E:\Users\FuYuHao\Desktop\sb\a\aaa\node_modules\which\which.js:13:12) gyp verb `which` failed at F (E:\Users\FuYuHao\Desktop\sb\a\aaa\node_modules\which\which.js:68:19) gyp verb `which` failed at E (E:\Users\FuYuHao\Desktop\sb\a\aaa\node_modules\which\which.js:80:29) gyp verb `which` failed at E:\Users\FuYuHao\Desktop\sb\a\aaa\node_modules\which\which.js:89:16 gyp verb `which` failed at E:\Users\FuYuHao\Desktop\sb\a\aaa\node_modules\isexe\index.js:42:5 gyp verb `which` failed at E:\Users\FuYuHao\Desktop\sb\a\aaa\node_modules\isexe\windows.js:36:5 gyp verb `which` failed at FSReqWrap.oncomplete (fs.js:154:21) gyp verb `which` failed python2 { Error: not found: python2 gyp verb `which` failed at getNotFoundError (E:\Users\FuYuHao\Desktop\sb\a\aaa\node_modules\which\which.js:13:12) gyp verb `which` failed at F (E:\Users\FuYuHao\Desktop\sb\a\aaa\node_modules\which\which.js:68:19) gyp verb `which` failed at E (E:\Users\FuYuHao\Desktop\sb\a\aaa\node_modules\which\which.js:80:29) gyp verb `which` failed at E:\Users\FuYuHao\Desktop\sb\a\aaa\node_modules\which\which.js:89:16 gyp verb `which` failed at E:\Users\FuYuHao\Desktop\sb\a\aaa\node_modules\isexe\index.js:42:5 gyp verb `which` failed at E:\Users\FuYuHao\Desktop\sb\a\aaa\node_modules\isexe\windows.js:36:5 gyp verb `which` failed at FSReqWrap.oncomplete (fs.js:154:21) gyp verb `which` failed stack: gyp verb `which` failed 'Error: not found: python2\n at getNotFoundError (E:\\Users\\FuYuHao\\Desktop\\sb\\a\\aaa\\node_modules\\which\\which.js:13:12)\n at F (E:\\Users\\FuYuHao\\Desktop\\sb\\a\\aaa\\node_modules\\which\\which.js:68:19)\n at E (E:\\Users\\FuYuHao\\Desktop\\sb\\a\\aaa\\node_modules\\which\\which.js:80:29)\n at E:\\Users\\FuYuHao\\Desktop\\sb\\a\\aaa\\node_modules\\which\\which.js:89:16\n at E:\\Users\\FuYuHao\\Desktop\\sb\\a\\aaa\\node_modules\\isexe\\index.js:42:5\n at E:\\Users\\FuYuHao\\Desktop\\sb\\a\\aaa\\node_modules\\isexe\\windows.js:36:5\n at FSReqWrap.oncomplete (fs.js:154:21)', gyp verb `which` failed code: 'ENOENT' } gyp verb check python checking for Python executable "python" in the PATH gyp verb `which` succeeded python C:\Python27\python.EXE gyp verb check python version `C:\Python27\python.EXE -c "import sys; print "2.7.15 gyp verb check python version .%s.%s" % sys.version_info[:3];"` returned: %j gyp verb get node dir no --target version specified, falling back to host node version: 10.14.1 gyp verb command install [ '10.14.1' ] gyp verb install input version string "10.14.1" gyp verb install installing version: 10.14.1 gyp verb install --ensure was passed, so won't reinstall if already installed gyp verb install version is already installed, need to check "installVersion" gyp verb got "installVersion" 9 gyp verb needs "installVersion" 9 gyp verb install version is good gyp verb get node dir target node version installed: 10.14.1 gyp verb build dir attempting to create "build" dir: E:\Users\FuYuHao\Desktop\sb\a\aaa\node_modules\node-sass\build gyp verb build dir "build" dir needed to be created? E:\Users\FuYuHao\Desktop\sb\a\aaa\node_modules\node-sass\build gyp verb find vs2017 Found installation at: C:\Program Files (x86)\Microsoft Visual Studio\2017\BuildTools gyp verb find vs2017 - Found Microsoft.VisualStudio.Component.Windows10SDK.17763 gyp verb find vs2017 - Found Microsoft.VisualStudio.Component.VC.Tools.x86.x64 gyp verb find vs2017 - Found Microsoft.VisualStudio.VC.MSBuild.Base gyp verb find vs2017 - Using this installation with Windows 10 SDK gyp verb find vs2017 using installation: C:\Program Files (x86)\Microsoft Visual Studio\2017\BuildTools gyp verb build/config.gypi creating config file gyp verb build/config.gypi writing out config file: E:\Users\FuYuHao\Desktop\sb\a\aaa\node_modules\node-sass\build\config.gypi gyp verb config.gypi checking for gypi file: E:\Users\FuYuHao\Desktop\sb\a\aaa\node_modules\node-sass\config.gypi gyp verb common.gypi checking for gypi file: E:\Users\FuYuHao\Desktop\sb\a\aaa\node_modules\node-sass\common.gypi gyp verb gyp gyp format was not specified; forcing "msvs" gyp info spawn C:\Python27\python.EXE gyp info spawn args [ 'E:\\Users\\FuYuHao\\Desktop\\sb\\a\\aaa\\node_modules\\node-gyp\\gyp\\gyp_main.py', gyp info spawn args 'binding.gyp', gyp info spawn args '-f', gyp info spawn args 'msvs', gyp info spawn args '-G', gyp info spawn args 'msvs_version=2015', gyp info spawn args '-I', gyp info spawn args 'E:\\Users\\FuYuHao\\Desktop\\sb\\a\\aaa\\node_modules\\node-sass\\build\\config.gypi', gyp info spawn args '-I', gyp info spawn args 'E:\\Users\\FuYuHao\\Desktop\\sb\\a\\aaa\\node_modules\\node-gyp\\addon.gypi', gyp info spawn args '-I', gyp info spawn args 'C:\\Users\\FuYuHao\\.node-gyp\\10.14.1\\include\\node\\common.gypi', gyp info spawn args '-Dlibrary=shared_library', gyp info spawn args '-Dvisibility=default', gyp info spawn args '-Dnode_root_dir=C:\\Users\\FuYuHao\\.node-gyp\\10.14.1', gyp info spawn args '-Dnode_gyp_dir=E:\\Users\\FuYuHao\\Desktop\\sb\\a\\aaa\\node_modules\\node-gyp', gyp info spawn args '-Dnode_lib_file=C:\\Users\\FuYuHao\\.node-gyp\\10.14.1\\<(target_arch)\\node.lib', gyp info spawn args '-Dmodule_root_dir=E:\\Users\\FuYuHao\\Desktop\\sb\\a\\aaa\\node_modules\\node-sass', gyp info spawn args '-Dnode_engine=v8', gyp info spawn args '--depth=.', gyp info spawn args '--no-parallel', gyp info spawn args '--generator-output', gyp info spawn args 'E:\\Users\\FuYuHao\\Desktop\\sb\\a\\aaa\\node_modules\\node-sass\\build', gyp info spawn args '-Goutput_dir=.' ] gyp verb command build [] gyp verb build type Release gyp verb architecture x64 gyp verb node dev dir C:\Users\FuYuHao\.node-gyp\10.14.1 gyp verb found first Solution file build/binding.sln gyp verb using MSBuild: C:\Program Files (x86)\Microsoft Visual Studio\2017\BuildTools\MSBuild\15.0\Bin\MSBuild.exe gyp info spawn C:\Program Files (x86)\Microsoft Visual Studio\2017\BuildTools\MSBuild\15.0\Bin\MSBuild.exe gyp info spawn args [ 'build/binding.sln', gyp info spawn args '/nologo', gyp info spawn args '/p:Configuration=Release;Platform=x64' ] 在此解决方案中一次生成一个项目。若要启用并行生成,请添加“/m”开关。 生成启动时间为 2019/5/29 22:01:12。 节点 1 上的项目“E:\Users\FuYuHao\Desktop\sb\a\aaa\node_modules\node-sass\build\binding.sln”(默认目标)。 ValidateSolutionConfiguration: 正在生成解决方案配置“Release|x64”。 项目“E:\Users\FuYuHao\Desktop\sb\a\aaa\node_modules\node-sass\build\binding.sln”(1)正在节点 1 上生成“E:\Users\FuYuHao\Desktop\sb\a\aaa\node_modules\node-sass\build\binding.vcxproj.metaproj”(2) (默认目标)。 项目“E:\Users\FuYuHao\Desktop\sb\a\aaa\node_modules\node-sass\build\binding.vcxproj.metaproj”(2)正在节点 1 上生成“E:\Users\FuYuHao\Desktop\sb\a\aaa\node_modules\node-sass\build\src\libsass.vcxproj”(3) (默认目标)。 PrepareForBuild: 正在创建目录“Release\obj\libsass\”。 正在创建目录“E:\Users\FuYuHao\Desktop\sb\a\aaa\node_modules\node-sass\build\Release\”。 正在创建目录“Release\obj\libsass\libsass.tlog\”。 InitializeBuildStatus: 正在创建“Release\obj\libsass\libsass.tlog\unsuccessfulbuild”,因为已指定“AlwaysCreate”。 ClCompile: C:\Program Files (x86)\Microsoft Visual Studio\2017\BuildTools\VC\Tools\MSVC\14.16.27023\bin\HostX64\x64\CL.exe /c /I"C:\Users\FuYuHao\.node-gyp\10.14.1\include\node" /I"C:\Users\FuYuHao\.node-gyp\10.14.1\src" /I"C:\Use rs\FuYuHao\.node-gyp\10.14.1\deps\openssl\config" /I"C:\Users\FuYuHao\.node-gyp\10.14.1\deps\openssl\openssl\include" /I"C:\Users\FuYuHao\.node-gyp\10.14.1\deps\uv\include" /I"C:\Users\FuYuHao\.node-gyp\10.14.1\deps\zli b" /I"C:\Users\FuYuHao\.node-gyp\10.14.1\deps\v8\include" /I..\..\src\libsass\include /Z7 /nologo /W3 /WX- /diagnostics:classic /MP /Ox /Ob2 /Oi /Ot /Oy /GL /D NODE_GYP_MODULE_NAME=libsass /D USING_UV_SHARED=1 /D USING_ V8_SHARED=1 /D V8_DEPRECATION_WARNINGS=1 /D WIN32 /D _CRT_SECURE_NO_DEPRECATE /D _CRT_NONSTDC_NO_DEPRECATE /D _HAS_EXCEPTIONS=0 /D "LIBSASS_VERSION=\"3.5.4\"" /GF /Gm- /MT /GS /Gy /fp:precise /Zc:wchar_t /Zc:forScope /Z c:inline /GR- /Fo"Release\obj\libsass\\" /Fd"Release\obj\libsass\libsass.pdb" /Gd /TP /wd4351 /wd4355 /wd4800 /wd4251 /wd4275 /wd4244 /wd4267 /FC /errorReport:queue /GR /EHsc ..\..\src\libsass\src\ast.cpp ..\..\src\libs ass\src\ast_fwd_decl.cpp ..\..\src\libsass\src\backtrace.cpp ..\..\src\libsass\src\base64vlq.cpp ..\..\src\libsass\src\bind.cpp ..\..\src\libsass\src\check_nesting.cpp ..\..\src\libsass\src\color_maps.cpp ..\..\src\libs ass\src\constants.cpp ..\..\src\libsass\src\context.cpp ..\..\src\libsass\src\cssize.cpp ..\..\src\libsass\src\emitter.cpp ..\..\src\libsass\src\environment.cpp ..\..\src\libsass\src\error_handling.cpp ..\..\src\libsass \src\eval.cpp ..\..\src\libsass\src\expand.cpp ..\..\src\libsass\src\extend.cpp ..\..\src\libsass\src\file.cpp ..\..\src\libsass\src\functions.cpp ..\..\src\libsass\src\inspect.cpp ..\..\src\libsass\src\json.cpp ..\..\s rc\libsass\src\lexer.cpp ..\..\src\libsass\src\listize.cpp ..\..\src\libsass\src\memory\SharedPtr.cpp ..\..\src\libsass\src\node.cpp ..\..\src\libsass\src\operators.cpp ..\..\src\libsass\src\output.cpp ..\..\src\libsass \src\parser.cpp ..\..\src\libsass\src\plugins.cpp ..\..\src\libsass\src\position.cpp ..\..\src\libsass\src\prelexer.cpp ..\..\src\libsass\src\remove_placeholders.cpp ..\..\src\libsass\src\sass.cpp ..\..\src\libsass\src\ sass2scss.cpp ..\..\src\libsass\src\sass_context.cpp ..\..\src\libsass\src\sass_functions.cpp ..\..\src\libsass\src\sass_util.cpp ..\..\src\libsass\src\sass_values.cpp ..\..\src\libsass\src\source_map.cpp ..\..\src\libs ass\src\subset_map.cpp ..\..\src\libsass\src\to_c.cpp ..\..\src\libsass\src\to_value.cpp ..\..\src\libsass\src\units.cpp ..\..\src\libsass\src\utf8_string.cpp ..\..\src\libsass\src\util.cpp ..\..\src\libsass\src\values. cpp cl : 命令行 warning D9025: 正在重写“/GR-”(用“/GR”) [E:\Users\FuYuHao\Desktop\sb\a\aaa\node_modules\node-sass\build\src\libsass.vcxproj] cl : 命令行 warning D9025: 正在重写“/GR-”(用“/GR”) [E:\Users\FuYuHao\Desktop\sb\a\aaa\node_modules\node-sass\build\src\libsass.vcxproj] ast.cpp cl : 命令行 warning D9025: 正在重写“/GR-”(用“/GR”) [E:\Users\FuYuHao\Desktop\sb\a\aaa\node_modules\node-sass\build\src\libsass.vcxproj] ast_fwd_decl.cpp cl : 命令行 warning D9025: 正在重写“/GR-”(用“/GR”) [E:\Users\FuYuHao\Desktop\sb\a\aaa\node_modules\node-sass\build\src\libsass.vcxproj] backtrace.cpp cl : 命令行 warning D9025: 正在重写“/GR-”(用“/GR”) [E:\Users\FuYuHao\Desktop\sb\a\aaa\node_modules\node-sass\build\src\libsass.vcxproj] base64vlq.cpp bind.cpp check_nesting.cpp color_maps.cpp constants.cpp context.cpp cssize.cpp emitter.cpp environment.cpp error_handling.cpp eval.cpp expand.cpp extend.cpp file.cpp functions.cpp inspect.cpp json.cpp e:\users\fuyuhao\desktop\sb\a\aaa\node_modules\node-sass\src\libsass\src\json.cpp(26): warning C4005: “_CRT_NONSTDC_NO_DEPRECATE”: 宏重定义 [E:\Users\FuYuHao\Desktop\sb\a\aaa\node_modules\node-sass\build\src\libsass.vcxp roj] e:\users\fuyuhao\desktop\sb\a\aaa\node_modules\node-sass\src\libsass\src\json.cpp: note: 参见“_CRT_NONSTDC_NO_DEPRECATE”的前一个定义 lexer.cpp listize.cpp SharedPtr.cpp node.cpp operators.cpp output.cpp parser.cpp plugins.cpp position.cpp prelexer.cpp remove_placeholders.cpp sass.cpp sass2scss.cpp e:\users\fuyuhao\desktop\sb\a\aaa\node_modules\node-sass\src\libsass\src\sass2scss.cpp(9): warning C4005: “_CRT_NONSTDC_NO_DEPRECATE”: 宏重定义 [E:\Users\FuYuHao\Desktop\sb\a\aaa\node_modules\node-sass\build\src\libsass. vcxpr oj] e:\users\fuyuhao\desktop\sb\a\aaa\node_modules\node-sass\src\libsass\src\sass2scss.cpp: note: 参见“_CRT_NONSTDC_NO_DEPRECATE”的前一个定义 sass_context.cpp sass_functions.cpp sass_util.cpp sass_values.cpp source_map.cpp subset_map.cpp to_c.cpp to_value.cpp units.cpp utf8_string.cpp util.cpp values.cpp C:\Program Files (x86)\Microsoft Visual Studio\2017\BuildTools\VC\Tools\MSVC\14.16.27023\bin\HostX64\x64\CL.exe /c /I"C:\Users\FuYuHao\.node-gyp\10.14.1\include\node" /I"C:\Users\FuYuHao\.node-gyp\10.14.1\src" /I"C:\Use rs\FuYuHao\.node-gyp\10.14.1\deps\openssl\config" /I"C:\Users\FuYuHao\.node-gyp\10.14.1\deps\openssl\openssl\include" /I"C:\Users\FuYuHao\.node-gyp\10.14.1\deps\uv\include" /I"C:\Users\FuYuHao\.node-gyp\10.14.1\deps\zli b" /I"C:\Users\FuYuHao\.node-gyp\10.14.1\deps\v8\include" /I..\..\src\libsass\include /Z7 /nologo /W3 /WX- /diagnostics:classic /MP /Ox /Ob2 /Oi /Ot /Oy /GL /D NODE_GYP_MODULE_NAME=libsass /D USING_UV_SHARED=1 /D USING_ V8_SHARED=1 /D V8_DEPRECATION_WARNINGS=1 /D WIN32 /D _CRT_SECURE_NO_DEPRECATE /D _CRT_NONSTDC_NO_DEPRECATE /D _HAS_EXCEPTIONS=0 /D "LIBSASS_VERSION=\"3.5.4\"" /GF /Gm- /MT /GS /Gy /fp:precise /Zc:wchar_t /Zc:forScope /Z c:inline /GR- /Fo"Release\obj\libsass\\" /Fd"Release\obj\libsass\libsass.pdb" /Gd /TC /wd4351 /wd4355 /wd4800 /wd4251 /wd4275 /wd4244 /wd4267 /FC /errorReport:queue /GR /EHsc ..\..\src\libsass\src\cencode.c cl : 命令行 warning D9025: 正在重写“/GR-”(用“/GR”) [E:\Users\FuYuHao\Desktop\sb\a\aaa\node_modules\node-sass\build\src\libsass.vcxproj] cencode.c Lib: C:\Program Files (x86)\Microsoft Visual Studio\2017\BuildTools\VC\Tools\MSVC\14.16.27023\bin\HostX64\x64\Lib.exe /OUT:"E:\Users\FuYuHao\Desktop\sb\a\aaa\node_modules\node-sass\build\Release\libsass.lib" /NOLOGO /MACHINE :X64 /LTCG:INCREMENTAL Release\obj\libsass\ast.obj Release\obj\libsass\ast_fwd_decl.obj Release\obj\libsass\backtrace.obj Release\obj\libsass\base64vlq.obj Release\obj\libsass\bind.obj Release\obj\libsass\cencode.obj Release\obj\libsass\check_nesting.obj Release\obj\libsass\color_maps.obj Release\obj\libsass\constants.obj Release\obj\libsass\context.obj Release\obj\libsass\cssize.obj Release\obj\libsass\emitter.obj Release\obj\libsass\environment.obj Release\obj\libsass\error_handling.obj Release\obj\libsass\eval.obj Release\obj\libsass\expand.obj Release\obj\libsass\extend.obj Release\obj\libsass\file.obj Release\obj\libsass\functions.obj Release\obj\libsass\inspect.obj Release\obj\libsass\json.obj Release\obj\libsass\lexer.obj Release\obj\libsass\listize.obj Release\obj\libsass\SharedPtr.obj Release\obj\libsass\node.obj Release\obj\libsass\operators.obj Release\obj\libsass\output.obj Release\obj\libsass\parser.obj Release\obj\libsass\plugins.obj Release\obj\libsass\position.obj Release\obj\libsass\prelexer.obj Release\obj\libsass\remove_placeholders.obj Release\obj\libsass\sass.obj Release\obj\libsass\sass2scss.obj Release\obj\libsass\sass_context.obj Release\obj\libsass\sass_functions.obj Release\obj\libsass\sass_util.obj Release\obj\libsass\sass_values.obj Release\obj\libsass\source_map.obj Release\obj\libsass\subset_map.obj Release\obj\libsass\to_c.obj Release\obj\libsass\to_value.obj Release\obj\libsass\units.obj Release\obj\libsass\utf8_string.obj Release\obj\libsass\util.obj Release\obj\libsass\values.obj libsass.vcxproj -> E:\Users\FuYuHao\Desktop\sb\a\aaa\node_modules\node-sass\build\Release\\libsass.lib FinalizeBuildStatus: 正在删除文件“Release\obj\libsass\libsass.tlog\unsuccessfulbuild”。 正在对“Release\obj\libsass\libsass.tlog\libsass.lastbuildstate”执行 Touch 任务。 已完成生成项目“E:\Users\FuYuHao\Desktop\sb\a\aaa\node_modules\node-sass\build\src\libsass.vcxproj”(默认目标)的操作。 项目“E:\Users\FuYuHao\Desktop\sb\a\aaa\node_modules\node-sass\build\binding.vcxproj.metaproj”(2)正在节点 1 上生成“E:\Users\FuYuHao\Desktop\sb\a\aaa\node_modules\node-sass\build\binding.vcxproj”(4) (默认目标)。 PrepareForBuild: 正在创建目录“Release\obj\binding\”。 正在创建目录“Release\obj\binding\binding.tlog\”。 InitializeBuildStatus: 正在创建“Release\obj\binding\binding.tlog\unsuccessfulbuild”,因为已指定“AlwaysCreate”。 ClCompile: C:\Program Files (x86)\Microsoft Visual Studio\2017\BuildTools\VC\Tools\MSVC\14.16.27023\bin\HostX64\x64\CL.exe /c /I"C:\Users\FuYuHao\.node-gyp\10.14.1\include\node" /I"C:\Users\FuYuHao\.node-gyp\10.14.1\src" /I"C:\Use rs\FuYuHao\.node-gyp\10.14.1\deps\openssl\config" /I"C:\Users\FuYuHao\.node-gyp\10.14.1\deps\openssl\openssl\include" /I"C:\Users\FuYuHao\.node-gyp\10.14.1\deps\uv\include" /I"C:\Users\FuYuHao\.node-gyp\10.14.1\deps\zli b" /I"C:\Users\FuYuHao\.node-gyp\10.14.1\deps\v8\include" /I..\..\nan /I..\src\libsass\include /Z7 /nologo /W3 /WX- /diagnostics:classic /MP /Ox /Ob2 /Oi /Ot /Oy /GL /D NODE_GYP_MODULE_NAME=binding /D USING_UV_SHARED=1 /D USING_V8_SHARED=1 /D V8_DEPRECATION_WARNINGS=1 /D WIN32 /D _CRT_SECURE_NO_DEPRECATE /D _CRT_NONSTDC_NO_DEPRECATE /D _HAS_EXCEPTIONS=0 /D BUILDING_NODE_EXTENSION /D _WINDLL /GF /Gm- /MT /GS /Gy /fp:precise /Zc:wchar_t /Zc:forScope /Zc:inline /GR- /Fo"Release\obj\binding\\" /Fd"Release\obj\binding\vc141.pdb" /Gd /TP /wd4351 /wd4355 /wd4800 /wd4251 /wd4275 /wd4244 /wd4267 /FC /errorReport:queue /Zc:threadSafeInit- ..\src\binding.cpp . .\src\create_string.cpp ..\src\custom_function_bridge.cpp ..\src\custom_importer_bridge.cpp ..\src\sass_context_wrapper.cpp ..\src\sass_types\boolean.cpp ..\src\sass_types\color.cpp ..\src\sass_types\error.cpp ..\src\sa ss_types\factory.cpp ..\src\sass_types\list.cpp ..\src\sass_types\map.cpp ..\src\sass_types\null.cpp ..\src\sass_types\number.cpp ..\src\sass_types\string.cpp "E:\Users\FuYuHao\Desktop\sb\a\aaa\node_modules\node-gyp\src \win_delay_load_hook.cc" binding.cpp create_string.cpp custom_function_bridge.cpp custom_importer_bridge.cpp sass_context_wrapper.cpp boolean.cpp color.cpp error.cpp factory.cpp list.cpp map.cpp null.cpp number.cpp string.cpp win_delay_load_hook.cc Link: C:\Program Files (x86)\Microsoft Visual Studio\2017\BuildTools\VC\Tools\MSVC\14.16.27023\bin\HostX64\x64\link.exe /ERRORREPORT:QUEUE /OUT:"E:\Users\FuYuHao\Desktop\sb\a\aaa\node_modules\node-sass\build\Release\binding.n ode" /INCREMENTAL:NO /NOLOGO kernel32.lib user32.lib gdi32.lib winspool.lib comdlg32.lib advapi32.lib shell32.lib ole32.lib oleaut32.lib uuid.lib odbc32.lib DelayImp.lib "C:\Users\FuYuHao\.node-gyp\10.14.1\x64\node.lib" Delayimp.lib /DELAYLOAD:iojs.exe /DELAYLOAD:node.exe /MANIFEST /MANIFESTUAC:"level='asInvoker' uiAccess='false'" /manifest:embed /DEBUG /PDB:"E:\Users\FuYuHao\Desktop\sb\a\aaa\node_modules\node-sass\build\Release\bindi ng.pdb" /MAP /MAPINFO:EXPORTS /OPT:REF /OPT:ICF /TLBID:1 /RELEASE /DYNAMICBASE /NXCOMPAT /MACHINE:X64 /ignore:4199 /LTCG:INCREMENTAL /DLL Release\obj\binding\binding.obj Release\obj\binding\create_string.obj Release\obj\binding\custom_function_bridge.obj Release\obj\binding\custom_importer_bridge.obj Release\obj\binding\sass_context_wrapper.obj Release\obj\binding\boolean.obj Release\obj\binding\color.obj Release\obj\binding\error.obj Release\obj\binding\factory.obj Release\obj\binding\list.obj Release\obj\binding\map.obj Release\obj\binding\null.obj Release\obj\binding\number.obj Release\obj\binding\string.obj Release\obj\binding\win_delay_load_hook.obj "E:\Users\FuYuHao\Desktop\sb\a\aaa\node_modules\node-sass\build\Release\libsass.lib" C:\Users\FuYuHao\.node-gyp\10.14.1\x64\node.lib : fatal error LNK1107: 文件无效或损坏: 无法在 0x39F993 处读取 [E:\Users\FuYuHao\Desktop\sb\a\aaa\node_modules\node-sass\build\binding.vcxproj] 已完成生成项目“E:\Users\FuYuHao\Desktop\sb\a\aaa\node_modules\node-sass\build\binding.vcxproj”(默认目标)的操作 - 失败。 已完成生成项目“E:\Users\FuYuHao\Desktop\sb\a\aaa\node_modules\node-sass\build\binding.vcxproj.metaproj”(默认目标)的操作 - 失败。 已完成生成项目“E:\Users\FuYuHao\Desktop\sb\a\aaa\node_modules\node-sass\build\binding.sln”(默认目标)的操作 - 失败。 生成失败。 “E:\Users\FuYuHao\Desktop\sb\a\aaa\node_modules\node-sass\build\binding.sln”(默认目标) (1) -> “E:\Users\FuYuHao\Desktop\sb\a\aaa\node_modules\node-sass\build\binding.vcxproj.metaproj”(默认目标) (2) -> “E:\Users\FuYuHao\Desktop\sb\a\aaa\node_modules\node-sass\build\src\libsass.vcxproj”(默认目标) (3) -> (ClCompile 目标) -> cl : 命令行 warning D9025: 正在重写“/GR-”(用“/GR”) [E:\Users\FuYuHao\Desktop\sb\a\aaa\node_modules\node-sass\build\src\libsass.vcxproj] cl : 命令行 warning D9025: 正在重写“/GR-”(用“/GR”) [E:\Users\FuYuHao\Desktop\sb\a\aaa\node_modules\node-sass\build\src\libsass.vcxproj] cl : 命令行 warning D9025: 正在重写“/GR-”(用“/GR”) [E:\Users\FuYuHao\Desktop\sb\a\aaa\node_modules\node-sass\build\src\libsass.vcxproj] cl : 命令行 warning D9025: 正在重写“/GR-”(用“/GR”) [E:\Users\FuYuHao\Desktop\sb\a\aaa\node_modules\node-sass\build\src\libsass.vcxproj] cl : 命令行 warning D9025: 正在重写“/GR-”(用“/GR”) [E:\Users\FuYuHao\Desktop\sb\a\aaa\node_modules\node-sass\build\src\libsass.vcxproj] e:\users\fuyuhao\desktop\sb\a\aaa\node_modules\node-sass\src\libsass\src\json.cpp(26): warning C4005: “_CRT_NONSTDC_NO_DEPRECATE”: 宏重定义 [E:\Users\FuYuHao\Desktop\sb\a\aaa\node_modules\node-sass\build\src\libsass.vc xproj ] e:\users\fuyuhao\desktop\sb\a\aaa\node_modules\node-sass\src\libsass\src\sass2scss.cpp(9): warning C4005: “_CRT_NONSTDC_NO_DEPRECATE”: 宏重定义 [E:\Users\FuYuHao\Desktop\sb\a\aaa\node_modules\node-sass\build\src\libsas s.vcx proj] “E:\Users\FuYuHao\Desktop\sb\a\aaa\node_modules\node-sass\build\binding.sln”(默认目标) (1) -> “E:\Users\FuYuHao\Desktop\sb\a\aaa\node_modules\node-sass\build\binding.vcxproj.metaproj”(默认目标) (2) -> “E:\Users\FuYuHao\Desktop\sb\a\aaa\node_modules\node-sass\build\src\libsass.vcxproj”(默认目标) (3) -> cl : 命令行 warning D9025: 正在重写“/GR-”(用“/GR”) [E:\Users\FuYuHao\Desktop\sb\a\aaa\node_modules\node-sass\build\src\libsass.vcxproj] “E:\Users\FuYuHao\Desktop\sb\a\aaa\node_modules\node-sass\build\binding.sln”(默认目标) (1) -> “E:\Users\FuYuHao\Desktop\sb\a\aaa\node_modules\node-sass\build\binding.vcxproj.metaproj”(默认目标) (2) -> “E:\Users\FuYuHao\Desktop\sb\a\aaa\node_modules\node-sass\build\binding.vcxproj”(默认目标) (4) -> (Link 目标) -> C:\Users\FuYuHao\.node-gyp\10.14.1\x64\node.lib : fatal error LNK1107: 文件无效或损坏: 无法在 0x39F993 处读取 [E:\Users\FuYuHao\Desktop\sb\a\aaa\node_modules\node-sass\build\binding.vcxproj] 8 个警告 1 个错误 已用时间 00:00:24.13 gyp ERR! build error gyp ERR! stack Error: `C:\Program Files (x86)\Microsoft Visual Studio\2017\BuildTools\MSBuild\15.0\Bin\MSBuild.exe` failed with exit code: 1 gyp ERR! stack at ChildProcess.onExit (E:\Users\FuYuHao\Desktop\sb\a\aaa\node_modules\node-gyp\lib\build.js:262:23) gyp ERR! stack at ChildProcess.emit (events.js:182:13) gyp ERR! stack at Process.ChildProcess._handle.onexit (internal/child_process.js:240:12) gyp ERR! System Windows_NT 10.0.17763 gyp ERR! command "C:\\Program Files\\nodejs\\node.exe" "E:\\Users\\FuYuHao\\Desktop\\sb\\a\\aaa\\node_modules\\node-gyp\\bin\\node-gyp.js" "rebuild" "--verbose" "--libsass_ext=" "--libsass_cflags=" "--libsass_ldflags=" "--libsass_library=" gyp ERR! cwd E:\Users\FuYuHao\Desktop\sb\a\aaa\node_modules\node-sass gyp ERR! node -v v10.14.1 gyp ERR! node-gyp -v v3.8.0 gyp ERR! not ok Build failed with error code: 1 npm WARN optional SKIPPING OPTIONAL DEPENDENCY: fsevents@2.0.7 (node_modules\fsevents): npm WARN notsup SKIPPING OPTIONAL DEPENDENCY: Unsupported platform for fsevents@2.0.7: wanted {"os":"darwin","arch":"any"} (current: {"os":"win32","arch":"x64"}) npm WARN optional SKIPPING OPTIONAL DEPENDENCY: fsevents@1.2.9 (node_modules\watchpack\node_modules\fsevents): npm WARN notsup SKIPPING OPTIONAL DEPENDENCY: Unsupported platform for fsevents@1.2.9: wanted {"os":"darwin","arch":"any"} (current: {"os":"win32","arch":"x64"}) npm WARN optional SKIPPING OPTIONAL DEPENDENCY: fsevents@1.2.9 (node_modules\nodemon\node_modules\fsevents): npm WARN notsup SKIPPING OPTIONAL DEPENDENCY: Unsupported platform for fsevents@1.2.9: wanted {"os":"darwin","arch":"any"} (current: {"os":"win32","arch":"x64"}) npm ERR! code ELIFECYCLE npm ERR! errno 1 npm ERR! node-sass@4.12.0 postinstall: `node scripts/build.js` npm ERR! Exit status 1 npm ERR! npm ERR! Failed at the node-sass@4.12.0 postinstall script. npm ERR! This is probably not a problem with npm. There is likely additional logging output above. npm ERR! A complete log of this run can be found in: npm ERR! C:\Users\FuYuHao\AppData\Roaming\npm-cache\_logs\2019-05-29T14_01_39_903Z-debug.log PS E:\Users\FuYuHao\Desktop\sb\a\aaa> ```

程序员的兼职技能课

获取讲师答疑方式: 在付费视频第一节(触摸命令_ALL)片头有二维码及加群流程介绍 限时福利 原价99元,今日仅需39元!购课添加小助手(微信号:csdn590)按提示还可领取价值800元的编程大礼包! 讲师介绍: 苏奕嘉&nbsp;前阿里UC项目工程师 脚本开发平台官方认证满级(六级)开发者。 我将如何教会你通过【定制脚本】赚到你人生的第一桶金? 零基础程序定制脚本开发课程,是完全针对零脚本开发经验的小白而设计,课程内容共分为3大阶段: ①前期将带你掌握Q开发语言和界面交互开发能力; ②中期通过实战来制作有具体需求的定制脚本; ③后期将解锁脚本的更高阶玩法,打通任督二脉; ④应用定制脚本合法赚取额外收入的完整经验分享,带你通过程序定制脚本开发这项副业,赚取到你的第一桶金!

Windows版YOLOv4目标检测实战:训练自己的数据集

课程演示环境:Windows10; cuda 10.2; cudnn7.6.5; Python3.7; VisualStudio2019; OpenCV3.4 需要学习ubuntu系统上YOLOv4的同学请前往:《YOLOv4目标检测实战:训练自己的数据集》 课程链接:https://edu.csdn.net/course/detail/28745 YOLOv4来了!速度和精度双提升! 与 YOLOv3 相比,新版本的 AP (精度)和 FPS (每秒帧率)分别提高了 10% 和 12%。 YOLO系列是基于深度学习的端到端实时目标检测方法。本课程将手把手地教大家使用labelImg标注和使用YOLOv4训练自己的数据集。课程实战分为两个项目:单目标检测(足球目标检测)和多目标检测(足球和梅西同时检测)。 本课程的YOLOv4使用AlexyAB/darknet,在Windows系统上做项目演示。包括:安装软件环境、安装YOLOv4、标注自己的数据集、整理自己的数据集、修改配置文件、训练自己的数据集、测试训练出的网络模型、性能统计(mAP计算)和先验框聚类分析。还将介绍改善YOLOv4目标检测性能的技巧。 除本课程《Windows版YOLOv4目标检测实战:训练自己的数据集》外,本人将推出有关YOLOv4目标检测的系列课程。请持续关注该系列的其它视频课程,包括: 《Windows版YOLOv4目标检测实战:人脸口罩佩戴检测》 《Windows版YOLOv4目标检测实战:中国交通标志识别》 《Windows版YOLOv4目标检测:原理与源码解析》

lena全身原图(非256*256版本,而是全身原图)

lena全身原图(非256*256版本,而是全身原图) lena原图很有意思,我们通常所用的256*256图片是在lena原图上截取了头部部分的256*256正方形得到的. 原图是花花公子杂志上的一个

快速入门Android开发 视频 教程 android studio

这是一门快速入门Android开发课程,顾名思义是让大家能快速入门Android开发。 学完能让你学会如下知识点: Android的发展历程 搭建Java开发环境 搭建Android开发环境 Android Studio基础使用方法 Android Studio创建项目 项目运行到模拟器 项目运行到真实手机 Android中常用控件 排查开发中的错误 Android中请求网络 常用Android开发命令 快速入门Gradle构建系统 项目实战:看美图 常用Android Studio使用技巧 项目签名打包 如何上架市场

Java调用微信支付

Java 使用微信支付 一. 准备工作 1.

汽车租赁管理系统需求分析规格说明书

汽车租赁管理系统需求分析规格说明书,这只是一个模板,如果有不会的可以借鉴一下,还是蛮详细的。。。。

C/C++跨平台研发从基础到高阶实战系列套餐

一 专题从基础的C语言核心到c++ 和stl完成基础强化; 二 再到数据结构,设计模式完成专业计算机技能强化; 三 通过跨平台网络编程,linux编程,qt界面编程,mfc编程,windows编程,c++与lua联合编程来完成应用强化 四 最后通过基于ffmpeg的音视频播放器,直播推流,屏幕录像,

程序员的算法通关课:知己知彼(第一季)

【超实用课程内容】 程序员对于算法一直又爱又恨!特别是在求职面试时,算法类问题绝对是不可逃避的提问点!本门课程作为算法面试系列的第一季,会从“知己知彼”的角度,聊聊关于算法面试的那些事~ 【哪些人适合学习这门课程?】 求职中的开发者,对于面试算法阶段缺少经验 想了解实际工作中算法相关知识 在职程序员,算法基础薄弱,急需充电 【超人气讲师】 孙秀洋&nbsp;| 服务器端工程师 硕士毕业于哈工大计算机科学与技术专业,ACM亚洲区赛铜奖获得者,先后在腾讯和百度从事一线技术研发,对算法和后端技术有深刻见解。 【课程如何观看?】 PC端:https://edu.csdn.net/course/detail/27272 移动端:CSDN 学院APP(注意不是CSDN APP哦) 本课程为录播课,课程无限观看时长,但是大家可以抓紧时间学习后一起讨论哦~

机器学习初学者必会的案例精讲

通过六个实际的编码项目,带领同学入门人工智能。这些项目涉及机器学习(回归,分类,聚类),深度学习(神经网络),底层数学算法,Weka数据挖掘,利用Git开源项目实战等。

Python入门视频精讲

Python入门视频培训课程以通俗易懂的方式讲解Python核心技术,Python基础,Python入门。适合初学者的教程,让你少走弯路! 课程内容包括:1.Python简介和安装 、2.第一个Python程序、PyCharm的使用 、3.Python基础、4.函数、5.高级特性、6.面向对象、7.模块、8.异常处理和IO操作、9.访问数据库MySQL。教学全程采用笔记+代码案例的形式讲解,通俗易懂!!!

我以为我对Mysql事务很熟,直到我遇到了阿里面试官

太惨了,面试又被吊打

深度学习原理+项目实战+算法详解+主流框架(套餐)

深度学习系列课程从深度学习基础知识点开始讲解一步步进入神经网络的世界再到卷积和递归神经网络,详解各大经典网络架构。实战部分选择当下最火爆深度学习框架PyTorch与Tensorflow/Keras,全程实战演示框架核心使用与建模方法。项目实战部分选择计算机视觉与自然语言处理领域经典项目,从零开始详解算法原理,debug模式逐行代码解读。适合准备就业和转行的同学们加入学习! 建议按照下列课程顺序来进行学习 (1)掌握深度学习必备经典网络架构 (2)深度框架实战方法 (3)计算机视觉与自然语言处理项目实战。(按照课程排列顺序即可)

Java62数据提取代码

利用苹果手机微信下面的wx.data文件提取出62数据,通过62可以实现不同设备直接登陆,可以通过文件流的方式用脚本上传到服务器进行解析

Python代码实现飞机大战

文章目录经典飞机大战一.游戏设定二.我方飞机三.敌方飞机四.发射子弹五.发放补给包六.主模块 经典飞机大战 源代码以及素材资料(图片,音频)可从下面的github中下载: 飞机大战源代码以及素材资料github项目地址链接 ————————————————————————————————————————————————————————— 不知道大家有没有打过飞机,喜不喜欢打飞机。当我第一次接触这个东西的时候,我的内心是被震撼到的。第一次接触打飞机的时候作者本人是身心愉悦的,因为周边的朋友都在打飞机, 每

2018年全国大学生计算机技能应用大赛决赛 大题

2018年全国大学生计算机技能应用大赛决赛大题,程序填空和程序设计(侵删)

Lena图像处理测试专业用图,高清完整全身原图

Lena图像处理测试专业用图,高清完整全身原图,该图片很好的包含了平坦区域、阴影和纹理等细节,这些都有益于测试各种不同的图像处理算法。它是一幅很好的测试照片!其次,由于这是一个非常有魅力女人的照片。

MySQL数据库面试题(2020最新版)

文章目录数据库基础知识为什么要使用数据库什么是SQL?什么是MySQL?数据库三大范式是什么mysql有关权限的表都有哪几个MySQL的binlog有有几种录入格式?分别有什么区别?数据类型mysql有哪些数据类型引擎MySQL存储引擎MyISAM与InnoDB区别MyISAM索引与InnoDB索引的区别?InnoDB引擎的4大特性存储引擎选择索引什么是索引?索引有哪些优缺点?索引使用场景(重点)...

verilog实现地铁系统售票

使用 verilog 实现地铁售票

Python+OpenCV计算机视觉

Python+OpenCV计算机视觉系统全面的介绍。

Python可以这样学(第四季:数据分析与科学计算可视化)

董付国老师系列教材《Python程序设计(第2版)》(ISBN:9787302436515)、《Python可以这样学》(ISBN:9787302456469)配套视频,在教材基础上又增加了大量内容,通过实例讲解numpy、scipy、pandas、statistics、matplotlib等标准库和扩展库用法。

150讲轻松搞定Python网络爬虫

【为什么学爬虫?】 &nbsp; &nbsp; &nbsp; &nbsp;1、爬虫入手容易,但是深入较难,如何写出高效率的爬虫,如何写出灵活性高可扩展的爬虫都是一项技术活。另外在爬虫过程中,经常容易遇到被反爬虫,比如字体反爬、IP识别、验证码等,如何层层攻克难点拿到想要的数据,这门课程,你都能学到! &nbsp; &nbsp; &nbsp; &nbsp;2、如果是作为一个其他行业的开发者,比如app开发,web开发,学习爬虫能让你加强对技术的认知,能够开发出更加安全的软件和网站 【课程设计】 一个完整的爬虫程序,无论大小,总体来说可以分成三个步骤,分别是: 网络请求:模拟浏览器的行为从网上抓取数据。 数据解析:将请求下来的数据进行过滤,提取我们想要的数据。 数据存储:将提取到的数据存储到硬盘或者内存中。比如用mysql数据库或者redis等。 那么本课程也是按照这几个步骤循序渐进的进行讲解,带领学生完整的掌握每个步骤的技术。另外,因为爬虫的多样性,在爬取的过程中可能会发生被反爬、效率低下等。因此我们又增加了两个章节用来提高爬虫程序的灵活性,分别是: 爬虫进阶:包括IP代理,多线程爬虫,图形验证码识别、JS加密解密、动态网页爬虫、字体反爬识别等。 Scrapy和分布式爬虫:Scrapy框架、Scrapy-redis组件、分布式爬虫等。 通过爬虫进阶的知识点我们能应付大量的反爬网站,而Scrapy框架作为一个专业的爬虫框架,使用他可以快速提高我们编写爬虫程序的效率和速度。另外如果一台机器不能满足你的需求,我们可以用分布式爬虫让多台机器帮助你快速爬取数据。 &nbsp; 从基础爬虫到商业化应用爬虫,本套课程满足您的所有需求! 【课程服务】 专属付费社群+每周三讨论会+1v1答疑

获取Linux下Ftp目录树并逐步绑定到treeview

在linux下抓取目录树,双击后获取该节点子节点(逐步生成)。另外有两个类,一个是windows下的(一次性获取目录树),一个是linux下的(足部获取目录树)

YOLOv3目标检测实战系列课程

《YOLOv3目标检测实战系列课程》旨在帮助大家掌握YOLOv3目标检测的训练、原理、源码与网络模型改进方法。 本课程的YOLOv3使用原作darknet(c语言编写),在Ubuntu系统上做项目演示。 本系列课程包括三门课: (1)《YOLOv3目标检测实战:训练自己的数据集》 包括:安装darknet、给自己的数据集打标签、整理自己的数据集、修改配置文件、训练自己的数据集、测试训练出的网络模型、性能统计(mAP计算和画出PR曲线)和先验框聚类。 (2)《YOLOv3目标检测:原理与源码解析》讲解YOLOv1、YOLOv2、YOLOv3的原理、程序流程并解析各层的源码。 (3)《YOLOv3目标检测:网络模型改进方法》讲解YOLOv3的改进方法,包括改进1:不显示指定类别目标的方法 (增加功能) ;改进2:合并BN层到卷积层 (加快推理速度) ; 改进3:使用GIoU指标和损失函数 (提高检测精度) ;改进4:tiny YOLOv3 (简化网络模型)并介绍 AlexeyAB/darknet项目。

手把手实现Java图书管理系统(附源码)

【超实用课程内容】 本课程演示的是一套基于Java的SSM框架实现的图书管理系统,主要针对计算机相关专业的正在做毕设的学生与需要项目实战练习的java人群。详细介绍了图书管理系统的实现,包括:环境搭建、系统业务、技术实现、项目运行、功能演示、系统扩展等,以通俗易懂的方式,手把手的带你从零开始运行本套图书管理系统,该项目附带全部源码可作为毕设使用。 【课程如何观看?】 PC端:https://edu.csdn.net/course/detail/27513 移动端:CSDN 学院APP(注意不是CSDN APP哦) 本课程为录播课,课程2年有效观看时长,大家可以抓紧时间学习后一起讨论哦~ 【学员专享增值服务】 源码开放 课件、课程案例代码完全开放给你,你可以根据所学知识,自行修改、优化

微信小程序开发实战之番茄时钟开发

微信小程序番茄时钟视频教程,本课程将带着各位学员开发一个小程序初级实战类项目,针对只看过官方文档而又无从下手的开发者来说,可以作为一个较好的练手项目,对于有小程序开发经验的开发者而言,可以更好加深对小程序各类组件和API 的理解,为更深层次高难度的项目做铺垫。

Java 最常见的 200+ 面试题:面试必备

这份面试清单是从我 2015 年做了 TeamLeader 之后开始收集的,一方面是给公司招聘用,另一方面是想用它来挖掘在 Java 技术栈中,还有那些知识点是我不知道的,我想找到这些技术盲点,然后修复它,以此来提高自己的技术水平。虽然我是从 2009 年就开始参加编程工作了,但我依旧觉得自己现在要学的东西很多,并且学习这些知识,让我很有成就感和满足感,那所以何乐而不为呢? 说回面试的事,这份面试...

Java基础知识面试题(2020最新版)

文章目录Java概述何为编程什么是Javajdk1.5之后的三大版本JVM、JRE和JDK的关系什么是跨平台性?原理是什么Java语言有哪些特点什么是字节码?采用字节码的最大好处是什么什么是Java程序的主类?应用程序和小程序的主类有何不同?Java应用程序与小程序之间有那些差别?Java和C++的区别Oracle JDK 和 OpenJDK 的对比基础语法数据类型Java有哪些数据类型switc...

三个项目玩转深度学习(附1G源码)

从事大数据与人工智能开发与实践约十年,钱老师亲自见证了大数据行业的发展与人工智能的从冷到热。事实证明,计算机技术的发展,算力突破,海量数据,机器人技术等,开启了第四次工业革命的序章。深度学习图像分类一直是人工智能的经典任务,是智慧零售、安防、无人驾驶等机器视觉应用领域的核心技术之一,掌握图像分类技术是机器视觉学习的重中之重。针对现有线上学习的特点与实际需求,我们开发了人工智能案例实战系列课程。打造:以项目案例实践为驱动的课程学习方式,覆盖了智能零售,智慧交通等常见领域,通过基础学习、项目案例实践、社群答疑,三维立体的方式,打造最好的学习效果。

微信小程序 实例汇总 完整项目源代码

微信小程序 实例汇总 完整项目源代码

基于西门子S7—1200的单部六层电梯设计程序,1部6层电梯

基于西门子S7—1200的单部六层电梯设计程序,1部6层电梯。 本系统控制六层电梯, 采用集选控制方式。 为了完成设定的控制任务, 主要根据电梯输入/输出点数确定PLC 的机型。 根据电梯控制的要求,

相关热词 c#分级显示数据 c# 不区分大小写替换 c#中调用就java c#正则表达式 验证小数 c# vscode 配置 c#三维数组能存多少数据 c# 新建excel c#多个文本框 c#怎么创建tcp通讯 c# mvc 电子病例
立即提问