gitlab+jenkins maven job+sonar报错问题

ERROR: SonarQube scanner exited with non-zero code: 2
找了两天都发现不了问题,唯一的线索就是sonar令牌没有被使用过,请问是哪里出了问题呢?
图片说明

图片说明

Csdn user default icon
上传中...
上传图片
插入图片
抄袭、复制答案,以达到刷声望分或其他目的的行为,在CSDN问答是严格禁止的,一经发现立刻封号。是时候展现真正的技术了!
其他相关推荐
gitlab+jenkins maven job+sonar报错问题

ERROR: SonarQube scanner exited with non-zero code: 2 找了两天都发现不了问题,唯一的线索就是sonar令牌没有被使用过,请问是哪里出了问题呢? ![图片说明](https://img-ask.csdn.net/upload/202002/27/1582795783_218781.png) ![图片说明](https://img-ask.csdn.net/upload/202002/27/1582795802_102842.png)

Jenkins构建maven项目失败报错:

ERROR: Failed to parse POMs hudson.util.IOException2: Failed to access https://cds.sun.com/is-bin/INTERSHOP.enfinity/WFS/CDS-CDS_Developer-Site/en_US/-/USD/ViewProductDetail-Start?ProductRef=C:\Jdk1.7 at hudson.tools.JDKInstaller.locateStage1(JDKInstaller.java:352) at hudson.tools.JDKInstaller.locate(JDKInstaller.java:298) at hudson.tools.JDKInstaller.performInstallation(JDKInstaller.java:121) at hudson.tools.InstallerTranslator.getToolHome(InstallerTranslator.java:61) at hudson.tools.ToolLocationNodeProperty.getToolHome(ToolLocationNodeProperty.java:106) at hudson.tools.ToolInstallation.translateFor(ToolInstallation.java:149) at hudson.model.JDK.forNode(JDK.java:111) at hudson.model.AbstractBuild.getEnvironment(AbstractBuild.java:745) at hudson.maven.MavenModuleSetBuild.getEnvironment(MavenModuleSetBuild.java:157) at hudson.maven.MavenModuleSetBuild$RunnerImpl.doRun(MavenModuleSetBuild.java:573) at hudson.model.AbstractBuild$AbstractRunner.run(AbstractBuild.java:423) at hudson.model.Run.run(Run.java:1362) at hudson.maven.MavenModuleSetBuild.run(MavenModuleSetBuild.java:467) at hudson.model.ResourceController.execute(ResourceController.java:88) at hudson.model.Executor.run(Executor.java:145) Caused by: java.net.UnknownHostException: cds.sun.com at sun.reflect.NativeConstructorAccessorImpl.newInstance0(Native Method) at sun.reflect.NativeConstructorAccessorImpl.newInstance(NativeConstructorAccessorImpl.java:57) at sun.reflect.DelegatingConstructorAccessorImpl.newInstance(DelegatingConstructorAccessorImpl.java:45) at java.lang.reflect.Constructor.newInstance(Constructor.java:526) at sun.net.www.protocol.http.HttpURLConnection$6.run(HttpURLConnection.java:1676) at sun.net.www.protocol.http.HttpURLConnection$6.run(HttpURLConnection.java:1674) at java.security.AccessController.doPrivileged(Native Method) at sun.net.www.protocol.http.HttpURLConnection.getChainedException(HttpURLConnection.java:1672) at sun.net.www.protocol.http.HttpURLConnection.getInputStream(HttpURLConnection.java:1245) at sun.net.www.protocol.https.HttpsURLConnectionImpl.getInputStream(HttpsURLConnectionImpl.java:254) at hudson.tools.JDKInstaller.locateStage1(JDKInstaller.java:340) ... 14 more Caused by: java.net.UnknownHostException: cds.sun.com at java.net.AbstractPlainSocketImpl.connect(AbstractPlainSocketImpl.java:178) at java.net.PlainSocketImpl.connect(PlainSocketImpl.java:172) at java.net.SocksSocketImpl.connect(SocksSocketImpl.java:392) at java.net.Socket.connect(Socket.java:579) at sun.security.ssl.SSLSocketImpl.connect(SSLSocketImpl.java:625) at sun.security.ssl.BaseSSLSocketImpl.connect(BaseSSLSocketImpl.java:160) at sun.net.NetworkClient.doConnect(NetworkClient.java:180) at sun.net.www.http.HttpClient.openServer(HttpClient.java:432) at sun.net.www.http.HttpClient.openServer(HttpClient.java:527) at sun.net.www.protocol.https.HttpsClient.<init>(HttpsClient.java:275) at sun.net.www.protocol.https.HttpsClient.New(HttpsClient.java:371) at sun.net.www.protocol.https.AbstractDelegateHttpsURLConnection.getNewHttpClient(AbstractDelegateHttpsURLConnection.java:191) at sun.net.www.protocol.http.HttpURLConnection.plainConnect(HttpURLConnection.java:933) at sun.net.www.protocol.https.AbstractDelegateHttpsURLConnection.connect(AbstractDelegateHttpsURLConnection.java:177) at sun.net.www.protocol.http.HttpURLConnection.getInputStream(HttpURLConnection.java:1301) at sun.net.www.protocol.http.HttpURLConnection.getHeaderField(HttpURLConnection.java:2691) at sun.net.www.protocol.https.HttpsURLConnectionImpl.getHeaderField(HttpsURLConnectionImpl.java:291) at hudson.tools.JDKInstaller.locateStage1(JDKInstaller.java:334) ... 14 more Finished: FAILURE 好像是连不上cds.sun.com的原因, 不理解怎么改

jenkins中如何安装maven插件

jenkins中如何安装maven插件,请问应该选择哪个插件安装呢,我装的是最新版的jenkins

我在搭建jenkins时,创建job的时候一直报错

http://zhidao.baidu.com/question/2012531848485655148.html ![图片说明](https://img-ask.csdn.net/upload/201511/24/1448357093_245516.png) ![图片说明](https://img-ask.csdn.net/upload/201511/24/1448357182_790567.png) ![图片说明](https://img-ask.csdn.net/upload/201511/24/1448357065_213262.png)

jenkins maven远程部署

![图片说明](https://img-ask.csdn.net/upload/201710/27/1509087429_618686.png) ![图片说明](https://img-ask.csdn.net/upload/201710/27/1509087443_359545.png) ![图片说明](https://img-ask.csdn.net/upload/201710/27/1509087453_672195.png) ![图片说明](https://img-ask.csdn.net/upload/201710/27/1509087461_96994.png) 大佬们这个错误是什么鬼。。。说我maven里面没有 但是有啊 我没有弄私服 这个repository 是我将我w7电脑上的打包解压到liunx的 个人感觉是这个repository有问题。但是我也不知道错在哪里 ``` Building in workspace /root/.jenkins/workspace/yht_user_web Reverting /root/.jenkins/workspace/yht_user_web/. to depth infinity with ignoreExternals: true Updating svn://120.27.216.28/svn/yht/yht_user/yht_user_web at revision '2017-10-27T14:37:21.785 +0800' Using sole credentials lidingpeng/****** in realm ‘<svn://120.27.216.28:3690> /my/svn/svnrepos’ At revision 32 No changes for svn://120.27.216.28/svn/yht/yht_user/yht_user_web since the previous build Parsing POMs ERROR: Failed to parse POMs org.apache.maven.project.ProjectBuildingException: Some problems were encountered while processing the POMs: [FATAL] Non-resolvable parent POM: Could not find artifact com.yht.user:yht_user:pom:0.0.1-SNAPSHOT and 'parent.relativePath' points at wrong local POM @ line 4, column 10 at org.apache.maven.project.DefaultProjectBuilder.build(DefaultProjectBuilder.java:364) at hudson.maven.MavenEmbedder.buildProjects(MavenEmbedder.java:361) at hudson.maven.MavenEmbedder.readProjects(MavenEmbedder.java:331) at hudson.maven.MavenModuleSetBuild$PomParser.invoke(MavenModuleSetBuild.java:1328) at hudson.maven.MavenModuleSetBuild$PomParser.invoke(MavenModuleSetBuild.java:1125) at hudson.FilePath.act(FilePath.java:1018) at hudson.FilePath.act(FilePath.java:996) at hudson.maven.MavenModuleSetBuild$MavenModuleSetBuildExecution.parsePoms(MavenModuleSetBuild.java:986) at hudson.maven.MavenModuleSetBuild$MavenModuleSetBuildExecution.doRun(MavenModuleSetBuild.java:691) at hudson.model.AbstractBuild$AbstractBuildExecution.run(AbstractBuild.java:534) at hudson.model.Run.execute(Run.java:1741) at hudson.maven.MavenModuleSetBuild.run(MavenModuleSetBuild.java:543) at hudson.model.ResourceController.execute(ResourceController.java:98) at hudson.model.Executor.run(Executor.java:410) Finished: FAILURE ```

jenkins maven android项目打包apk

RT,在jenkins如何打包maven管理的android项目。 ant打包已经试过,没有效果,这个只能打包自由风格的项目吧; maven应该可以打包android项目的,只要配置好pom.xml文件,结果报错了 我是根据这篇文章配置的pom.xml,命令行运行mvn clean package报错 unknown <packaging>apk</packaging> 在jenkins报错: [INFO] /bin/sh: /root/android-sdk-macosx/build-tools/19.1.0/aapt: cannot execute binary file [ERROR] Error when generating sources. org.apache.maven.plugin.MojoExecutionException: at com.jayway.maven.plugins.android.phase01generatesources.GenerateSourcesMojo.generateR(GenerateSourcesMojo.java:745) 。。。 Caused by: com.jayway.maven.plugins.android.ExecutionException: ANDROID-040-001: Could not execute: Command = /bin/sh -c cd /root/.jenkins/workspace/apos && /root/android-sdk-macosx/build-tools/19.1.0/aapt package -m -J /root/.jenkins/workspace/apos/target/generated-sources/r -f --no-crunch -M /root/.jenkins/workspace/apos/AndroidManifest.xml -S /root/.jenkins/workspace/apos/res --auto-add-overlay -A /root/.jenkins/workspace/apos/target/generated-sources/combined-assets -I /root/android-sdk-macosx/platforms/android-17/android.jar --output-text-symbols /root/.jenkins/workspace/apos/target, Result = 126 为什么jenkins会报错无法执行命令,而在命令行运行mvn clean package时却unknown apk。。 求教~

jenkins集成maven依赖问题

有两个项目A,B,B依赖于A,网上说在构建B之前会自动构建A, 但我的不会,导致构建出错,有人知道是怎么回事吗

Jenkins系统管理界面报错

登录Jenkins,点击“系统管理”然后就报错了,报错界面的内容如下,哪位遇到过这种情况,着急!!!求帮助 Stack trace javax.servlet.ServletException: org.apache.commons.jelly.JellyTagException: jar:file:/C:/Program%20Files/Jenkins/war/WEB-INF/lib/jenkins-core-1.596.jar!/hudson/model/UpdateCenter/CoreUpdateMonitor/message.jelly:45:20: <j:otherwise> cached miss for hudson.lifecycle.WindowsServiceLifeccle at org.kohsuke.stapler.jelly.JellyFacet$1.dispatch(JellyFacet.java:103) at org.kohsuke.stapler.Stapler.tryInvoke(Stapler.java:746) at org.kohsuke.stapler.Stapler.invoke(Stapler.java:876) at org.kohsuke.stapler.Stapler.invoke(Stapler.java:649) at org.kohsuke.stapler.Stapler.service(Stapler.java:238) at javax.servlet.http.HttpServlet.service(HttpServlet.java:848) at org.eclipse.jetty.servlet.ServletHolder.handle(ServletHolder.java:686) at org.eclipse.jetty.servlet.ServletHandler$CachedChain.doFilter(ServletHandler.java:1494) at hudson.util.PluginServletFilter$1.doFilter(PluginServletFilter.java:96) at hudson.util.PluginServletFilter.doFilter(PluginServletFilter.java:88) at org.eclipse.jetty.servlet.ServletHandler$CachedChain.doFilter(ServletHandler.java:1482) at hudson.security.csrf.CrumbFilter.doFilter(CrumbFilter.java:48) at org.eclipse.jetty.servlet.ServletHandler$CachedChain.doFilter(ServletHandler.java:1482) at hudson.security.ChainedServletFilter$1.doFilter(ChainedServletFilter.java:84) at hudson.security.UnwrapSecurityExceptionFilter.doFilter(UnwrapSecurityExceptionFilter.java:51) at hudson.security.ChainedServletFilter$1.doFilter(ChainedServletFilter.java:87) at jenkins.security.ExceptionTranslationFilter.doFilter(ExceptionTranslationFilter.java:117) at hudson.security.ChainedServletFilter$1.doFilter(ChainedServletFilter.java:87) at org.acegisecurity.providers.anonymous.AnonymousProcessingFilter.doFilter(AnonymousProcessingFilter.java:125) at hudson.security.ChainedServletFilter$1.doFilter(ChainedServletFilter.java:87) at org.acegisecurity.ui.rememberme.RememberMeProcessingFilter.doFilter(RememberMeProcessingFilter.java:142) at hudson.security.ChainedServletFilter$1.doFilter(ChainedServletFilter.java:87) at org.acegisecurity.ui.AbstractProcessingFilter.doFilter(AbstractProcessingFilter.java:271) at hudson.security.ChainedServletFilter$1.doFilter(ChainedServletFilter.java:87) at jenkins.security.BasicHeaderProcessor.doFilter(BasicHeaderProcessor.java:93) at hudson.security.ChainedServletFilter$1.doFilter(ChainedServletFilter.java:87) at org.acegisecurity.context.HttpSessionContextIntegrationFilter.doFilter(HttpSessionContextIntegrationFilter.java:249) at hudson.security.HttpSessionContextIntegrationFilter2.doFilter(HttpSessionContextIntegrationFilter2.java:67) at hudson.security.ChainedServletFilter$1.doFilter(ChainedServletFilter.java:87) at hudson.security.ChainedServletFilter.doFilter(ChainedServletFilter.java:76) at hudson.security.HudsonFilter.doFilter(HudsonFilter.java:164) at org.eclipse.jetty.servlet.ServletHandler$CachedChain.doFilter(ServletHandler.java:1482) at org.kohsuke.stapler.compression.CompressionFilter.doFilter(CompressionFilter.java:49) at org.eclipse.jetty.servlet.ServletHandler$CachedChain.doFilter(ServletHandler.java:1482) at hudson.util.CharacterEncodingFilter.doFilter(CharacterEncodingFilter.java:81) at org.eclipse.jetty.servlet.ServletHandler$CachedChain.doFilter(ServletHandler.java:1482) at org.kohsuke.stapler.DiagnosticThreadNameFilter.doFilter(DiagnosticThreadNameFilter.java:30) at org.eclipse.jetty.servlet.ServletHandler$CachedChain.doFilter(ServletHandler.java:1474) at org.eclipse.jetty.servlet.ServletHandler.doHandle(ServletHandler.java:499) at org.eclipse.jetty.server.handler.ScopedHandler.handle(ScopedHandler.java:137) at org.eclipse.jetty.security.SecurityHandler.handle(SecurityHandler.java:533) at org.eclipse.jetty.server.session.SessionHandler.doHandle(SessionHandler.java:231) at org.eclipse.jetty.server.handler.ContextHandler.doHandle(ContextHandler.java:1086) at org.eclipse.jetty.servlet.ServletHandler.doScope(ServletHandler.java:428) at org.eclipse.jetty.server.session.SessionHandler.doScope(SessionHandler.java:193) at org.eclipse.jetty.server.handler.ContextHandler.doScope(ContextHandler.java:1020) at org.eclipse.jetty.server.handler.ScopedHandler.handle(ScopedHandler.java:135) at org.eclipse.jetty.server.handler.HandlerWrapper.handle(HandlerWrapper.java:116) at org.eclipse.jetty.server.Server.handle(Server.java:370) at org.eclipse.jetty.server.AbstractHttpConnection.handleRequest(AbstractHttpConnection.java:489) at org.eclipse.jetty.server.AbstractHttpConnection.headerComplete(AbstractHttpConnection.java:949) at org.eclipse.jetty.server.AbstractHttpConnection$RequestHandler.headerComplete(AbstractHttpConnection.java:1011) at org.eclipse.jetty.http.HttpParser.parseNext(HttpParser.java:644) at org.eclipse.jetty.http.HttpParser.parseAvailable(HttpParser.java:235) at org.eclipse.jetty.server.AsyncHttpConnection.handle(AsyncHttpConnection.java:82) at org.eclipse.jetty.io.nio.SelectChannelEndPoint.handle(SelectChannelEndPoint.java:668) at org.eclipse.jetty.io.nio.SelectChannelEndPoint$1.run(SelectChannelEndPoint.java:52) at winstone.BoundedExecutorService$1.run(BoundedExecutorService.java:77) at java.util.concurrent.ThreadPoolExecutor.runWorker(Unknown Source) at java.util.concurrent.ThreadPoolExecutor$Worker.run(Unknown Source) at java.lang.Thread.run(Unknown Source) Caused by: org.apache.commons.jelly.JellyTagException: jar:file:/C:/Program%20Files/Jenkins/war/WEB-INF/lib/jenkins-core-1.596.jar!/hudson/model/UpdateCenter/CoreUpdateMonitor/message.jelly:45:20: <j:otherwise> cached miss for hudson.lifecycle.WindowsServiceLifeccle at org.apache.commons.jelly.impl.TagScript.handleException(TagScript.java:745) at org.apache.commons.jelly.impl.TagScript.run(TagScript.java:289) at org.apache.commons.jelly.impl.ScriptBlock.run(ScriptBlock.java:95) at org.apache.commons.jelly.TagSupport.invokeBody(TagSupport.java:161) at org.apache.commons.jelly.tags.core.ChooseTag.doTag(ChooseTag.java:38) at org.apache.commons.jelly.impl.TagScript.run(TagScript.java:269) at org.apache.commons.jelly.impl.ScriptBlock.run(ScriptBlock.java:95) at org.kohsuke.stapler.jelly.ReallyStaticTagLibrary$1.run(ReallyStaticTagLibrary.java:99) at org.apache.commons.jelly.tags.core.CoreTagLibrary$2.run(CoreTagLibrary.java:105) at org.kohsuke.stapler.jelly.JellyViewScript.run(JellyViewScript.java:95) at org.kohsuke.stapler.jelly.IncludeTag.doTag(IncludeTag.java:147) at org.apache.commons.jelly.impl.TagScript.run(TagScript.java:269) at org.apache.commons.jelly.tags.core.CoreTagLibrary$1.run(CoreTagLibrary.java:98) at org.apache.commons.jelly.TagSupport.invokeBody(TagSupport.java:161) at org.apache.commons.jelly.tags.core.ForEachTag.doTag(ForEachTag.java:150) at org.apache.commons.jelly.impl.TagScript.run(TagScript.java:269) at org.apache.commons.jelly.impl.ScriptBlock.run(ScriptBlock.java:95) at org.kohsuke.stapler.jelly.CallTagLibScript$1.run(CallTagLibScript.java:99) at org.apache.commons.jelly.tags.define.InvokeBodyTag.doTag(InvokeBodyTag.java:91) at org.apache.commons.jelly.impl.TagScript.run(TagScript.java:269) at org.apache.commons.jelly.impl.ScriptBlock.run(ScriptBlock.java:95) at org.apache.commons.jelly.tags.core.CoreTagLibrary$1.run(CoreTagLibrary.java:98) at org.apache.commons.jelly.impl.ScriptBlock.run(ScriptBlock.java:95) at org.apache.commons.jelly.tags.core.CoreTagLibrary$2.run(CoreTagLibrary.java:105) at org.kohsuke.stapler.jelly.CallTagLibScript.run(CallTagLibScript.java:120) at org.apache.commons.jelly.impl.ScriptBlock.run(ScriptBlock.java:95) at org.kohsuke.stapler.jelly.CallTagLibScript$1.run(CallTagLibScript.java:99) at org.apache.commons.jelly.tags.define.InvokeBodyTag.doTag(InvokeBodyTag.java:91) at org.apache.commons.jelly.impl.TagScript.run(TagScript.java:269) at org.apache.commons.jelly.impl.ScriptBlock.run(ScriptBlock.java:95) at org.kohsuke.stapler.jelly.ReallyStaticTagLibrary$1.run(ReallyStaticTagLibrary.java:99) at org.kohsuke.stapler.jelly.ReallyStaticTagLibrary$1.run(ReallyStaticTagLibrary.java:99) at org.apache.commons.jelly.impl.ScriptBlock.run(ScriptBlock.java:95) at org.kohsuke.stapler.jelly.ReallyStaticTagLibrary$1.run(ReallyStaticTagLibrary.java:99) at org.kohsuke.stapler.jelly.ReallyStaticTagLibrary$1.run(ReallyStaticTagLibrary.java:99) at org.apache.commons.jelly.impl.ScriptBlock.run(ScriptBlock.java:95) at org.kohsuke.stapler.jelly.ReallyStaticTagLibrary$1.run(ReallyStaticTagLibrary.java:99) at org.apache.commons.jelly.impl.ScriptBlock.run(ScriptBlock.java:95) at org.kohsuke.stapler.jelly.ReallyStaticTagLibrary$1.run(ReallyStaticTagLibrary.java:99) at org.apache.commons.jelly.impl.ScriptBlock.run(ScriptBlock.java:95) at org.apache.commons.jelly.tags.core.CoreTagLibrary$2.run(CoreTagLibrary.java:105) at org.kohsuke.stapler.jelly.CallTagLibScript.run(CallTagLibScript.java:120) at org.apache.commons.jelly.tags.core.CoreTagLibrary$2.run(CoreTagLibrary.java:105)

jenkins构建maven父子项目如何单独构建子项目?

jenkins构建maven父子项目,由于父子项目是在同一个git repository下,所以每次push都会触发所有modules构建,怎么做到修改哪个modules就构建哪个?

jenkins +maven+tomcat 遇到的问题

1,构建成功后不往tomcat传war包。 ![图片说明](https://img-ask.csdn.net/upload/201704/07/1491563065_807710.jpg) 2,如何关闭一下插件: ![图片说明](https://img-ask.csdn.net/upload/201704/07/1491563096_757466.jpg) 求大神解惑。

jenkins+GitLab自动集成

不想每次代码提交时都触发jenkins,而是在一次大改动之后再触发,怎么才能进行这样的配置?

jenkins的全部配置中没有Java和maven的安装选项

![图片说明](https://img-ask.csdn.net/upload/201909/29/1569753246_996582.png) 想用docker+jenkins+maven构建自动化部署,但是jenkins的全局配置中maven是这个页面,构建项目一直显示失败,不知道这个要怎么配置,请教各位大神怎么配置?

jenkins publish over ssh 报错

win8 部署 jenkins ,服务器是windows server 2008 r2,服务器freesshd jenkins.plugins.publish_over.BapPublisherException: Failed to connect and initialize SSH connection. Message: [Failed to connect session for config [win8r2]. Message [USERAUTH fail]] 在jenkins 上使用publish over ssh ,报上述错误,

jenkins+Maven+Publish JUnit test result report 生成xml无数据

使用jenkins+Maven+JUnit插件生成Xml测试报告 配置如下 ![图片说明](https://img-ask.csdn.net/upload/201908/14/1565768469_339962.png) ![图片说明](https://img-ask.csdn.net/upload/201908/14/1565768479_417790.png) ![图片说明](https://img-ask.csdn.net/upload/201908/14/1565768458_92501.png) 结果生成xml测试报告无数据

使用jenkins发布maven项目到远程的jetty容器中

如题(就这点币了) 使用jenkins发布maven项目到远程的jetty容器中

jenkins部署maven工程构建,报错“package org.springframework.web.bind.annotation does not exist”

【背景】: 1、jenkins部署maven工程做自动编译打包构建 2、工程集成了spring+springboot+mybatis 3、多模块方式部署maven工程,有一个总的pom工程。 4、总的pom工程由上游依赖(已install到仓库中) 【问题描述】: 构建此pom工程给多模块编译打包,报错 ``` ...I18nController.java:package org.springframework.web.bind.annotation does not exist. ...I18nController.java ..cannot find symbol.. ... ``` 【定位】: 1、初步排查应该是缺包导致的问题,根据代码报错找到为导入包为spring-web中的一个类找不到 2、因为继承jenkins构建使用的maven未配置localRepository,因此构建时下载的临时仓库在slave的WORKSPACE下的m2chche目录下。 3、可以明确在该m2chche种找到spring-web对应版本已下载的jar包。 4、在jenkins执行日志中,搜索加载到的"org/springframework/spring"时,其他的spring-jdbc,spring-tx,spring-core,spring-aop等包都能查到,但是查不到spring-web的。 5、根据spring boot的pom文件往上找依赖,在spring-boot-starter 找到spring-boot-starter-web,在往上找到spring-web的依赖,scope配置的 compile 至此暂没有头绪了。 【求助】:请教大家了解maven的朋友,给点指导,谢谢!

从JENKINS创建了MAVEN项目在build之后如何deploy到kubernetes

我有个问题请教大学身,从JENKINS创建了MAVEN项目在build之后如何deploy到kubernetes,配置的插件提示缺少~/.kube/config,如何破

sonarqube检测java出错

![图片说明](https://img-ask.csdn.net/upload/201810/25/1540431344_463104.png) sonar.language=php 就可以构建成功 改成 sonar.language=java 就会构建失败 是什么原因 有没有大佬解答一下。在线等

请教:Tomcat启动报错(急)!!!!!!!!!报错信息如下,工程有Maven

严重: A child container failed during start java.util.concurrent.ExecutionException: org.apache.catalina.LifecycleException: Failed to start component [StandardEngine[Catalina].StandardHost[localhost].StandardContext[/csm]] at java.util.concurrent.FutureTask.report(FutureTask.java:122) at java.util.concurrent.FutureTask.get(FutureTask.java:192) at org.apache.catalina.core.ContainerBase.startInternal(ContainerBase.java:1123) at org.apache.catalina.core.StandardHost.startInternal(StandardHost.java:801) at org.apache.catalina.util.LifecycleBase.start(LifecycleBase.java:150) at org.apache.catalina.core.ContainerBase$StartChild.call(ContainerBase.java:1559) at org.apache.catalina.core.ContainerBase$StartChild.call(ContainerBase.java:1549) at java.util.concurrent.FutureTask.run(FutureTask.java:266) at java.util.concurrent.ThreadPoolExecutor.runWorker(ThreadPoolExecutor.java:1142) at java.util.concurrent.ThreadPoolExecutor$Worker.run(ThreadPoolExecutor.java:617) at java.lang.Thread.run(Thread.java:748) Caused by: org.apache.catalina.LifecycleException: Failed to start component [StandardEngine[Catalina].StandardHost[localhost].StandardContext[/csm]] at org.apache.catalina.util.LifecycleBase.start(LifecycleBase.java:154) ... 6 more Caused by: java.lang.NoClassDefFoundError: org/springframework/web/context/WebApplicationContext at java.lang.Class.getDeclaredFields0(Native Method) at java.lang.Class.privateGetDeclaredFields(Class.java:2583) at java.lang.Class.getDeclaredFields(Class.java:1916) at org.apache.catalina.util.Introspection.getDeclaredFields(Introspection.java:106) at org.apache.catalina.startup.WebAnnotationSet.loadFieldsAnnotation(WebAnnotationSet.java:263) at org.apache.catalina.startup.WebAnnotationSet.loadApplicationListenerAnnotations(WebAnnotationSet.java:92) at org.apache.catalina.startup.WebAnnotationSet.loadApplicationAnnotations(WebAnnotationSet.java:65) at org.apache.catalina.startup.ContextConfig.applicationAnnotationsConfig(ContextConfig.java:407) at org.apache.catalina.startup.ContextConfig.configureStart(ContextConfig.java:883) at org.apache.catalina.startup.ContextConfig.lifecycleEvent(ContextConfig.java:378) at org.apache.catalina.util.LifecycleSupport.fireLifecycleEvent(LifecycleSupport.java:119) at org.apache.catalina.util.LifecycleBase.fireLifecycleEvent(LifecycleBase.java:90) at org.apache.catalina.core.StandardContext.startInternal(StandardContext.java:5343) at org.apache.catalina.util.LifecycleBase.start(LifecycleBase.java:150) ... 6 more Caused by: java.lang.ClassNotFoundException: org.springframework.web.context.WebApplicationContext at org.apache.catalina.loader.WebappClassLoader.loadClass(WebappClassLoader.java:1702) at org.apache.catalina.loader.WebappClassLoader.loadClass(WebappClassLoader.java:1547) ... 20 more 一月 19, 2018 2:58:22 下午 org.apache.catalina.core.ContainerBase startInternal 严重: A child container failed during start java.util.concurrent.ExecutionException: org.apache.catalina.LifecycleException: Failed to start component [StandardEngine[Catalina].StandardHost[localhost]] at java.util.concurrent.FutureTask.report(FutureTask.java:122) at java.util.concurrent.FutureTask.get(FutureTask.java:192) at org.apache.catalina.core.ContainerBase.startInternal(ContainerBase.java:1123) at org.apache.catalina.core.StandardEngine.startInternal(StandardEngine.java:302) at org.apache.catalina.util.LifecycleBase.start(LifecycleBase.java:150) at org.apache.catalina.core.StandardService.startInternal(StandardService.java:443) at org.apache.catalina.util.LifecycleBase.start(LifecycleBase.java:150) at org.apache.catalina.core.StandardServer.startInternal(StandardServer.java:732) at org.apache.catalina.util.LifecycleBase.start(LifecycleBase.java:150) at org.apache.catalina.startup.Catalina.start(Catalina.java:690) at sun.reflect.NativeMethodAccessorImpl.invoke0(Native Method) at sun.reflect.NativeMethodAccessorImpl.invoke(NativeMethodAccessorImpl.java:62) at sun.reflect.DelegatingMethodAccessorImpl.invoke(DelegatingMethodAccessorImpl.java:43) at java.lang.reflect.Method.invoke(Method.java:498) at org.apache.catalina.startup.Bootstrap.start(Bootstrap.java:322) at org.apache.catalina.startup.Bootstrap.main(Bootstrap.java:456) Caused by: org.apache.catalina.LifecycleException: Failed to start component [StandardEngine[Catalina].StandardHost[localhost]] at org.apache.catalina.util.LifecycleBase.start(LifecycleBase.java:154) at org.apache.catalina.core.ContainerBase$StartChild.call(ContainerBase.java:1559) at org.apache.catalina.core.ContainerBase$StartChild.call(ContainerBase.java:1549) at java.util.concurrent.FutureTask.run(FutureTask.java:266) at java.util.concurrent.ThreadPoolExecutor.runWorker(ThreadPoolExecutor.java:1142) at java.util.concurrent.ThreadPoolExecutor$Worker.run(ThreadPoolExecutor.java:617) at java.lang.Thread.run(Thread.java:748) Caused by: org.apache.catalina.LifecycleException: A child container failed during start at org.apache.catalina.core.ContainerBase.startInternal(ContainerBase.java:1131) at org.apache.catalina.core.StandardHost.startInternal(StandardHost.java:801) at org.apache.catalina.util.LifecycleBase.start(LifecycleBase.java:150) ... 6 more 一月 19, 2018 2:58:22 下午 org.apache.catalina.startup.Catalina start 严重: The required Server component failed to start so Tomcat is unable to start. org.apache.catalina.LifecycleException: Failed to start component [StandardServer[8005]] at org.apache.catalina.util.LifecycleBase.start(LifecycleBase.java:154) at org.apache.catalina.startup.Catalina.start(Catalina.java:690) at sun.reflect.NativeMethodAccessorImpl.invoke0(Native Method) at sun.reflect.NativeMethodAccessorImpl.invoke(NativeMethodAccessorImpl.java:62) at sun.reflect.DelegatingMethodAccessorImpl.invoke(DelegatingMethodAccessorImpl.java:43) at java.lang.reflect.Method.invoke(Method.java:498) at org.apache.catalina.startup.Bootstrap.start(Bootstrap.java:322) at org.apache.catalina.startup.Bootstrap.main(Bootstrap.java:456) Caused by: org.apache.catalina.LifecycleException: Failed to start component [StandardService[Catalina]] at org.apache.catalina.util.LifecycleBase.start(LifecycleBase.java:154) at org.apache.catalina.core.StandardServer.startInternal(StandardServer.java:732) at org.apache.catalina.util.LifecycleBase.start(LifecycleBase.java:150) ... 7 more Caused by: org.apache.catalina.LifecycleException: Failed to start component [StandardEngine[Catalina]] at org.apache.catalina.util.LifecycleBase.start(LifecycleBase.java:154) at org.apache.catalina.core.StandardService.startInternal(StandardService.java:443) at org.apache.catalina.util.LifecycleBase.start(LifecycleBase.java:150) ... 9 more Caused by: org.apache.catalina.LifecycleException: A child container failed during start at org.apache.catalina.core.ContainerBase.startInternal(ContainerBase.java:1131) at org.apache.catalina.core.StandardEngine.startInternal(StandardEngine.java:302) at org.apache.catalina.util.LifecycleBase.start(LifecycleBase.java:150) ... 11 more

Jenkins打包项目报错,JDK1.8

``` [INFO] BUILD FAILURE [INFO] ------------------------------------------------------------------------ [INFO] Total time: 6.400 s [INFO] Finished at: 2019-12-31T17:08:37+08:00 [INFO] Final Memory: 32M/117M [INFO] ------------------------------------------------------------------------ [ERROR] Failed to execute goal org.apache.maven.plugins:maven-compiler-plugin:3.8.1:compile (default-compile) on project cmdbunion_eureka: Execution default-compile of goal org.apache.maven.plugins:maven-compiler-plugin:3.8.1:compile failed: A required class was missing while executing org.apache.maven.plugins:maven-compiler-plugin:3.8.1:compile: org/codehaus/plexus/compiler/util/scan/InclusionScanException [ERROR] ----------------------------------------------------- [ERROR] realm = plugin>org.apache.maven.plugins:maven-compiler-plugin:3.8.1 [ERROR] strategy = org.codehaus.plexus.classworlds.strategy.SelfFirstStrategy [ERROR] urls[0] = file:/DATA/repo/repository/org/apache/maven/plugins/maven-compiler-plugin/3.8.1/maven-compiler-plugin-3.8.1.jar [ERROR] urls[1] = file:/DATA/repo/repository/org/codehaus/plexus/plexus-utils/1.1/plexus-utils-1.1.jar [JENKINS] Archiving /DATA/var/lib/jenkins/workspace/cmdbunion_parent/cmdbunion_eureka/pom.xml to com.travelsky/cmdbunion_eureka/0.0.1-SNAPSHOT/cmdbunion_eureka-0.0.1-SNAPSHOT.pom [ERROR] Number of foreign imports: 1 [ERROR] import: Entry[import from realm ClassRealm[maven.api, parent: null]] [ERROR] [ERROR] -----------------------------------------------------: org.codehaus.plexus.compiler.util.scan.InclusionScanException [ERROR] -> [Help 1] [ERROR] [ERROR] To see the full stack trace of the errors, re-run Maven with the -e switch. [ERROR] Re-run Maven using the -X switch to enable full debug logging. [JENKINS] Archiving /DATA/var/lib/jenkins/workspace/cmdbunion_parent/cmdbunion_titsm/pom.xml to com.travelsky/cmdbunion_titsm/0.0.1-SNAPSHOT/cmdbunion_titsm-0.0.1-SNAPSHOT.pom [ERROR] [ERROR] For more information about the errors and possible solutions, please read the following articles: [ERROR] [Help 1] http://cwiki.apache.org/confluence/display/MAVEN/PluginContainerException [ERROR] [ERROR] After correcting the problems, you can resume the build with the command [ERROR] mvn <goals> -rf :cmdbunion_eureka ``` ![图片说明](https://img-ask.csdn.net/upload/201912/31/1577783774_342114.png) ![图片说明](https://img-ask.csdn.net/upload/201912/31/1577783814_821416.png)

4小时玩转微信小程序——基础入门与微信支付实战

这是一个门针对零基础学员学习微信小程序开发的视频教学课程。课程采用腾讯官方文档作为教程的唯一技术资料来源。杜绝网络上质量良莠不齐的资料给学员学习带来的障碍。 视频课程按照开发工具的下载、安装、使用、程序结构、视图层、逻辑层、微信小程序等几个部分组织课程,详细讲解整个小程序的开发过程

Python可以这样学(第四季:数据分析与科学计算可视化)

董付国老师系列教材《Python程序设计(第2版)》(ISBN:9787302436515)、《Python可以这样学》(ISBN:9787302456469)配套视频,在教材基础上又增加了大量内容,通过实例讲解numpy、scipy、pandas、statistics、matplotlib等标准库和扩展库用法。

组成原理课程设计(实现机器数的真值还原等功能)

实现机器数的真值还原(定点小数)、定点小数的单符号位补码加减运算、定点小数的补码乘法运算和浮点数的加减运算。

javaWeb图书馆管理系统源码mysql版本

系统介绍 图书馆管理系统主要的目的是实现图书馆的信息化管理。图书馆的主要业务就是新书的借阅和归还,因此系统最核心的功能便是实现图书的借阅和归还。此外,还需要提供图书的信息查询、读者图书借阅情况的查询等

土豆浏览器

土豆浏览器可以用来看各种搞笑、电影、电视剧视频

Java面试题大全(2020版)

发现网上很多Java面试题都没有答案,所以花了很长时间搜集整理出来了这套Java面试题大全,希望对大家有帮助哈~ 本套Java面试题大全,全的不能再全,哈哈~ 一、Java 基础 1. JDK 和 JRE 有什么区别? JDK:Java Development Kit 的简称,java 开发工具包,提供了 java 的开发环境和运行环境。 JRE:Java Runtime Environ...

Java8零基础入门视频教程

这门课程基于主流的java8平台,由浅入深的详细讲解了java SE的开发技术,可以使java方向的入门学员,快速扎实的掌握java开发技术!

Java基础知识面试题(2020最新版)

文章目录Java概述何为编程什么是Javajdk1.5之后的三大版本JVM、JRE和JDK的关系什么是跨平台性?原理是什么Java语言有哪些特点什么是字节码?采用字节码的最大好处是什么什么是Java程序的主类?应用程序和小程序的主类有何不同?Java应用程序与小程序之间有那些差别?Java和C++的区别Oracle JDK 和 OpenJDK 的对比基础语法数据类型Java有哪些数据类型switc...

TTP229触摸代码以及触摸返回值处理

自己总结的ttp229触摸代码,触摸代码以及触摸按键处理

网络工程师小白入门--【思科CCNA、华为HCNA等网络工程师认证】

本课程适合CCNA或HCNA网络小白同志,高手请绕道,可以直接学习进价课程。通过本预科课程的学习,为学习网络工程师、思科CCNA、华为HCNA这些认证打下坚实的基础! 重要!思科认证2020年2月24日起,已启用新版认证和考试,包括题库都会更新,由于疫情原因,请关注官网和本地考点信息。题库网络上很容易下载到。

深度学习原理+项目实战+算法详解+主流框架(套餐)

深度学习系列课程从深度学习基础知识点开始讲解一步步进入神经网络的世界再到卷积和递归神经网络,详解各大经典网络架构。实战部分选择当下最火爆深度学习框架PyTorch与Tensorflow/Keras,全程实战演示框架核心使用与建模方法。项目实战部分选择计算机视觉与自然语言处理领域经典项目,从零开始详解算法原理,debug模式逐行代码解读。适合准备就业和转行的同学们加入学习! 建议按照下列课程顺序来进行学习 (1)掌握深度学习必备经典网络架构 (2)深度框架实战方法 (3)计算机视觉与自然语言处理项目实战。(按照课程排列顺序即可)

java jdk 8 帮助文档 中文 文档 chm 谷歌翻译

JDK1.8 API 中文谷歌翻译版 java帮助文档 JDK API java 帮助文档 谷歌翻译 JDK1.8 API 中文 谷歌翻译版 java帮助文档 Java最新帮助文档 本帮助文档是使用谷

Ubuntu18.04安装教程

Ubuntu18.04.1安装一、准备工作1.下载Ubuntu18.04.1 LTS2.制作U盘启动盘3.准备 Ubuntu18.04.1 的硬盘空间二、安装Ubuntu18.04.1三、安装后的一些工作1.安装输入法2.更换软件源四、双系统如何卸载Ubuntu18.04.1新的改变功能快捷键合理的创建标题,有助于目录的生成如何改变文本的样式插入链接与图片如何插入一段漂亮的代码片生成一个适合你的列...

快速排序---(面试碰到过好几次)

原理:    快速排序,说白了就是给基准数据找其正确索引位置的过程.    如下图所示,假设最开始的基准数据为数组第一个元素23,则首先用一个临时变量去存储基准数据,即tmp=23;然后分别从数组的两端扫描数组,设两个指示标志:low指向起始位置,high指向末尾.    首先从后半部分开始,如果扫描到的值大于基准数据就让high减1,如果发现有元素比该基准数据的值小(如上图中18&amp;lt...

手把手实现Java图书管理系统(附源码)

【超实用课程内容】 本课程演示的是一套基于Java的SSM框架实现的图书管理系统,主要针对计算机相关专业的正在做毕设的学生与需要项目实战练习的java人群。详细介绍了图书管理系统的实现,包括:环境搭建、系统业务、技术实现、项目运行、功能演示、系统扩展等,以通俗易懂的方式,手把手的带你从零开始运行本套图书管理系统,该项目附带全部源码可作为毕设使用。 【课程如何观看?】 PC端:https://edu.csdn.net/course/detail/27513 移动端:CSDN 学院APP(注意不是CSDN APP哦) 本课程为录播课,课程2年有效观看时长,大家可以抓紧时间学习后一起讨论哦~ 【学员专享增值服务】 源码开放 课件、课程案例代码完全开放给你,你可以根据所学知识,自行修改、优化 下载方式:电脑登录https://edu.csdn.net/course/detail/27513,点击右下方课程资料、代码、课件等打包下载

HTML期末大作业

这是我自己做的HTML期末大作业,花了很多时间,稍加修改就可以作为自己的作业了,而且也可以作为学习参考

Python数据挖掘简易入门

&nbsp; &nbsp; &nbsp; &nbsp; 本课程为Python数据挖掘方向的入门课程,课程主要以真实数据为基础,详细介绍数据挖掘入门的流程和使用Python实现pandas与numpy在数据挖掘方向的运用,并深入学习如何运用scikit-learn调用常用的数据挖掘算法解决数据挖掘问题,为进一步深入学习数据挖掘打下扎实的基础。

极简JAVA学习营第四期(报名以后加助教微信:eduxy-1)

想学好JAVA必须要报两万的培训班吗? Java大神勿入 如果你: 零基础想学JAVA却不知道从何入手 看了一堆书和视频却还是连JAVA的环境都搭建不起来 囊中羞涩面对两万起的JAVA培训班不忍直视 在职没有每天大块的时间专门学习JAVA 那么恭喜你找到组织了,在这里有: 1. 一群志同道合立志学好JAVA的同学一起学习讨论JAVA 2. 灵活机动的学习时间完成特定学习任务+每日编程实战练习 3. 热心助人的助教和讲师及时帮你解决问题,不按时完成作业小心助教老师的家访哦 上一张图看看前辈的感悟: &nbsp; &nbsp; 大家一定迫不及待想知道什么是极简JAVA学习营了吧,下面就来给大家说道说道: 什么是极简JAVA学习营? 1. 针对Java小白或者初级Java学习者; 2. 利用9天时间,每天1个小时时间; 3.通过 每日作业 / 组队PK / 助教答疑 / 实战编程 / 项目答辩 / 社群讨论 / 趣味知识抢答等方式让学员爱上学习编程 , 最终实现能独立开发一个基于控制台的‘库存管理系统’ 的学习模式 极简JAVA学习营是怎么学习的? &nbsp; 如何报名? 只要购买了极简JAVA一:JAVA入门就算报名成功! &nbsp;本期为第四期极简JAVA学习营,我们来看看往期学员的学习状态: 作业看这里~ &nbsp; 助教的作业报告是不是很专业 不交作业打屁屁 助教答疑是不是很用心 &nbsp; 有奖抢答大家玩的很嗨啊 &nbsp; &nbsp; 项目答辩终于开始啦 &nbsp; 优秀者的获奖感言 &nbsp; 这是答辩项目的效果 &nbsp; &nbsp; 这么细致的服务,这么好的氛围,这样的学习效果,需要多少钱呢? 不要1999,不要199,不要99,只要9.9 是的你没听错,只要9.9以上所有就都属于你了 如果你: 1、&nbsp;想学JAVA没有基础 2、&nbsp;想学JAVA没有整块的时间 3、&nbsp;想学JAVA没有足够的预算 还等什么?赶紧报名吧,抓紧抢位,本期只招300人,错过只有等时间待定的下一期了 &nbsp; 报名请加小助手微信:eduxy-1 &nbsp; &nbsp;

C++语言基础视频教程

C++语言基础视频培训课程:本课与主讲者在大学开出的程序设计课程直接对接,准确把握知识点,注重教学视频与实践体系的结合,帮助初学者有效学习。本教程详细介绍C++语言中的封装、数据隐藏、继承、多态的实现等入门知识;主要包括类的声明、对象定义、构造函数和析构函数、运算符重载、继承和派生、多态性实现等。 课程需要有C语言程序设计的基础(可以利用本人开出的《C语言与程序设计》系列课学习)。学习者能够通过实践的方式,学会利用C++语言解决问题,具备进一步学习利用C++开发应用程序的基础。

UnityLicence

UnityLicence

软件测试2小时入门

本课程内容系统、全面、简洁、通俗易懂,通过2个多小时的介绍,让大家对软件测试有个系统的理解和认识,具备基本的软件测试理论基础。 主要内容分为5个部分: 1 软件测试概述,了解测试是什么、测试的对象、原则、流程、方法、模型;&nbsp; 2.常用的黑盒测试用例设计方法及示例演示;&nbsp; 3 常用白盒测试用例设计方法及示例演示;&nbsp; 4.自动化测试优缺点、使用范围及示例‘;&nbsp; 5.测试经验谈。

YOLOv3目标检测实战:训练自己的数据集

YOLOv3是一种基于深度学习的端到端实时目标检测方法,以速度快见长。本课程将手把手地教大家使用labelImg标注和使用YOLOv3训练自己的数据集。课程分为三个小项目:足球目标检测(单目标检测)、梅西目标检测(单目标检测)、足球和梅西同时目标检测(两目标检测)。 本课程的YOLOv3使用Darknet,在Ubuntu系统上做项目演示。包括:安装Darknet、给自己的数据集打标签、整理自己的数据集、修改配置文件、训练自己的数据集、测试训练出的网络模型、性能统计(mAP计算和画出PR曲线)和先验框聚类。 Darknet是使用C语言实现的轻型开源深度学习框架,依赖少,可移植性好,值得深入探究。 除本课程《YOLOv3目标检测实战:训练自己的数据集》外,本人推出了有关YOLOv3目标检测的系列课程,请持续关注该系列的其它课程视频,包括: 《YOLOv3目标检测实战:交通标志识别》 《YOLOv3目标检测:原理与源码解析》 《YOLOv3目标检测:网络模型改进方法》 敬请关注并选择学习!

Python数据分析师-实战系列

系列课程主要包括Python数据分析必备工具包,数据分析案例实战,核心算法实战与企业级数据分析与建模解决方案实战,建议大家按照系列课程阶段顺序进行学习。所有数据集均为企业收集的真实数据集,整体风格以实战为导向,通俗讲解Python数据分析核心技巧与实战解决方案。

YOLOv3目标检测实战系列课程

《YOLOv3目标检测实战系列课程》旨在帮助大家掌握YOLOv3目标检测的训练、原理、源码与网络模型改进方法。 本课程的YOLOv3使用原作darknet(c语言编写),在Ubuntu系统上做项目演示。 本系列课程包括三门课: (1)《YOLOv3目标检测实战:训练自己的数据集》 包括:安装darknet、给自己的数据集打标签、整理自己的数据集、修改配置文件、训练自己的数据集、测试训练出的网络模型、性能统计(mAP计算和画出PR曲线)和先验框聚类。 (2)《YOLOv3目标检测:原理与源码解析》讲解YOLOv1、YOLOv2、YOLOv3的原理、程序流程并解析各层的源码。 (3)《YOLOv3目标检测:网络模型改进方法》讲解YOLOv3的改进方法,包括改进1:不显示指定类别目标的方法 (增加功能) ;改进2:合并BN层到卷积层 (加快推理速度) ; 改进3:使用GIoU指标和损失函数 (提高检测精度) ;改进4:tiny YOLOv3 (简化网络模型)并介绍 AlexeyAB/darknet项目。

超详细MySQL安装及基本使用教程

一、下载MySQL 首先,去数据库的官网http://www.mysql.com下载MySQL。 点击进入后的首页如下:  然后点击downloads,community,选择MySQL Community Server。如下图:  滑到下面,找到Recommended Download,然后点击go to download page。如下图:  点击download进入下载页面选择No...

一学即懂的计算机视觉(第一季)

图像处理和计算机视觉的课程大家已经看过很多,但总有“听不透”,“用不了”的感觉。课程致力于创建人人都能听的懂的计算机视觉,通过生动、细腻的讲解配合实战演练,让学生真正学懂、用会。 【超实用课程内容】 课程内容分为三篇,包括视觉系统构成,图像处理基础,特征提取与描述,运动跟踪,位姿估计,三维重构等内容。课程理论与实战结合,注重教学内容的可视化和工程实践,为人工智能视觉研发及算法工程师等相关高薪职位就业打下坚实基础。 【课程如何观看?】 PC端:https://edu.csdn.net/course/detail/26281 移动端:CSDN 学院APP(注意不是CSDN APP哦) 本课程为录播课,课程2年有效观看时长,但是大家可以抓紧时间学习后一起讨论哦~ 【学员专享增值服务】 源码开放 课件、课程案例代码完全开放给你,你可以根据所学知识,自行修改、优化 下载方式:电脑登录https://edu.csdn.net/course/detail/26281,点击右下方课程资料、代码、课件等打包下载

董付国老师Python全栈学习优惠套餐

购买套餐的朋友可以关注微信公众号“Python小屋”,上传付款截图,然后领取董老师任意图书1本。

爬取妹子图片(简单入门)

安装第三方请求库 requests 被网站禁止了访问 原因是我们是Python过来的 重新给一段 可能还是存在用不了,使用网页的 编写代码 上面注意看匹配内容 User-Agent:请求对象 AppleWebKit:请求内核 Chrome浏览器 //请求网页 import requests import re //正则表达式 就是去不规则的网页里面提取有规律的信息 headers = { 'User-Agent':'存放浏览器里面的' } response = requests.get

web网页制作期末大作业

分享思维,改变世界. web网页制作,期末大作业. 所用技术:html css javascript 分享所学所得

技术大佬:我去,你写的 switch 语句也太老土了吧

昨天早上通过远程的方式 review 了两名新来同事的代码,大部分代码都写得很漂亮,严谨的同时注释也很到位,这令我非常满意。但当我看到他们当中有一个人写的 switch 语句时,还是忍不住破口大骂:“我擦,小王,你丫写的 switch 语句也太老土了吧!” 来看看小王写的代码吧,看完不要骂我装逼啊。 private static String createPlayer(PlayerTypes p...

相关热词 c#树形选择 c#中类图的使用方法 c# 传参 调用exe c# 怎么定义方法 c# 修改本地时间 c#前台怎么读取资源文件 c# xml转list c#实现框选截图 m*m乘法表c# c# 乘法99表
立即提问