opencv里面找不到opencv_createsamples.exe如何训练一个分类器

opencv里面找不到opencv_createsamples.exe如何训练一个分类器

现在想自己训练一个分类器但是没有opencv_createsamples.exe都不知道怎么办了

1个回答

版本问题,opencv的新版本里没有createsamples.exe了,在附度加库中,需要下载对应版本的附加库,用cmake编译即可

lynnagirl
lynnagirl 请问在附加库的哪里,改名字了吗,我也搜不到
10 天之前 回复
Csdn user default icon
上传中...
上传图片
插入图片
抄袭、复制答案,以达到刷声望分或其他目的的行为,在CSDN问答是严格禁止的,一经发现立刻封号。是时候展现真正的技术了!
其他相关推荐
关于如何生成opencv_haartraining.exe的方法

大家好,我想问一下,关于在opencv2.4.13中,如何使用haartraining文件夹中的一系列源代码文件生成的opencv_haartraining.exe和opencv_createsamples.exe两个可执行文件的? ![图片说明](https://img-ask.csdn.net/upload/201701/31/1485844108_600955.png) 我想尝试改动源代码进而提高opencv_haartraining.exe训练的.xml文件的性能 我曾尝试过两种方法: 1、根据haartraining中的源程序和头文件的关系,逐一的添加到工程中,但到最后还是有很多报错 2、有百度知道中讲到,使用Cmake对haartraining中的CMakelist.txt文件进行编译生成工程,并用vs打开工程即可看到opencv_haartraining.exe所包含的文件 但这两种方式,中间过程都会产生错误,所以现在还没有成功。 希望csdn中在这方面有所研究的大神,可以帮忙解决下这个问题,谢谢

opencv 用opencv_traincascade.exe训练haar分类器

最后一步我是这样输入的 opencv_traincascade.exe -data dt -vec pos.vec -bg neg/neg.txt -numPos 150 -numNeg 990 -numStages 16 -precalcValbufSize 200 -precalcdxBufSize 1000 -featureType HAAR -w 100 -h 40 每次控制器都直接强制停止退出了,但是我把HAAR改成LBP或者HOG都没有问题,可以运行,请问一下问题出在哪里啊,是HAAR特征需要什么特殊的参数么

opencv_traincascade.exe已停止工作

在网上看训练xml的教程,用了十张人脸图片作为正样本,二十张其他人的图片作为负样本,旨在实现能识别正样本中的那个人。 ----------------------------------------------------------------------------------------- 我的bat文件如下:![图片说明](https://img-ask.csdn.net/upload/201709/20/1505877430_18071.png) 结果报错。 到vs2010里面调试,显示 的报错信息为:opencv_traincascade.exe 中的 0x00007ff6a06c317b 处有未经处理的异常: 0xC0000005: 读取位置 0x0000000000000000 时发生访问冲突

opencv训练样本时出现停止不动

用opencv的opencv_traincascade.exe训练样本时出现如第一幅图中的停止现象,所用参数如第二幅图所示。请问问题出在哪里,怎么解决?![![图片说明](https://img-ask.csdn.net/upload/201607/21/1469071380_400256.png)图片说明](https://img-ask.csdn.net/upload/201607/21/1469071366_775324.png)

使用opencv中的adaboost算法训练分类器时出现traincascade.exe停止工作

![![图片说明](https://img-ask.csdn.net/upload/201804/13/1523582643_397308.png)图片说明](https://img-ask.csdn.net/upload/201804/13/1523582630_811957.png) 电脑是win8.1,64位,内存4G 使用python3.6和opencv3.4进行的操作 样本用的是MIT人脸库 求教

cmake3.17.0 编译OpenCV3.14.10 gcc、windres.exe均报错

gcc编译显示不存在这个文件, windres.exe 就报错 ``` gcc: error: long: No such file or directory C:\mingw64\bin\windres.exe: preprocessing failed. mingw32-make[2]: *** [modules\core\CMakeFiles\opencv_core.dir\build.make:1506: modules/core/CMakeFiles/opencv_core.dir/vs_version.rc.obj] Error 1 mingw32-make[2]: *** Waiting for unfinished jobs.... mingw32-make[1]: *** [CMakeFiles\Makefile2:2237: modules/core/CMakeFiles/opencv_core.dir/all] Error 2 mingw32-make: *** [Makefile:179: all] Error 2 ``` ------------------------------------------------------------- 附上解决办法 关闭cmake里OPENCV_ENABLE_ALLOCATOR_STATS这个选型就可以了 已验证OpenCV4.3.0 和 OpenCV3.14.0

opencv train_cascade.exe生成的xml怎么合并成一个xml文件?

![图片说明](https://img-ask.csdn.net/upload/201906/07/1559897507_859169.png)

为什么我配置了环境变量,opencv3.2程序依然提示丢失opencv_world320.dll

我用的是vs2015开发环境,解决办法是将opencv_world320.dll文件所在的目录”opencv\build\x64\vc14\bin”中的所有文件拷贝到“c:\windows\system32”目录 可是我已经在path环境变量中增加了路径opencv\build\x64\vc14\bin,为什么程序在执行的时候依然找不到opencv_world320.dll???

请问这段opencv代码为什么在debug下无法编译通过,但是release可以通过?

``` #include<opencv2\core\core.hpp> #include<opencv2\highgui\highgui.hpp> using namespace cv; void main() { Mat image=imread("E:\\images\\07.jpg"); namedWindow("img"); imshow("img", image); waitKey(0); } ``` 编译环境为opencv2.4.11+vs2013。这段最简单的测试程序无法在debug下编译通过。 ![图片说明](https://img-ask.csdn.net/upload/201509/17/1442475731_362233.png) ![图片说明](https://img-ask.csdn.net/upload/201509/17/1442475692_384048.png) 附加依赖项为 opencv_calib3d2411.lib opencv_contrib2411.lib opencv_core2411.lib opencv_features2d2411.lib opencv_flann2411.lib opencv_gpu2411.lib opencv_highgui2411.lib opencv_imgproc2411.lib opencv_legacy2411.lib opencv_ml2411d.lib opencv_objdetect2411.lib opencv_ts2411.lib opencv_video2411.lib opencv_nonfree2411.lib opencv_ocl2411.lib opencv_photo2411.lib opencv_stitching2411.lib opencv_superres2411.lib opencv_videostab2411.lib opencv_calib3d2411d.lib opencv_contrib2411d.lib opencv_core2411d.lib opencv_features2d2411d.lib opencv_flann2411d.lib opencv_gpu2411d.lib opencv_highgui2411d.lib opencv_imgproc2411d.lib opencv_legacy2411d.lib opencv_objdetect2411d.lib opencv_ts2411d.lib opencv_video2411d.lib opencv_nonfree2411d.lib opencv_ocl2411d.lib opencv_photo2411d.lib opencv_stitching2411d.lib opencv_superres2411d.lib opencv_videostab2411d.lib 报的错误是 ![图片说明](https://img-ask.csdn.net/upload/201509/17/1442475851_593908.png)

在树莓派(Raspbian系统)下安装open,编译时,cap_ffmpeg.cpp报错不通过

如题,已经两天了!在试了opencv2.4.9,2.4.10,2.3.1三个版本,在make时都是在 同一个地方报错,下贴上报错的内容 modules/highgui/CMakeFiles/opencv_highgui.dir/build.make:215: recipe for target 'modules/highgui/CMakeFiles/opencv_highgui.dir/src/cap_ffmpeg.cpp.o' failed make[2]: *** [modules/highgui/CMakeFiles/opencv_highgui.dir/src/cap_ffmpeg.cpp.o ] Error 1 CMakeFiles/Makefile2:1772: recipe for target 'modules/highgui/CMakeFiles/opencv_ highgui.dir/all' failed make[1]: *** [modules/highgui/CMakeFiles/opencv_highgui.dir/all] Error 2 Makefile:137: recipe for target 'all' failed make: *** [all] Error 2 我怀疑是cap_ffmpeg.h或者cap_ffmpeg.cpp有什么问题,但是不知道该怎么办, 百度了很多,其中这个帖子http://www.xuebuyuan.com/2046558.html似乎问题 和我很相似,但是并没有解决办法。找到了另外一个帖子http://blog.csdn.net/xizero00/article/details/7386695,问题也一样,它给出了解决办法还有改好的cap_ffmpeg.h,但是放上去,还是不管用。 毕设就差这个问题了.....求解救

用cmake编译opencv3.4.0后无法找到opencv_world340.lib 的问题

按照网上给的操作做到了最后一部添加依赖项的时候要求添加”opencv_ts340.lib opencv_world340.lib “这些文件,然而惊讶的发现x86->vc11-lib里面没有这些文件,只有其它的lib。怎么办呢?编译都显示成功的呀。 以下是试运行的代码 #include<iostream> #include <opencv2/core/core.hpp> #include <opencv2/highgui/highgui.hpp> using namespace cv; int main() { // 读入一张图片(游戏原画) Mat img = imread("pic.jpg"); // 创建一个名为 "游戏原画"窗口 namedWindow("游戏原画"); // 在窗口中显示游戏原画 imshow("游戏原画", img); // 等待6000 ms后窗口自动关闭 waitKey(6000); }

opencv找不到dll的问题

![1](https://img-ask.csdn.net/upload/201712/06/1512555025_264526.png) 如上图所示,运行程序时提示找不到opencv_highgui331.dll(后面还跟着找不到一大堆opencv的dll)。可问题是我已经把opencv的动态链接库文件添加到系统路径中了啊,![图片说明](https://img-ask.csdn.net/upload/201712/06/1512555292_491256.png) ![图片说明](https://img-ask.csdn.net/upload/201712/06/1512555637_438385.png) 有谁知道错误的原因吗?

windows环境下codeblocks17.12 用cmake配置opencv3.4.7出现如下错误

试了好多次了,参考了不少博主的文章编译,还是有错 ``` F:/mingw64/bin/../lib/gcc/x86_64-w64-mingw32/7.3.0/../../../../x86_64-w64-mingw32/bin/ld.exe: i386 architecture of input file `CMakeFiles\opencv_core.dir/objects.a(vs_version.rc.obj)' is incompatible with i386:x86-64 output collect2.exe: error: ld returned 1 exit status modules\core\CMakeFiles\opencv_core.dir\build.make:1843: recipe for target 'bin/libopencv_core340.dll' failed mingw32-make[2]: *** [bin/libopencv_core340.dll] Error 1 CMakeFiles\Makefile2:1686: recipe for target 'modules/core/CMakeFiles/opencv_core.dir/all' failed mingw32-make[1]: *** [modules/core/CMakeFiles/opencv_core.dir/all] Error 2 Makefile:161: recipe for target 'all' failed mingw32-make: *** [all] Error 2 ```

ubuntu12.04下 opencv库交叉编译后 动态库找不到

ubuntu上我装了pc 和arm 两个版本的opencv2.4.9 目录分别是/usr/local/opencv2.4.9 和/opt/opencv2.4.9-for-arm pc版本的库文件都在/usr/local/lib下 arm版本库文件在/opt/opencv2.4.9-for-arm/lib下 whereis libopencv___core 的时候,只列出的/usr/local/lib/libopencv_core.so 交叉编译器在/opt/Embedsky/gcc-4.6.2-glibc-2.13-linaro-multilib-2011.12/tq-linaro-toolchain/bin下 我写一个opencv测试程序test.cpp 交叉编译出现警告 ``` # arm-linux-g++ -o test test.cpp -I /opt/opencv2.4.9-for-arm/lib/include -L /opt/opencv2.4.9-for-arm/lib -lopencv_core -lopencv_highgui -lpthread -lrt In file included from /opt/opencv2.4.9-for-arm/lib/include/opencv2/flann/kmeans_index.h:50:0, from /opt/opencv2.4.9-for-arm/lib/include/opencv2/flann/all_indices.h:38, from /opt/opencv2.4.9-for-arm/lib/include/opencv2/flann/flann_base.hpp:44, from /opt/opencv2.4.9-for-arm/lib/include/opencv2/flann/flann.hpp:50, from /opt/opencv2.4.9-for-arm/lib/include/opencv/cv.h:69, from test.cpp:2: /opt/opencv2.4.9-for-arm/lib/include/opencv2/flann/logger.h:73:9: note: the mangling of 'va_list' has changed in GCC 4.4 /opt/Embedsky/gcc-4.6.2-glibc-2.13-linaro-multilib-2011.12/tq-linaro-toolchain/bin/../lib/gcc/arm-fsl-linux-gnueabi/4.6.2/../../../../arm-fsl-linux-gnueabi/bin/ld: warning: ../../lib/libopencv_core.so, needed by /opt/opencv2.4.9-for-arm/lib/libopencv_highgui.so, not found (try using -rpath or -rpath-link) /opt/Embedsky/gcc-4.6.2-glibc-2.13-linaro-multilib-2011.12/tq-linaro-toolchain/bin/../lib/gcc/arm-fsl-linux-gnueabi/4.6.2/../../../../arm-fsl-linux-gnueabi/bin/ld: warning: ../../lib/libopencv_imgproc.so, needed by /opt/opencv2.4.9-for-arm/lib/libopencv_highgui.so, not found (try using -rpath or -rpath-link) root@tsie-All-Series:/home/tsie/nfs/test/opencv_test# whereis libopencv_core libopencv_core: /usr/local/lib/libopencv_core.so ``` 这里面好像用到交叉编译器的ld,找opencv的.so文件看提示是跑到交叉编译器所在文件夹里面的lib去找?? 我也吧opencv的交叉库放到这个文件夹里面,再编译还是同样的问题 然后我尝试加上运行时库路径参数 -Wl,-rpath,/opt/opencv2.4.9-for-arm/lib,再编译,弹出来一样的信息。 然后,就没有然后了。我晕 这究竟谁什么问题啊 求各路大神给点思路

opencv打开视频错误cap_ffmpeg_impl.hpp:365

opencv打开视频出现错误提示! 很多人说是路径错误,但我很确定,视频路径没有错误呀!请问这怎么解决呀?

求助帖!!!ubuntu18.04 安装opencv4.0.0源码无限次出现如下问题

./src/image_opencv.cpp: In function ‘IplImage* image_to_ipl(image)’: ./src/image_opencv.cpp:16:5: error: ‘IPlImage’ was not declared in this scope IPlImage *disp = cvCreateImage(cvSize(im.w,im.h), IPL_DEPTH_8U, im.c); ^~~~~~~~ compilation terminated due to -Wfatal-errors. Makefile:86: recipe for target 'obj/image_opencv.o' failed make: *** [obj/image_opencv.o] Error 1 make: *** Waiting for unfinished jobs.... 但我在src文件夹中的image_opencv.cpp中也引入了#include "opencv2/imgproc/imgproc_c.h" 求助实在不知道怎么办了

linux安装opencv是make出错

[ 7%] Built target libwebp [ 7%] Built target opencv_test_core_pch_dephelp [ 7%] Built target opencv_core_pch_dephelp [ 7%] Built target opencv_ts_pch_dephelp [ 7%] Built target pch_Generate_opencv_ts [ 7%] Built target pch_Generate_opencv_core [ 7%] Building CXX object modules/core/CMakeFiles/opencv_core.dir/src/hal_internal.cpp.o /home/w/opencv-3.2.0/modules/core/src/hal_internal.cpp: In function ‘int lapack_gemm_c(const fptype*, size_t, const fptype*, size_t, fptype, const fptype*, size_t, fptype, fptype*, size_t, int, int, int, int)’: /home/w/opencv-3.2.0/modules/core/src/hal_internal.cpp:437: error: expected unqualified-id before ‘__complex__’ /home/w/opencv-3.2.0/modules/core/src/hal_internal.cpp:437: error: expected ‘)’ before ‘__complex__’ /home/w/opencv-3.2.0/modules/core/src/hal_internal.cpp:438: error: expected unqualified-id before ‘__complex__’ /home/w/opencv-3.2.0/modules/core/src/hal_internal.cpp:438: error: expected ‘)’ before ‘__complex__’ /home/w/opencv-3.2.0/modules/core/src/hal_internal.cpp:439: error: expected unqualified-id before ‘__complex__’ /home/w/opencv-3.2.0/modules/core/src/hal_internal.cpp:439: error: expected ‘)’ before ‘__complex__’ /home/w/opencv-3.2.0/modules/core/src/hal_internal.cpp:440: error: expected unqualified-id before ‘__complex__’ /home/w/opencv-3.2.0/modules/core/src/hal_internal.cpp:440: error: expected ‘)’ before ‘__complex__’ /home/w/opencv-3.2.0/modules/core/src/hal_internal.cpp:443: error: expected unqualified-id before ‘__complex__’ /home/w/opencv-3.2.0/modules/core/src/hal_internal.cpp:443: error: expected ‘;’ before ‘__complex__’ /home/w/opencv-3.2.0/modules/core/src/hal_internal.cpp:444: error: expected unqualified-id before ‘__complex__’ /home/w/opencv-3.2.0/modules/core/src/hal_internal.cpp:444: error: expected ‘;’ before ‘__complex__’ /home/w/opencv-3.2.0/modules/core/src/hal_internal.cpp:494: error: expected unqualified-id before ‘__complex__’ /home/w/opencv-3.2.0/modules/core/src/hal_internal.cpp:494: error: expected ‘)’ before ‘__complex__’ /home/w/opencv-3.2.0/modules/core/src/hal_internal.cpp:496: error: expected unqualified-id before ‘__complex__’ /home/w/opencv-3.2.0/modules/core/src/hal_internal.cpp:496: error: expected ‘)’ before ‘__complex__’ /home/w/opencv-3.2.0/modules/core/src/hal_internal.cpp:501: error: expected unqualified-id before ‘__complex__’ /home/w/opencv-3.2.0/modules/core/src/hal_internal.cpp:501: error: expected ‘)’ before ‘__complex__’ /home/w/opencv-3.2.0/modules/core/src/hal_internal.cpp:504: error: ‘cAlpha’ was not declared in this scope /home/w/opencv-3.2.0/modules/core/src/hal_internal.cpp:504: error: ‘cBeta’ was not declared in this scope /home/w/opencv-3.2.0/modules/core/src/hal_internal.cpp:506: error: ‘cAlpha’ was not declared in this scope /home/w/opencv-3.2.0/modules/core/src/hal_internal.cpp:506: error: ‘cBeta’ was not declared in this scope /home/w/opencv-3.2.0/modules/core/src/hal_internal.cpp: In function ‘int lapack_gemm_c(const fptype*, size_t, const fptype*, size_t, fptype, const fptype*, size_t, fptype, fptype*, size_t, int, int, int, int) [with fptype = float]’: /home/w/opencv-3.2.0/modules/core/src/hal_internal.cpp:591: instantiated from here /home/w/opencv-3.2.0/modules/core/src/hal_internal.cpp:439: warning: unused variable ‘ldsrc3’ [-Wunused-variable] /home/w/opencv-3.2.0/modules/core/src/hal_internal.cpp: At global scope: /home/w/opencv-3.2.0/modules/core/src/hal_internal.cpp:434: warning: unused parameter ‘alpha’ [-Wunused-parameter] /home/w/opencv-3.2.0/modules/core/src/hal_internal.cpp: In function ‘int lapack_gemm_c(const fptype*, size_t, const fptype*, size_t, fptype, const fptype*, size_t, fptype, fptype*, size_t, int, int, int, int) [with fptype = double]’: /home/w/opencv-3.2.0/modules/core/src/hal_internal.cpp:598: instantiated from here /home/w/opencv-3.2.0/modules/core/src/hal_internal.cpp:439: warning: unused variable ‘ldsrc3’ [-Wunused-variable] /home/w/opencv-3.2.0/modules/core/src/hal_internal.cpp: At global scope: /home/w/opencv-3.2.0/modules/core/src/hal_internal.cpp:434: warning: unused parameter ‘alpha’ [-Wunused-parameter] modules/core/CMakeFiles/opencv_core.dir/build.make:930: recipe for target 'modules/core/CMakeFiles/opencv_core.dir/src/hal_internal.cpp.o' failed make[2]: *** [modules/core/CMakeFiles/opencv_core.dir/src/hal_internal.cpp.o] Error 1 CMakeFiles/Makefile2:1289: recipe for target 'modules/core/CMakeFiles/opencv_core.dir/all' failed make[1]: *** [modules/core/CMakeFiles/opencv_core.dir/all] Error 2 Makefile:160: recipe for target 'all' failed make: *** [all] Error 2

WINDOWS下用Cmake弄CodeBlocks + OPenCV 3.3配置时出错

![图片说明](https://img-ask.csdn.net/upload/201709/01/1504234665_410763.png) ![图片说明](https://img-ask.csdn.net/upload/201709/01/1504234672_719273.png) 这个文件 Building RC object modules/core/CMakeFiles/opencv_core.dir/vs_version.rc. obj 有没有大神救救我...

opencv3.1.0交叉编译出错

我在给mini2440移植opencv3.1.0的时候,make编译opencv过程中出错了。log如下: CMakeFiles/opencv_perf_core.dir/perf/perf_math.cpp.obj: In function `cv::Mat::~Mat()': perf_math.cpp.text._ZN2cv3MatD1Ev[cv::Mat::~Mat()]+0x1c): undefined reference to `__sync_fetch_and_add_4' CMakeFiles/opencv_perf_core.dir/perf/perf_compare.cpp.obj: In function `Size_MatType_CmpType_compare:erfTestBody()': perf_compare.cpp.text._ZN28Size_MatType_CmpType_compare12PerfTestBodyEv+0x30c): undefined reference to `__sync_fetch_and_add_4' perf_compare.cpp.text._ZN28Size_MatType_CmpType_compare12PerfTestBodyEv+0x378): undefined reference to `__sync_fetch_and_add_4' perf_compare.cpp.text._ZN28Size_MatType_CmpType_compare12PerfTestBodyEv+0x3ec): undefined reference to `__sync_fetch_and_add_4' CMakeFiles/opencv_perf_core.dir/perf/perf_compare.cpp.obj: In function `Size_MatType_CmpType_compareScalar:erfTestBody()': perf_compare.cpp.text._ZN34Size_MatType_CmpType_compareScalar12PerfTestBodyEv+0x32c): undefined reference to `__sync_fetch_and_add_4' CMakeFiles/opencv_perf_core.dir/perf/perf_compare.cpp.obj:perf_compare.cpp.text._ZN34Size_MatType_CmpType_compareScalar12PerfTestBodyEv+0x3a0): more undefined references to `__sync_fetch_and_add_4' follow collect2: ld returned 1 exit status make[2]: *** [bin/opencv_perf_core] Error 1 make[1]: *** [modules/core/CMakeFiles/opencv_perf_core.dir/all] Error 2 make: *** [all] Error 2 我用的是Ubuntu14.04,32位虚拟机。 查网上说是CMAKE_C_FLAGS要设为-march=armv4t 可是我安装提示设置了CMAKE_C_FLAGS 和 CMAKE_CXX_FLAGS的值,错误还是没有消失。 我试过了opencv3.1。0和opencv3.2.0了,都会出现这个问题。因为项目需求要用到opencv3 所以只能自己编译最新版,,泪奔 有大神遇到过这个问题吗?

初级玩转Linux+Ubuntu(嵌入式开发基础课程)

课程主要面向嵌入式Linux初学者、工程师、学生 主要从一下几方面进行讲解: 1.linux学习路线、基本命令、高级命令 2.shell、vi及vim入门讲解 3.软件安装下载、NFS、Samba、FTP等服务器配置及使用

我以为我对Mysql事务很熟,直到我遇到了阿里面试官

太惨了,面试又被吊打

Python代码实现飞机大战

文章目录经典飞机大战一.游戏设定二.我方飞机三.敌方飞机四.发射子弹五.发放补给包六.主模块 经典飞机大战 源代码以及素材资料(图片,音频)可从下面的github中下载: 飞机大战源代码以及素材资料github项目地址链接 ————————————————————————————————————————————————————————— 不知道大家有没有打过飞机,喜不喜欢打飞机。当我第一次接触这个东西的时候,我的内心是被震撼到的。第一次接触打飞机的时候作者本人是身心愉悦的,因为周边的朋友都在打飞机, 每

Python数据分析与挖掘

92讲视频课+16大项目实战+源码+¥800元课程礼包+讲师社群1V1答疑+社群闭门分享会=99元 &nbsp; 为什么学习数据分析? &nbsp; &nbsp; &nbsp; 人工智能、大数据时代有什么技能是可以运用在各种行业的?数据分析就是。 &nbsp; &nbsp; &nbsp; 从海量数据中获得别人看不见的信息,创业者可以通过数据分析来优化产品,营销人员可以通过数据分析改进营销策略,产品经理可以通过数据分析洞察用户习惯,金融从业者可以通过数据分析规避投资风险,程序员可以通过数据分析进一步挖掘出数据价值,它和编程一样,本质上也是一个工具,通过数据来对现实事物进行分析和识别的能力。不管你从事什么行业,掌握了数据分析能力,往往在其岗位上更有竞争力。 &nbsp;&nbsp; 本课程共包含五大模块: 一、先导篇: 通过分析数据分析师的一天,让学员了解全面了解成为一个数据分析师的所有必修功法,对数据分析师不在迷惑。 &nbsp; 二、基础篇: 围绕Python基础语法介绍、数据预处理、数据可视化以及数据分析与挖掘......这些核心技能模块展开,帮助你快速而全面的掌握和了解成为一个数据分析师的所有必修功法。 &nbsp; 三、数据采集篇: 通过网络爬虫实战解决数据分析的必经之路:数据从何来的问题,讲解常见的爬虫套路并利用三大实战帮助学员扎实数据采集能力,避免没有数据可分析的尴尬。 &nbsp; 四、分析工具篇: 讲解数据分析避不开的科学计算库Numpy、数据分析工具Pandas及常见可视化工具Matplotlib。 &nbsp; 五、算法篇: 算法是数据分析的精华,课程精选10大算法,包括分类、聚类、预测3大类型,每个算法都从原理和案例两个角度学习,让你不仅能用起来,了解原理,还能知道为什么这么做。

如何在虚拟机VM上使用串口

在系统内核开发中,经常会用到串口调试,利用VMware的Virtual Machine更是为调试系统内核如虎添翼。那么怎么搭建串口调试环境呢?因为最近工作涉及到这方面,利用强大的google搜索和自己

程序员的兼职技能课

获取讲师答疑方式: 在付费视频第一节(触摸命令_ALL)片头有二维码及加群流程介绍 限时福利 原价99元,今日仅需39元!购课添加小助手(微信号:csdn590)按提示还可领取价值800元的编程大礼包! 讲师介绍: 苏奕嘉&nbsp;前阿里UC项目工程师 脚本开发平台官方认证满级(六级)开发者。 我将如何教会你通过【定制脚本】赚到你人生的第一桶金? 零基础程序定制脚本开发课程,是完全针对零脚本开发经验的小白而设计,课程内容共分为3大阶段: ①前期将带你掌握Q开发语言和界面交互开发能力; ②中期通过实战来制作有具体需求的定制脚本; ③后期将解锁脚本的更高阶玩法,打通任督二脉; ④应用定制脚本合法赚取额外收入的完整经验分享,带你通过程序定制脚本开发这项副业,赚取到你的第一桶金!

MFC一站式终极全套课程包

该套餐共包含从C小白到C++到MFC的全部课程,整套学下来绝对成为一名C++大牛!!!

C++语言基础视频教程

C++语言基础视频培训课程:本课与主讲者在大学开出的程序设计课程直接对接,准确把握知识点,注重教学视频与实践体系的结合,帮助初学者有效学习。本教程详细介绍C++语言中的封装、数据隐藏、继承、多态的实现等入门知识;主要包括类的声明、对象定义、构造函数和析构函数、运算符重载、继承和派生、多态性实现等。 课程需要有C语言程序设计的基础(可以利用本人开出的《C语言与程序设计》系列课学习)。学习者能够通过实践的方式,学会利用C++语言解决问题,具备进一步学习利用C++开发应用程序的基础。

北京师范大学信息科学与技术学院笔试10复试真题

北京师范大学信息科学与技术学院笔试,可以更好的让你了解北师大该学院的复试内容,获得更好的成绩。

深度学习原理+项目实战+算法详解+主流框架(套餐)

深度学习系列课程从深度学习基础知识点开始讲解一步步进入神经网络的世界再到卷积和递归神经网络,详解各大经典网络架构。实战部分选择当下最火爆深度学习框架PyTorch与Tensorflow/Keras,全程实战演示框架核心使用与建模方法。项目实战部分选择计算机视觉与自然语言处理领域经典项目,从零开始详解算法原理,debug模式逐行代码解读。适合准备就业和转行的同学们加入学习! 建议按照下列课程顺序来进行学习 (1)掌握深度学习必备经典网络架构 (2)深度框架实战方法 (3)计算机视觉与自然语言处理项目实战。(按照课程排列顺序即可)

网络工程师小白入门--【思科CCNA、华为HCNA等网络工程师认证】

本课程适合CCNA或HCNA网络小白同志,高手请绕道,可以直接学习进价课程。通过本预科课程的学习,为学习网络工程师、思科CCNA、华为HCNA这些认证打下坚实的基础! 重要!思科认证2020年2月24日起,已启用新版认证和考试,包括题库都会更新,由于疫情原因,请关注官网和本地考点信息。题库网络上很容易下载到。

Python界面版学生管理系统

前不久上传了一个控制台版本的学生管理系统,这个是Python界面版学生管理系统,这个是使用pycharm开发的一个有界面的学生管理系统,基本的增删改查,里面又演示视频和完整代码,有需要的伙伴可以自行下

软件测试2小时入门

本课程内容系统、全面、简洁、通俗易懂,通过2个多小时的介绍,让大家对软件测试有个系统的理解和认识,具备基本的软件测试理论基础。 主要内容分为5个部分: 1 软件测试概述,了解测试是什么、测试的对象、原则、流程、方法、模型;&nbsp; 2.常用的黑盒测试用例设计方法及示例演示;&nbsp; 3 常用白盒测试用例设计方法及示例演示;&nbsp; 4.自动化测试优缺点、使用范围及示例‘;&nbsp; 5.测试经验谈。

Tomcat服务器下载、安装、配置环境变量教程(超详细)

未经我的允许,请不要转载我的文章,在此郑重声明!!! 请先配置安装好Java的环境,若没有安装,请参照我博客上的步骤进行安装! 安装Java环境教程https://blog.csdn.net/qq_40881680/article/details/83585542 Tomcat部署Web项目(一)·内嵌https://blog.csdn.net/qq_40881680/article/d...

2019数学建模A题高压油管的压力控制 省一论文即代码

2019数学建模A题高压油管的压力控制省一完整论文即详细C++和Matlab代码,希望对同学们有所帮助

图书管理系统(Java + Mysql)我的第一个完全自己做的实训项目

图书管理系统 Java + MySQL 完整实训代码,MVC三层架构组织,包含所有用到的图片资源以及数据库文件,大三上学期实训,注释很详细,按照阿里巴巴Java编程规范编写

linux下利用/proc进行进程树的打印

在linux下利用c语言实现的进程树的打印,主要通过/proc下的目录中的进程文件,获取status中的进程信息内容,然后利用递归实现进程树的打印

微信小程序开发实战之番茄时钟开发

微信小程序番茄时钟视频教程,本课程将带着各位学员开发一个小程序初级实战类项目,针对只看过官方文档而又无从下手的开发者来说,可以作为一个较好的练手项目,对于有小程序开发经验的开发者而言,可以更好加深对小程序各类组件和API 的理解,为更深层次高难度的项目做铺垫。

[已解决]踩过的坑之mysql连接报“Communications link failure”错误

目录 前言 第一种方法: 第二种方法 第三种方法(适用于项目和数据库在同一台服务器) 第四种方法 第五种方法(项目和数据库不在同一台服务器) 总结 前言 先给大家简述一下我的坑吧,(我用的是mysql,至于oracle有没有这样的问题,有心的小伙伴们可以测试一下哈), 在自己做个javaweb测试项目的时候,因为买的是云服务器,所以数据库连接的是用ip地址,用IDE开发好...

人工智能-计算机视觉实战之路(必备算法+深度学习+项目实战)

系列课程主要分为3大阶段:(1)首先掌握计算机视觉必备算法原理,结合Opencv进行学习与练手,通过实际视项目进行案例应用展示。(2)进军当下最火的深度学习进行视觉任务实战,掌握深度学习中必备算法原理与网络模型架构。(3)结合经典深度学习框架与实战项目进行实战,基于真实数据集展开业务分析与建模实战。整体风格通俗易懂,项目驱动学习与就业面试。 建议同学们按照下列顺序来进行学习:1.Python入门视频课程 2.Opencv计算机视觉实战(Python版) 3.深度学习框架-PyTorch实战/人工智能框架实战精讲:Keras项目 4.Python-深度学习-物体检测实战 5.后续实战课程按照自己喜好选择就可以

2019 AI开发者大会

2019 AI开发者大会(AI ProCon 2019)是由中国IT社区CSDN主办的AI技术与产业年度盛会。多年经验淬炼,如今蓄势待发:2019年9月6-7日,大会将有近百位中美顶尖AI专家、知名企业代表以及千余名AI开发者齐聚北京,进行技术解读和产业论证。我们不空谈口号,只谈技术,诚挚邀请AI业内人士一起共铸人工智能新篇章!

机器学习初学者必会的案例精讲

通过六个实际的编码项目,带领同学入门人工智能。这些项目涉及机器学习(回归,分类,聚类),深度学习(神经网络),底层数学算法,Weka数据挖掘,利用Git开源项目实战等。

Python数据分析师-实战系列

系列课程主要包括Python数据分析必备工具包,数据分析案例实战,核心算法实战与企业级数据分析与建模解决方案实战,建议大家按照系列课程阶段顺序进行学习。所有数据集均为企业收集的真实数据集,整体风格以实战为导向,通俗讲解Python数据分析核心技巧与实战解决方案。

YOLOv3目标检测实战系列课程

《YOLOv3目标检测实战系列课程》旨在帮助大家掌握YOLOv3目标检测的训练、原理、源码与网络模型改进方法。 本课程的YOLOv3使用原作darknet(c语言编写),在Ubuntu系统上做项目演示。 本系列课程包括三门课: (1)《YOLOv3目标检测实战:训练自己的数据集》 包括:安装darknet、给自己的数据集打标签、整理自己的数据集、修改配置文件、训练自己的数据集、测试训练出的网络模型、性能统计(mAP计算和画出PR曲线)和先验框聚类。 (2)《YOLOv3目标检测:原理与源码解析》讲解YOLOv1、YOLOv2、YOLOv3的原理、程序流程并解析各层的源码。 (3)《YOLOv3目标检测:网络模型改进方法》讲解YOLOv3的改进方法,包括改进1:不显示指定类别目标的方法 (增加功能) ;改进2:合并BN层到卷积层 (加快推理速度) ; 改进3:使用GIoU指标和损失函数 (提高检测精度) ;改进4:tiny YOLOv3 (简化网络模型)并介绍 AlexeyAB/darknet项目。

2021考研数学张宇基础30讲.pdf

张宇:博士,全国著名考研数学辅导专家,教育部“国家精品课程建设骨干教师”,全国畅销书《张宇高等数学18讲》《张宇线性代数9讲》《张宇概率论与数理统计9讲》《张宇考研数学题源探析经典1000题》《张宇考

三个项目玩转深度学习(附1G源码)

从事大数据与人工智能开发与实践约十年,钱老师亲自见证了大数据行业的发展与人工智能的从冷到热。事实证明,计算机技术的发展,算力突破,海量数据,机器人技术等,开启了第四次工业革命的序章。深度学习图像分类一直是人工智能的经典任务,是智慧零售、安防、无人驾驶等机器视觉应用领域的核心技术之一,掌握图像分类技术是机器视觉学习的重中之重。针对现有线上学习的特点与实际需求,我们开发了人工智能案例实战系列课程。打造:以项目案例实践为驱动的课程学习方式,覆盖了智能零售,智慧交通等常见领域,通过基础学习、项目案例实践、社群答疑,三维立体的方式,打造最好的学习效果。

DirectX修复工具V4.0增强版

DirectX修复工具(DirectX Repair)是一款系统级工具软件,简便易用。本程序为绿色版,无需安装,可直接运行。 本程序的主要功能是检测当前系统的DirectX状态,如果发现异常则进行修复

期末考试评分标准的数学模型

大学期末考试与高中的考试存在很大的不同之处,大学的期末考试成绩是主要分为两个部分:平时成绩和期末考试成绩。平时成绩和期末考试成绩总分一般为一百分,然而平时成绩与期末考试成绩所占的比例不同会导致出现不同

Vue.js 2.0之全家桶系列视频课程

基于新的Vue.js 2.3版本, 目前新全的Vue.js教学视频,让你少走弯路,直达技术前沿! 1. 包含Vue.js全家桶(vue.js、vue-router、axios、vuex、vue-cli、webpack、ElementUI等) 2. 采用笔记+代码案例的形式讲解,通俗易懂

c语言项目开发实例

十个c语言案例 (1)贪吃蛇 (2)五子棋游戏 (3)电话薄管理系统 (4)计算器 (5)万年历 (6)电子表 (7)客户端和服务器通信 (8)潜艇大战游戏 (9)鼠标器程序 (10)手机通讯录系统

相关热词 c#中如何设置提交按钮 c#帮助怎么用 c# 读取合并单元格的值 c#带阻程序 c# 替换span内容 c# rpc c#控制台点阵字输出 c#do while循环 c#调用dll多线程 c#找出两个集合不同的
立即提问