QT 在debug模式下正常运行,在release模式下出错?

图片说明

c++

2个回答

找到这个提供keypressevent事件的那个链接库(dll),放到你的exe文件夹内

qq_35987242
qq_35987242 应该不是,我新建了一个项目,啥都没动,用release生成,还是打不开,用windeployqt也没用
3 个月之前 回复

可能那个动态库是Debug版本的,要编译成release版

Csdn user default icon
上传中...
上传图片
插入图片
抄袭、复制答案,以达到刷声望分或其他目的的行为,在CSDN问答是严格禁止的,一经发现立刻封号。是时候展现真正的技术了!
其他相关推荐
vs2015+Qt5.9.1程序在debug模式下一切正常,切换到release模式后报如下错误,求教!

![图片说明](https://img-ask.csdn.net/upload/202005/21/1590051036_284627.png)

关于Qt Creator Debug模式下 opencv的imwrite()运行时出错的问题

遇到的问题如题。我用Qt写了一个简单的测试程序,由于需要用到opencv,我先在.pro文件中添加了如下代码: ``` INCLUDEPATH+=D:\Work_Software\OpenCV3.1\opencv\build\include LIBS+=D:\Work_Software\OpenCV3.1\opencv\build\x64\vc12\lib\*.lib ``` 之后,新建一个按键,按键的槽函数如下: ``` void MainWindow::on_pushButton_clicked() { Mat img; img=imread("F:\\My_Desktop\\foot1.jpg",0); imwrite("F:\\My_Desktop\\result.jpg",img); namedWindow("test"); imshow("test",img); waitKey(0); } ``` 在Release模式下,可以正常地保存和显示图片,但是在Debug模式下,运行到imwrite的时候就会出错,报错的信息如下图: ![图片说明](https://img-ask.csdn.net/upload/201610/17/1476677672_7422.jpg) 有没有知道是怎么回事的朋友?求指点。

在 qt运行程序在执行Debug模式构件时,弹出提示信息出错

qt版本号为qt-opensource-windows-x86-mingw492-5.6.1-1 在执行Release模式构建时正常,但在执行Debug模式构建时,出现以下错误 this application has requested the runtime to terminate it in an unusual way. please contact the application's support team for more information ![图片说明](https://img-ask.csdn.net/upload/201806/12/1528787131_70458.png) 尝试按照网上方法修改系统环境变量,在Path中添加Qt的bin路径,但是结果还是以上错误信息;我有试着换了qt creatot 版本,仍然不行. 又尝试以下方法: 1、开始--运行--输入cmd。 2、输入 cd %windir%\system32 (进入windows安装目录的system32文件夹) 3、输入 Regsvr32 Msxml3.dll 但是程序运行时仍然报以上错误信息。请教各位大师,出现以上错误,该如何解决?

qt开发release 版本正常运行,debug版本无法启动是怎么回事啊?

windows下开发,代码没有问题,之前debug模式也是能够启动的, ![图片说明](https://img-ask.csdn.net/upload/202005/26/1590468374_720885.png) 不知道怎么回事就这样了: debug模式下运行是这样的: ![图片说明](https://img-ask.csdn.net/upload/202005/26/1590468155_269490.png) release下运行正常。调试的话会出现: ![图片说明](https://img-ask.csdn.net/upload/202005/26/1590468259_438707.png) 点击debug模式运行生成的.exe文件,没有报错的弹窗,也没有ui界面生成,就是没反应。 不知道怎么处理了,请求大神帮忙,感谢!

同一个动态链接库,debug版行了,但release版不行

请求高手,大师点拨 在VC++6.0环境下,我把一个运算程序做成动态链接库,取名为(wsxdll),在debug状态下生成的(wsxdll.dll和wsxdll.lib)调试通过,其外部函数也能被另一个应用程序(usewsx)正常调用完成运算。但同一个(wsxdll),在release状态下生成的(wsxdll.dll和wsxdll.lib)虽也能被应用程序(usewsx)调用,但运算出错。以下是一些细节说明 ◆在release状态下编译(wsxdll)虽通过,但有warning Linking... Creating library Release/wsxdll.lib and object Release/wsxdll.exp LINK : warning LNK4089: all references to "GDI32.dll" discarded by /OPT:REF wsxdll.dll - 0 error(s), ◆(wsxdll)中用了堆结构的数据变量, 我发现,用debug版的(wsxdll.dll和wsxdll.lib)时,给堆分配物理内存后,堆变量中的默认值正常,如整型变量的默认值是(-842150451),但用Release版的(wsxdll.dll和wsxdll.lib)时,给堆分配物理内存后,堆变量中的默认值不正常,如整型变量的默认值是(3736336)或(0),甚至是(-1.#QNAN)。 注:给堆分配物理内存和释放分配于之的物理内存已在(wsxdll)中正确使用,否则debug版也通不过。

Qt for android,在手机上运行出错。

Qt5.3.项目在桌面版能正常运行和调试。在android上可以把应用装在手机上,但是运行提示停止运行,也不能调试。调试弹出提示信息: This does not seem to be a "Debug" build. Setting breakpoints by file name and line number may fail. Section .debug_info: Not found. Section .debug_abbrev: Not found. Section .debug_line: Not found. Section .debug_str: Not found. Section .debug_loc: Not found. Section .debug_range: Not found. Section .gdb_index: Not found. Section .note.gnu.build-id: Not found. Section .gnu.hash: Not found. Section .gnu_debuglink: Not found. 在应用程序输出窗口提示:启动远端进程。E/Trace (10338): error opening trace file: No such file or directory (2) 本项目使用了.so文件,在pro文件下配置为: QT += core gui greaterThan(QT_MAJOR_VERSION, 4): QT += widgets TARGET = aisMessTest TEMPLATE = app SOURCES += main.cpp\ widget.cpp HEADERS += widget.h FORMS += widget.ui QT+=network #win32:CONFIG(release, debug|release): LIBS += -L$$PWD/release/ -lLibAisParse #else:win32:CONFIG(debug, debug|release): LIBS += -L$$PWD/debug/ -lLibAisParse #else:unix: LIBS += -L$$PWD/ -lLibAisParse INCLUDEPATH += $$PWD/ DEPENDPATH += $$PWD/ LIBS += \ libLibAisParse.so OTHER_FILES += 问题何在?????

Qt5.8编译出错 File Makefile.Debug doesn't exist.

我只是新建了一个工程,没修改任何代码,运行后就这样了。![图片说明](https://img-ask.csdn.net/upload/201702/17/1487328911_198620.png)

qt creator 配置 cuda8.0 出错

错误内容: NMAKE:-1: warning: U4004: 目标“cuda\composer_cuda.obj”的规则太多 NMAKE:-1: error: U1073: 不知道如何生成“main.cpp” NMAKE:-1: error: U1077: “"D:\software\Visual Studio 2015\VC\BIN\amd64\nmake.exe"”: 返回代码“0x2” pro文件内容: QT += core gui greaterThan(QT_MAJOR_VERSION, 4): QT += widgets TARGET = test_cuda TEMPLATE = app SOURCES += main.cpp\ dialog.cpp \ HEADERS += dialog.h \ gutil.h \ composer_gpu.h \ FORMS += dialog.ui OTHER_FILES += composer.cu CUDA_OBJECTS_DIR= OBJECTS_DIR/../cuda CUDA_SOURCES += composer.cu CUDA_DIR = "C:/Program Files/NVIDIA GPU Computing Toolkit/CUDA/v8.0" CUDA_SDK = "C:/ProgramData/NVIDIA Corporation/CUDA Samples/v8.0" INCLUDEPATH += $$CUDA_DIR/include INCLUDEPATH += $$CUDA_SDK/common/inc QMAKE_LIBDIR += $$CUDA_DIR/lib/x64 QMAKE_LIBDIR += $$CUDA_SDK/common/lib/x64 SYSTEM_TYPE = 64 # '32' or '64', depending on your system LIBS += -lcuda -lcudart -lcublas CUDA_ARCH = sm_30 NVCC_OPTIONS = --use_fast_math CUDA_INC = $$join(INCLUDEPATH,'" -I"','-I"','"') MSVCRT_LINK_FLAG_DEBUG = "/MDd" MSVCRT_LINK_FLAG_RELEASE = "/MD" QMAKE_EXTRA_COMPILERS += cuda CONFIG(debug, debug|release) { # Debug mode cuda_d.input = CUDA_SOURCES cuda_d.output = $$CUDA_OBJECTS_DIR/${QMAKE_FILE_BASE}_cuda.obj cuda_d.commands = $$CUDA_DIR/bin/nvcc.exe -D_DEBUG $$NVCC_OPTIONS $$CUDA_INC $$LIBS --machine $$SYSTEM_TYPE \ -arch=$$CUDA_ARCH -c -o ${QMAKE_FILE_OUT} ${QMAKE_FILE_NAME} -Xcompiler $$MSVCRT_LINK_FLAG_DEBUG cuda_d.dependency_type = TYPE_C QMAKE_EXTRA_COMPILERS += cuda_d } else { # Release mode cuda.input = CUDA_SOURCES cuda.output = $$CUDA_OBJECTS_DIR/${QMAKE_FILE_BASE}_cuda.obj cuda.commands = $$CUDA_DIR/bin/nvcc.exe $$NVCC_OPTIONS $$CUDA_INC $$LIBS --machine $$SYSTEM_TYPE \ -arch=$$CUDA_ARCH -c -o ${QMAKE_FILE_OUT} ${QMAKE_FILE_NAME} -Xcompiler $$MSVCRT_LINK_FLAG_RELEASE cuda.dependency_type = TYPE_C QMAKE_EXTRA_COMPILERS += cuda }

win7下 qt5.5版本 链接一个自己写的lib静态库生成另一个静态库失败

hi 各位大神 小弟遇到一个很奇怪的问题, 我自己用vs生成一个静态库a.lib, 用qt 再生成一个b.lib (链接a.lib) 再主程序中调用b.lib链接的时候,提示找不到a.lib中的函数 #include "libtof.h" #include "lusb0_usb.h" //#pragma comment(lib,".\\libusb0d.lib") LibTof::LibTof() { } int LibTof::add() { usb_init(); return 2; } .pro #------------------------------------------------- # # Project created by QtCreator 2018-03-14T11:17:16 # #------------------------------------------------- QT -= gui QMAKE_CFLAGS_RELEASE += /MT QMAKE_CXXFLAGS_RELEASE += /MT QMAKE_CFLAGS_DEBUG += /MTd QMAKE_CXXFLAGS_DEBUG += /MTd CONFIG(debug,debug|release) { QMAKE_LFLAGS += /NODEFAULTLIB:\"LIBCMTD.lib\" } else { QMAKE_LFLAGS += /NODEFAULTLIB:\"LIBCMT.lib\" } TARGET = libTof TEMPLATE = lib CONFIG += staticlib CONFIG += dll debug warn_on SOURCES += libtof.cpp HEADERS += libtof.h unix { target.path = /usr/lib INSTALLS += target } win32:CONFIG(release, debug|release): LIBS += -L$$PWD/./ -llibusb0 else:win32:CONFIG(debug, debug|release): LIBS += -L$$PWD/./ -llibusb0d INCLUDEPATH += $$PWD/. DEPENDPATH += $$PWD/. win32-g++:CONFIG(release, debug|release): PRE_TARGETDEPS += $$PWD/./liblibusb0.a else:win32-g++:CONFIG(debug, debug|release): PRE_TARGETDEPS += $$PWD/./liblibusb0d.a else:win32:!win32-g++:CONFIG(release, debug|release): PRE_TARGETDEPS += $$PWD/./libusb0.lib else:win32:!win32-g++:CONFIG(debug, debug|release): PRE_TARGETDEPS += $$PWD/./libusb0d.lib 在vs2013中编译,出错 错误 1 error LNK2019: 无法解析的外部符号 _usb_init,该符号在函数 "public: int __thiscall LibTof::add(void)" (?add@LibTof@@QAEHXZ) 中被引用 d:\UserData\my documents\visual studio 2013\Projects\qtlibTest\qtlibTest\libTof.lib(libtof.obj) qtlibTest _usb_init这个就是第一个lib库中的函数 而且我发现 我用vs生成b.lib的时候, 大小是400Kb 用qt生成的b.lib 只有25Kb 我怀疑是qt中的vs编辑器没有把a.lib真正的导入进去,只是加载了静态符号。 求大神解答

QT加载图片失败路径问题

最近在做个移动端的QT应用,在加载图片时遇到加载失败的问题代码如下: QImage image("asset:///begin/maindlg/deviver.png"); QImage image(":/asset/begin/maindlg/deviver.png"); QImage image(".asset/begin/maindlg/deviver.png"); 以上的三种方法都不想,相对路径和绝对路径都不行。。求大神解决。

QT调用Python,调用第三库不成功

如果python 中没有import matplotlib.pyplot as plt 这行代码 QT调用成功,如果python中有这行代码在debug下调用成功release下不成功 请问这是什么原因

QT5 交叉编译 配置configure出错

+ cd qtbase + /opt/qt-everywhere-opensource-src-5.4.1/qtbase/configure -top-level -v -prefix /opt/qt-everywhere-opensource-src-5.4.1/_install -opensource -confirm-license -release -make libs -xplatform linux-arm-gnueabi-g++ -optimized-qmake -pch -qt-sql-sqlite -qt-libjpeg -qt-zlib -no-opengl -no-sse2 -no-openssl -no-nis -no-cups -no-glib -no-xcursor -no-xfixes -no-xrandr -no-xrender -no-separate-debug-info -nomake examples -nomake tools -nomake tests This is the Qt Open Source Edition. You are licensed to use this software under the terms of the Lesser GNU General Public License (LGPL) versions 2.1. You are also licensed to use this software under the terms of the GNU Lesser General Public License (LGPL) versions 3. You have already accepted the terms of the Open Source license. arm-none-linux-gnueabi-g++ -c -fvisibility=hidden fvisibility.c Symbol visibility control enabled. arm-none-linux-gnueabi-g++ -o libtest.so -shared -Wl,-Bsymbolic-functions -fPIC bsymbolic_functions.c bsymbolic_functions.c:2:2: error: #error "Symbolic function binding on this architecture may be broken, disabling it (see QTBUG-36129)." Symbolic function binding disabled. DEFAULT_INCDIRS="/usr/local/arm/arm-2011.03/arm-none-linux-gnueabi/include/c++/4.5.2 /usr/local/arm/arm-2011.03/arm-none-linux-gnueabi/include/c++/4.5.2/arm-none-linux-gnueabi /usr/local/arm/arm-2011.03/arm-none-linux-gnueabi/include/c++/4.5.2/backward /usr/local/arm/arm-2011.03/lib/gcc/arm-none-linux-gnueabi/4.5.2/include /usr/local/arm/arm-2011.03/lib/gcc/arm-none-linux-gnueabi/4.5.2/include-fixed /usr/local/arm/arm-2011.03/arm-none-linux-gnueabi/include /usr/local/arm/arm-2011.03/arm-none-linux-gnueabi/libc/usr/include " DEFAULT_LIBDIRS="/usr/local/arm/arm-2011.03/arm-none-linux-gnueabi/libc/lib /usr/local/arm/arm-2011.03/arm-none-linux-gnueabi/libc/usr/lib /usr/local/arm/arm-2011.03/lib/gcc/arm-none-linux-gnueabi/4.5.2 /usr/local/arm/arm-2011.03/lib/gcc /usr/local/arm/arm-2011.03/arm-none-linux-gnueabi/lib " Creating qmake... gmake: Nothing to be done for `first'. Running configuration tests... Failed to process makespec for platform 'linux-arm-gnueabi-g++' /opt/qt-everywhere-opensource-src-5.4.1/qtbase/configure: line 3869: /opt/qt-everywhere-opensource-src-5.4.1/qtbase/bin/qmake: cannot execute binary file

QGroundControl本地编译问题

使用Win10开发QGroundControl。 在Github上下载了QGroundControl的源码,也按照手册配好了相关的QT和VS版本,但是build依旧不通过,显示如下的问题: ![图片说明](https://img-ask.csdn.net/upload/202004/26/1587872505_515904.png) 此外每次打开程序或者切换release与debug时总会弹出如下窗口: ![图片说明](https://img-ask.csdn.net/upload/202004/26/1587872637_572461.png) 请问这两种情况该如何解决?谢谢了

fatal error LNK1112: 模块计算机类型“X86”与目标计算机类型“x64”冲突

环境: WIN7 X64 + VS2005 我只是简单新建基于对话框项目testDlg, 代码没有任何改动; 也不添加任何库; 直接编译为: win32,通过并可以运行; 然后我改为编译64位程序: 配置管理器->活动解决方案平台: 新建->选择新平台:x64 然后: 右键testDlg项目->链接器->高级->目标计算机:MachineX64 (/MACHINE:X64) PS: VS2005 我是以完全方式安装的; 编译出错:  1>.\x64\Debug\stdafx.obj : fatal error LNK1112: 模块计算机类型“X86”与目标计算机类型“x64”冲突 为什么, 一个完全没有改动的项目 ,无法直接编译64位程序;

error: reference to 's' is ambiguous

# c++多继承中的问题 class A包含属性s; class B继承A; class C继承A; class D继承B,C; D中重载set_s()方法。 code::blocks 编译出错:error: reference 's' is ambiguous

c++组建错误fatal error LNK1120: 1 unresolved externals

![图片说明](https://img-ask.csdn.net/upload/201605/04/1462369690_230367.png) ![图片说明](https://img-ask.csdn.net/upload/201605/04/1462369698_617083.png)

ubuntu16.04安装opencv时,make不通过该怎么办?

cmake已经完成,情况如下: ``` cmake .. -- Detected version of GNU GCC: 54 (504) -- Found ZLIB: /usr/lib/x86_64-linux-gnu/libz.so (found suitable version "1.2.8", minimum required is "1.2.3") -- Found ZLIB: /usr/lib/x86_64-linux-gnu/libz.so (found version "1.2.8") -- Checking for module 'gstreamer-base-1.0' -- No package 'gstreamer-base-1.0' found -- Checking for module 'gstreamer-video-1.0' -- No package 'gstreamer-video-1.0' found -- Checking for module 'gstreamer-app-1.0' -- No package 'gstreamer-app-1.0' found -- Checking for module 'gstreamer-riff-1.0' -- No package 'gstreamer-riff-1.0' found -- Checking for module 'gstreamer-pbutils-1.0' -- No package 'gstreamer-pbutils-1.0' found -- Checking for module 'gstreamer-base-0.10' -- No package 'gstreamer-base-0.10' found -- Checking for module 'gstreamer-video-0.10' -- No package 'gstreamer-video-0.10' found -- Checking for module 'gstreamer-app-0.10' -- No package 'gstreamer-app-0.10' found -- Checking for module 'gstreamer-riff-0.10' -- No package 'gstreamer-riff-0.10' found -- Checking for module 'gstreamer-pbutils-0.10' -- No package 'gstreamer-pbutils-0.10' found -- Looking for linux/videodev.h -- Looking for linux/videodev.h - not found -- Looking for linux/videodev2.h -- Looking for linux/videodev2.h - found -- Looking for sys/videoio.h -- Looking for sys/videoio.h - not found -- Checking for module 'libavresample' -- No package 'libavresample' found -- Looking for libavformat/avformat.h -- Looking for libavformat/avformat.h - found -- Looking for ffmpeg/avformat.h -- Looking for ffmpeg/avformat.h - not found -- Checking for module 'libgphoto2' -- No package 'libgphoto2' found -- found IPP (ICV version): 9.0.1 [9.0.1] -- at: /home/quxutao/opencv-3.1.0/3rdparty/ippicv/unpack/ippicv_lnx -- CUDA detected: 7.5 -- CUDA NVCC target flags: -gencode;arch=compute_20,code=sm_20;-gencode;arch=compute_20,code=sm_21;-gencode;arch=compute_30,code=sm_30;-gencode;arch=compute_35,code=sm_35;-gencode;arch=compute_30,code=compute_30 -- Could NOT find Doxygen (missing: DOXYGEN_EXECUTABLE) -- To enable PlantUML support, set PLANTUML_JAR environment variable or pass -DPLANTUML_JAR=<filepath> option to cmake -- Could NOT find PythonInterp: Found unsuitable version "1.4", but required is at least "2.7" (found /home/quxutao/.virtualenvs/cv/bin/python) -- Could NOT find PythonInterp: Found unsuitable version "1.4", but required is at least "2.6" (found /home/quxutao/.virtualenvs/cv/bin/python) -- Could NOT find PythonInterp: Found unsuitable version "1.4", but required is at least "3.4" (found /home/quxutao/.virtualenvs/cv/bin/python) -- Could NOT find PythonInterp: Found unsuitable version "1.4", but required is at least "3.2" (found /home/quxutao/.virtualenvs/cv/bin/python) -- Could NOT find JNI (missing: JAVA_INCLUDE_PATH JAVA_INCLUDE_PATH2 JAVA_AWT_INCLUDE_PATH) -- Could NOT find Matlab (missing: MATLAB_MEX_SCRIPT MATLAB_INCLUDE_DIRS MATLAB_ROOT_DIR MATLAB_LIBRARIES MATLAB_LIBRARY_DIRS MATLAB_MEXEXT MATLAB_ARCH MATLAB_BIN) -- VTK is not found. Please set -DVTK_DIR in CMake to VTK build directory, or to VTK install subdirectory with VTKConfig.cmake file -- Caffe: NO -- Protobuf: YES -- Glog: NO -- HDF5: YES -- Module opencv_sfm disabled because the following dependencies are not found: Eigen Glog/Gflags -- Tesseract: NO -- HDF5: YES -- Build libprotobuf from sources: -- The protocol buffer compiler not found -- Tesseract: NO -- -- General configuration for OpenCV 3.1.0 ===================================== -- Version control: unknown -- -- Platform: -- Host: Linux 4.15.0-47-generic x86_64 -- CMake: 3.5.1 -- CMake generator: Unix Makefiles -- CMake build tool: /usr/bin/make -- Configuration: RELEASE -- -- C/C++: -- Built as dynamic libs?: YES -- C++ Compiler: /usr/bin/c++ (ver 5.4.0) -- C++ flags (Release): -fsigned-char -W -Wall -Werror=return-type -Werror=non-virtual-dtor -Werror=address -Werror=sequence-point -Wformat -Werror=format-security -Wmissing-declarations -Wundef -Winit-self -Wpointer-arith -Wshadow -Wsign-promo -Wno-narrowing -Wno-delete-non-virtual-dtor -fdiagnostics-show-option -Wno-long-long -pthread -fomit-frame-pointer -msse -msse2 -mno-avx -msse3 -mno-ssse3 -mno-sse4.1 -mno-sse4.2 -ffunction-sections -fvisibility=hidden -fvisibility-inlines-hidden -O3 -DNDEBUG -DNDEBUG -- C++ flags (Debug): -fsigned-char -W -Wall -Werror=return-type -Werror=non-virtual-dtor -Werror=address -Werror=sequence-point -Wformat -Werror=format-security -Wmissing-declarations -Wundef -Winit-self -Wpointer-arith -Wshadow -Wsign-promo -Wno-narrowing -Wno-delete-non-virtual-dtor -fdiagnostics-show-option -Wno-long-long -pthread -fomit-frame-pointer -msse -msse2 -mno-avx -msse3 -mno-ssse3 -mno-sse4.1 -mno-sse4.2 -ffunction-sections -fvisibility=hidden -fvisibility-inlines-hidden -g -O0 -DDEBUG -D_DEBUG -- C Compiler: /usr/bin/cc -- C flags (Release): -fsigned-char -W -Wall -Werror=return-type -Werror=non-virtual-dtor -Werror=address -Werror=sequence-point -Wformat -Werror=format-security -Wmissing-declarations -Wmissing-prototypes -Wstrict-prototypes -Wundef -Winit-self -Wpointer-arith -Wshadow -Wno-narrowing -fdiagnostics-show-option -Wno-long-long -pthread -fomit-frame-pointer -msse -msse2 -mno-avx -msse3 -mno-ssse3 -mno-sse4.1 -mno-sse4.2 -ffunction-sections -fvisibility=hidden -O3 -DNDEBUG -DNDEBUG -- C flags (Debug): -fsigned-char -W -Wall -Werror=return-type -Werror=non-virtual-dtor -Werror=address -Werror=sequence-point -Wformat -Werror=format-security -Wmissing-declarations -Wmissing-prototypes -Wstrict-prototypes -Wundef -Winit-self -Wpointer-arith -Wshadow -Wno-narrowing -fdiagnostics-show-option -Wno-long-long -pthread -fomit-frame-pointer -msse -msse2 -mno-avx -msse3 -mno-ssse3 -mno-sse4.1 -mno-sse4.2 -ffunction-sections -fvisibility=hidden -g -O0 -DDEBUG -D_DEBUG -- Linker flags (Release): -- Linker flags (Debug): -- Precompiled headers: YES -- Extra dependencies: /usr/lib/x86_64-linux-gnu/libpng.so /usr/lib/x86_64-linux-gnu/libtiff.so /usr/lib/x86_64-linux-gnu/libjasper.so /usr/lib/x86_64-linux-gnu/libjpeg.so gtk-3 gdk-3 pangocairo-1.0 pango-1.0 atk-1.0 cairo-gobject cairo gdk_pixbuf-2.0 gio-2.0 gobject-2.0 gthread-2.0 glib-2.0 dc1394 v4l1 v4l2 avcodec-ffmpeg avformat-ffmpeg avutil-ffmpeg swscale-ffmpeg /usr/lib/x86_64-linux-gnu/libbz2.so /usr/lib/x86_64-linux-gnu/hdf5/openmpi/lib/libhdf5.so /usr/lib/x86_64-linux-gnu/libsz.so /usr/lib/x86_64-linux-gnu/libz.so /usr/lib/x86_64-linux-gnu/libdl.so /usr/lib/x86_64-linux-gnu/libm.so dl m pthread rt cudart nppc nppi npps cufft -L/usr/lib/x86_64-linux-gnu -- 3rdparty dependencies: libwebp IlmImf libprotobuf -- -- OpenCV modules: -- To be built: cudev core cudaarithm flann hdf imgproc ml reg surface_matching video cudabgsegm cudafilters cudaimgproc cudawarping dnn fuzzy imgcodecs photo shape videoio cudacodec highgui objdetect plot ts xobjdetect xphoto bgsegm bioinspired dpm face features2d line_descriptor saliency text calib3d ccalib cudafeatures2d cudalegacy cudaobjdetect cudaoptflow cudastereo datasets rgbd stereo structured_light superres tracking videostab xfeatures2d ximgproc aruco optflow stitching -- Disabled: world contrib_world -- Disabled by dependency: - -- Unavailable: java python2 python3 viz cvv matlab sfm -- -- GUI: -- QT: NO -- GTK+ 3.x: YES (ver 3.18.9) -- GThread : YES (ver 2.48.2) -- GtkGlExt: NO -- OpenGL support: NO -- VTK support: NO -- -- Media I/O: -- ZLib: /usr/lib/x86_64-linux-gnu/libz.so (ver 1.2.8) -- JPEG: /usr/lib/x86_64-linux-gnu/libjpeg.so (ver ) -- WEBP: build (ver 0.3.1) -- PNG: /usr/lib/x86_64-linux-gnu/libpng.so (ver 1.2.54) -- TIFF: /usr/lib/x86_64-linux-gnu/libtiff.so (ver 42 - 4.0.6) -- JPEG 2000: /usr/lib/x86_64-linux-gnu/libjasper.so (ver 1.900.1) -- OpenEXR: build (ver 1.7.1) -- GDAL: NO -- -- Video I/O: -- DC1394 1.x: NO -- DC1394 2.x: YES (ver 2.2.4) -- FFMPEG: YES -- codec: YES (ver 56.60.100) -- format: YES (ver 56.40.101) -- util: YES (ver 54.31.100) -- swscale: YES (ver 3.1.101) -- resample: NO -- gentoo-style: YES -- GStreamer: NO -- OpenNI: NO -- OpenNI PrimeSensor Modules: NO -- OpenNI2: NO -- PvAPI: NO -- GigEVisionSDK: NO -- UniCap: NO -- UniCap ucil: NO -- V4L/V4L2: Using libv4l1 (ver 1.10.0) / libv4l2 (ver 1.10.0) -- XIMEA: NO -- Xine: NO -- gPhoto2: NO -- -- Parallel framework: pthreads -- -- Other third-party libraries: -- Use IPP: 9.0.1 [9.0.1] -- at: /home/quxutao/opencv-3.1.0/3rdparty/ippicv/unpack/ippicv_lnx -- Use IPP Async: NO -- Use VA: NO -- Use Intel VA-API/OpenCL: NO -- Use Eigen: NO -- Use Cuda: YES (ver 7.5) -- Use OpenCL: YES -- Use custom HAL: NO -- -- NVIDIA CUDA -- Use CUFFT: YES -- Use CUBLAS: NO -- USE NVCUVID: NO -- NVIDIA GPU arch: 20 21 30 35 -- NVIDIA PTX archs: 30 -- Use fast math: NO -- -- OpenCL: -- Version: dynamic -- Include path: /home/quxutao/opencv-3.1.0/3rdparty/include/opencl/1.2 -- Use AMDFFT: NO -- Use AMDBLAS: NO -- -- Python 2: -- Interpreter: NO -- -- Python 3: -- Interpreter: NO -- -- Python (for build): NO -- -- Java: -- ant: NO -- JNI: NO -- Java wrappers: NO -- Java tests: NO -- -- Matlab: Matlab not found or implicitly disabled -- -- Documentation: -- Doxygen: NO -- PlantUML: NO -- -- Tests and samples: -- Tests: YES -- Performance tests: YES -- C/C++ Examples: YES -- -- Install path: /usr/local -- -- cvconfig.h is in: /home/quxutao/opencv-3.1.0/build -- ----------------------------------------------------------------- -- -- Configuring done -- Generating done -- Build files have been written to: /home/quxutao/opencv-3.1.0/build ``` 但是make的时候,就报错: ``` make [ 4%] Built target libwebp [ 4%] Built target IlmImf [ 4%] Built target opencv_cudev [ 4%] Built target opencv_core_pch_dephelp [ 4%] Built target pch_Generate_opencv_core [ 4%] Building NVCC (Device) object modules/core/CMakeFiles/cuda_compile.dir/src/cuda/cuda_compile_generated_gpu_mat.cu.o /usr/include/string.h: In function ‘void* __mempcpy_inline(void*, const void*, size_t)’: /usr/include/string.h:652:42: error: ‘memcpy’ was not declared in this scope return (char *) memcpy (__dest, __src, __n) + __n; ^ CMake Error at cuda_compile_generated_gpu_mat.cu.o.cmake:266 (message): Error generating file /home/quxutao/opencv-3.1.0/build/modules/core/CMakeFiles/cuda_compile.dir/src/cuda/./cuda_compile_generated_gpu_mat.cu.o modules/core/CMakeFiles/opencv_core.dir/build.make:399: recipe for target 'modules/core/CMakeFiles/cuda_compile.dir/src/cuda/cuda_compile_generated_gpu_mat.cu.o' failed make[2]: *** [modules/core/CMakeFiles/cuda_compile.dir/src/cuda/cuda_compile_generated_gpu_mat.cu.o] Error 1 CMakeFiles/Makefile2:2307: recipe for target 'modules/core/CMakeFiles/opencv_core.dir/all' failed make[1]: *** [modules/core/CMakeFiles/opencv_core.dir/all] Error 2 Makefile:160: recipe for target 'all' failed make: *** [all] Error 2 ``` 弄了一下午了,没有找到相关的解决办法。我的cuda是7.5,其实不用GPU也可以的,我只是想用KAZE滤波。。。跪求大神帮忙。。。

技术大佬:我去,你写的 switch 语句也太老土了吧

昨天早上通过远程的方式 review 了两名新来同事的代码,大部分代码都写得很漂亮,严谨的同时注释也很到位,这令我非常满意。但当我看到他们当中有一个人写的 switch 语句时,还是忍不住破口大骂:“我擦,小王,你丫写的 switch 语句也太老土了吧!” 来看看小王写的代码吧,看完不要骂我装逼啊。 private static String createPlayer(PlayerTypes p...

副业收入是我做程序媛的3倍,工作外的B面人生是怎样的?

提到“程序员”,多数人脑海里首先想到的大约是:为人木讷、薪水超高、工作枯燥…… 然而,当离开工作岗位,撕去层层标签,脱下“程序员”这身外套,有的人生动又有趣,马上展现出了完全不同的A/B面人生! 不论是简单的爱好,还是正经的副业,他们都干得同样出色。偶尔,还能和程序员的特质结合,产生奇妙的“化学反应”。 @Charlotte:平日素颜示人,周末美妆博主 大家都以为程序媛也个个不修边幅,但我们也许...

CSDN:因博主近期注重写专栏文章(已超过150篇),订阅博主专栏人数在突增,近期很有可能提高专栏价格(已订阅的不受影响),提前声明,敬请理解!

CSDN:因博主近期注重写专栏文章(已超过150篇),订阅博主专栏人数在突增,近期很有可能提高专栏价格(已订阅的不受影响),提前声明,敬请理解! 目录 博客声明 大数据了解博主粉丝 博主的粉丝群体画像 粉丝群体性别比例、年龄分布 粉丝群体学历分布、职业分布、行业分布 国内、国外粉丝群体地域分布 博主的近期访问每日增量、粉丝每日增量 博客声明 因近期博主写专栏的文章越来越多,也越来越精细,逐步优化文章。因此,最近一段时间,订阅博主专栏的人数增长也非常快,并且专栏价

我说我不会算法,阿里把我挂了。

不说了,字节跳动也反手把我挂了。

培训班出来的人后来都怎么样了?(二)

接着上回说,培训班学习生涯结束了。后面每天就是无休止的背面试题,不是没有头脑的背,培训公司还是有方法的,现在回想当时背的面试题好像都用上了,也被问到了。回头找找面试题,当时都是打印下来天天看,天天背。 不理解呢也要背,面试造飞机,上班拧螺丝。班里的同学开始四处投简历面试了,很快就有面试成功的,刚开始一个,然后越来越多。不知道是什么原因,尝到胜利果实的童鞋,不满足于自己通过的公司,嫌薪水要少了,选择...

面试了一个 31 岁程序员,让我有所触动,30岁以上的程序员该何去何从?

最近面试了一个31岁8年经验的程序猿,让我有点感慨,大龄程序猿该何去何从。

大三实习生,字节跳动面经分享,已拿Offer

说实话,自己的算法,我一个不会,太难了吧

程序员垃圾简历长什么样?

已经连续五年参加大厂校招、社招的技术面试工作,简历看的不下于万份 这篇文章会用实例告诉你,什么是差的程序员简历! 疫情快要结束了,各个公司也都开始春招了,作为即将红遍大江南北的新晋UP主,那当然要为小伙伴们做点事(手动狗头)。 就在公众号里公开征简历,义务帮大家看,并一一点评。《启舰:春招在即,义务帮大家看看简历吧》 一石激起千层浪,三天收到两百多封简历。 花光了两个星期的所有空闲时...

工作八年,月薪60K,裸辞两个月,投简历投到怀疑人生!

近日,有网友在某职场社交平台吐槽,自己裸辞两个月了,但是找工作却让自己的心态都要崩溃了,全部无果,不是已查看无回音,就是已查看不符合。 “工作八年,两年一跳,裸辞两个月了,之前月薪60K,最近找工作找的心态崩了!所有招聘工具都用了,全部无果,不是已查看无回音,就是已查看不符合。进头条,滴滴之类的大厂很难吗???!!!投简历投的开始怀疑人生了!希望 可以收到大厂offer” 先来看看网...

97年世界黑客编程大赛冠军作品(大小仅为16KB),惊艳世界的编程巨作

这是世界编程大赛第一名作品(97年Mekka ’97 4K Intro比赛)汇编语言所写。 整个文件只有4095个字节, 大小仅仅为16KB! 不仅实现了3D动画的效果!还有一段震撼人心的背景音乐!!! 内容无法以言语形容,实在太强大! 下面是代码,具体操作看最后! @echo off more +1 %~s0|debug e100 33 f6 bf 0 20 b5 10 f3 a5...

不要再到处使用 === 了

我们知道现在的开发人员都使用 === 来代替 ==,为什么呢?我在网上看到的大多数教程都认为,要预测 JavaScript 强制转换是如何工作这太复杂了,因此建议总是使用===。这些都...

什么是a站、b站、c站、d站、e站、f站、g站、h站、i站、j站、k站、l站、m站、n站?00后的世界我不懂!

A站 AcFun弹幕视频网,简称“A站”,成立于2007年6月,取意于Anime Comic Fun,是中国大陆第一家弹幕视频网站。A站以视频为载体,逐步发展出基于原生内容二次创作的完整生态,拥有高质量互动弹幕,是中国弹幕文化的发源地;拥有大量超粘性的用户群体,产生输出了金坷垃、鬼畜全明星、我的滑板鞋、小苹果等大量网络流行文化,也是中国二次元文化的发源地。 B站 全称“哔哩哔哩(bilibili...

终于,月薪过5万了!

来看几个问题想不想月薪超过5万?想不想进入公司架构组?想不想成为项目组的负责人?想不想成为spring的高手,超越99%的对手?那么本文内容是你必须要掌握的。本文主要详解bean的生命...

MySQL性能优化(五):为什么查询速度这么慢

前期回顾: MySQL性能优化(一):MySQL架构与核心问题 MySQL性能优化(二):选择优化的数据类型 MySQL性能优化(三):深入理解索引的这点事 MySQL性能优化(四):如何高效正确的使用索引 前面章节我们介绍了如何选择优化的数据类型、如何高效的使用索引,这些对于高性能的MySQL来说是必不可少的。但这些还完全不够,还需要合理的设计查询。如果查询写的很糟糕,即使表结构再合理、索引再...

用了这个 IDE 插件,5分钟解决前后端联调!

点击上方蓝色“程序猿DD”,选择“设为星标”回复“资源”获取独家整理的学习资料!作者 |李海庆我是一个 Web 开发前端工程师,受到疫情影响,今天是我在家办公的第78天。开发了两周,...

大厂的 404 页面都长啥样?最后一个笑了...

每天浏览各大网站,难免会碰到404页面啊。你注意过404页面么?猿妹搜罗来了下面这些知名网站的404页面,以供大家欣赏,看看哪个网站更有创意: 正在上传…重新上传取消 腾讯 正在上传…重新上传取消 网易 淘宝 百度 新浪微博 正在上传…重新上传取消 新浪 京东 优酷 腾讯视频 搜...

【高并发】高并发秒杀系统架构解密,不是所有的秒杀都是秒杀!

网上很多的文章和帖子中在介绍秒杀系统时,说是在下单时使用异步削峰来进行一些限流操作,那都是在扯淡! 因为下单操作在整个秒杀系统的流程中属于比较靠后的操作了,限流操作一定要前置处理,在秒杀业务后面的流程中做限流操作是没啥卵用的。

自从喜欢上了B站这12个UP主,我越来越觉得自己是个废柴了!

不怕告诉你,我自从喜欢上了这12个UP主,哔哩哔哩成为了我手机上最耗电的软件,几乎每天都会看,可是吧,看的越多,我就越觉得自己是个废柴,唉,老天不公啊,不信你看看…… 间接性踌躇满志,持续性混吃等死,都是因为你们……但是,自己的学习力在慢慢变强,这是不容忽视的,推荐给你们! 都说B站是个宝,可是有人不会挖啊,没事,今天咱挖好的送你一箩筐,首先啊,我在B站上最喜欢看这个家伙的视频了,为啥 ,咱撇...

代码注释如此沙雕,会玩还是你们程序员!

某站后端代码被“开源”,同时刷遍全网的,还有代码里的那些神注释。 我们这才知道,原来程序员个个都是段子手;这么多年来,我们也走过了他们的无数套路… 首先,产品经理,是永远永远吐槽不完的!网友的评论也非常扎心,说看这些代码就像在阅读程序员的日记,每一页都写满了对产品经理的恨。 然后,也要发出直击灵魂的质问:你是尊贵的付费大会员吗? 这不禁让人想起之前某音乐app的穷逼Vip,果然,穷逼在哪里都是...

Java14 新特性解读

Java14 已于 2020 年 3 月 17 号发布,官方特性解读在这里:https://openjdk.java.net/projects/jdk/14/以下是个人对于特性的中文式...

爬虫(101)爬点重口味的

小弟最近在学校无聊的很哪,浏览网页突然看到一张图片,都快流鼻血。。。然后小弟冥思苦想,得干一点有趣的事情python 爬虫库安装https://s.taobao.com/api?_ks...

疫情后北上广深租房价格跌了吗? | Alfred数据室

去年3月份我们发布了《北上广深租房图鉴》(点击阅读),细数了北上广深租房的各种因素对租房价格的影响。一年过去了,在面临新冠疫情的后续影响、城市尚未完全恢复正常运转、学校还没开学等情况下...

面试官给我挖坑:a[i][j] 和 a[j][i] 有什么区别?

点击上方“朱小厮的博客”,选择“设为星标”后台回复&#34;1024&#34;领取公众号专属资料本文以一个简单的程序开头——数组赋值:int LEN = 10000; int[][] ...

又一起程序员被抓事件

就在昨天互联网又发生一起让人心酸的程序员犯罪事件,著名的百度不限速下载软件 Pandownload PC 版作者被警方抓获。案件大致是这样的:软件的作者不仅非法盗取用户数据,还在QQ群进...

应聘3万的职位,有必要这么刁难我么。。。沙雕。。。

又一次被面试官带到坑里面了。面试官:springmvc用过么?我:用过啊,经常用呢面试官:springmvc中为什么需要用父子容器?我:嗯。。。没听明白你说的什么。面试官:就是contr...

太狠了,疫情期间面试,一个问题砍了我5000!

疫情期间找工作确实有点难度,想拿到满意的薪资,确实要点实力啊!面试官:Spring中的@Value用过么,介绍一下我:@Value可以标注在字段上面,可以将外部配置文件中的数据,比如可以...

Intellij IDEA 美化指南

经常有人问我,你的 IDEA 配色哪里搞的,我会告诉他我自己改的。作为生产力工具,不但要顺手而且更要顺眼。这样才能快乐编码,甚至降低 BUG 率。上次分享了一些 IDEA 有用的插件,反...

【相亲】96年程序员小哥第一次相亲,还没开始就结束了

颜值有点高,条件有点好

太厉害了,终于有人能把TCP/IP 协议讲的明明白白了

一图看完本文 一、 计算机网络体系结构分层 计算机网络体系结构分层 计算机网络体系结构分层 不难看出,TCP/IP 与 OSI 在分层模块上稍有区别。OSI 参考模型注重“通信协议必要的功能是什么”,而 TCP/IP 则更强调“在计算机上实现协议应该开发哪种程序”。 二、 TCP/IP 基础 1. TCP/IP 的具体含义 从字面意义上讲,有人可能会认为...

腾讯面试题: 百度搜索为什么那么快?

我还记得去年面腾讯时,面试官最后一个问题是:百度/google的搜索为什么那么快? 这个问题我懵了,我从来没想过,搜素引擎的原理是什么 然后我回答:百度爬取了各个网站的信息,然后进行排序,当输入关键词的时候进行文档比对……巴拉巴拉 面试官:这不是我想要的答案 我内心 这个问题我一直耿耿于怀,终于今天,我把他写出来,以后再问,我直接把这篇文章甩给他!!! 两个字:倒排,将贯穿整篇文章,也是面试官...

你怎么看欧阳娜娜空降阿里p8?

前段时间 欧阳娜娜空降阿里P8被骂上热搜 有网友调侃道: 名牌大学毕业的研究生 要在阿里没日没夜、加班加点、 全年无休奋斗5年,才可能有机会 和20岁的欧阳娜娜一起喝下午茶…… 本来嘛,大厂✖明星的营销无可厚非 那是什么让撸代码N年的程序员愤愤不平呢? 还不是因为升到P8真的太难了! 这是很多阿里人甚至互联网人遥不可及的梦想! 阿里P8到底有多牛? 根据知乎大V@半佛仙人透露的情况: 阿里P8基本上要求研究生 5 年以上经验,本科 7 年以上经验; P8 一般去小公司就是各种 O,一般公司(非国企、.

程序员因没转发公司内容,被领导扣500,辞职后:加了三行代码

现如今,程序员在一二线城市可谓是非常的抢手,毕竟年薪那么多,一般在工作了几年之后,程序员想要攒到一套房子的首付是不成问题的,所以一些大龄的女青年在相亲的时候要把程序员当成了首选。但表面上看起来风光的程序员,背地里也受了非常多的委屈,最近有一名程序员没有转发公司的内容到朋友圈被领导扣了500块,当他辞职了之后,却非常淡定。 从个这个帖子中,我们可以看出这名程序员的情绪还是比较激动的,因为没有转发公司的内容到朋友圈,就要被罚款500块,这是非常不合理,换做是别人也不肯接受,而且三次没有转发就要被劝退,这是什么

相关热词 c# 按行txt c#怎么扫条形码 c#打包html c# 实现刷新数据 c# 两个自定义控件重叠 c#浮点类型计算 c#.net 中文乱码 c# 时间排序 c# 必备书籍 c#异步网络通信
立即提问