repo init失败,提示reo脚本错误,求助

完整错误信息如下:Traceback (most recent call last): File "/root/bin/repo", line 603, in main(sys.argv[1:]) File "/root/bin/repo", line 595, in main os.execv(main, me)TypeError: coercing to Unicode: need string or buffer, NoneType found出错后已经生成了.repo文件,但是repo sync时发现并没有init成功

2个回答

是不是中文目录导致的问题

PDunicorn
PDunicorn 解决了,是把repo文件里的url搞错了。。
大约 5 年之前 回复

是路径那里没有配置正确么?哎,回答完了才看见问题解决了

Csdn user default icon
上传中...
上传图片
插入图片
抄袭、复制答案,以达到刷声望分或其他目的的行为,在CSDN问答是严格禁止的,一经发现立刻封号。是时候展现真正的技术了!
其他相关推荐
repo init 下载RDK 代码下载问题
想测试编译环境因此下载 RDKB测试 ,出现问题如下: Run this cmd is ok : curl https://storage.googleapis.com/git-repo-downloads/repo > ~/bin/repo root@tw-H87-HD3:~/rdkb# repo init -u https://code.rdkcentral.com/r/manifests -m rdkb.xml -b rdkb-20170327 gpg: keyring `/home/tw/.repoconfig/gnupg/secring.gpg' created gpg: keyring `/home/tw/.repoconfig/gnupg/pubring.gpg' created gpg: /home/tw/.repoconfig/gnupg/trustdb.gpg: trustdb created gpg: key 920F5C65: public key "Repo Maintainer <repo@android.kernel.org>" imported gpg: key 692B382C: public key "Conley Owens <cco3@android.com>" imported gpg: Total number processed: 2 gpg: imported: 2 (RSA: 1) fatal: Cannot get https://gerrit.googlesource.com/git-repo/clone.bundle fatal: error [Errno 101] Network is unreachable 尝试添加/etc/hosts,没有生效 34.192.125.120 code.rdkcentral.com 74.125.204.82 gerrit.googlesource.com 求大神指教,在不翻墙的情况下是否有办法fix问题 ? 或者有没有办法替代目前的下载方式
wepy init standard 提示错误
# wepy init standard ``` $ wepy init standard Generate project in current directory? Yes downloading template wepy-cli · Failed to download repo standard: Hostname/IP does not match certificate's altnames: Host: raw.githubusercontent.com. is not in the cert's altnames: DNS:default.ssl.fastly.net, DNS:a.ssl.fastly.net, DNS:control.fastly.net, DNS:mirrors.fastly.net, DNS:purge.fastly.net, DNS:tools.fastly.net, DNS:*.a.ssl.fastly.net, DNS:*.fastly.com, DNS:*.global.ssl.fastly.net, DNS:*.hosts.fastly.net, DNS:fastly.com ```
在我ubuntu 系统上我有一份源码了,我想建立repo库来管理怎么搞?
我的系统本地上已经有一份源码了,我想建个repo来管理下代码,怎么百度都有问题 这个是我的步奏: $curl "http://curl https://storage.googleapis.com/git-repo-downloads/repo > ~/bin/repo $ chmod a+x ~/bin/repo" 下面这三条我都用过 $repo init -u git://android.git.kernel.org/platform/manifest.git $repo init -u git://android.git.kernel.org/platform/manifest.git -m dalvik-plus.xml $repo init -u URL(这个是在当前目录下建立.repo?) 全部报错 fatal: Cannot get https://gerrit.googlesource.com/git-repo/clone.bundle fatal: error [Errno 101] Network is unreachable 国内,VPN我都有看,就是没有一个成功,搞了好几天了。。请路过的大神帮看下
android repo下载代码超时问题
局域网使用 repo管理代码 gerrit审核的,通过sshkey认证的(生成后公钥发送到服务器开通权限) 之前可以下载代码 重装系统后 用备份的ssh还原/home/用户名/.ssh 然后配置repo 执行 repo init -u git@×××××× 提示 ssh timeout 然后我直接ssh 到服务器 可以链接提示输入密码认证 用git clone 也是ssh超时 。我想问几个问题。 1、ssh生成的公钥 密钥 做备份重装系统后能够直接还原用吗?还是必须再次生成然后再次向服务器申请下载权限? 2、repo init -u git@10.20.××.××:alps/manifest.git -m mtk8127-Korea.xml 提示 ssh: connect to host 10.20.××.×× port 22: Connection timed out fatal: Could not read from remote repository. Please make sure you have the correct access rights and the repository exists. 3、git clone git@×××××也是超时 但是我直接 ssh 10.20.××.×× 是可以的连通的 那么我这个到底是什么原因导致的需要怎么处理 求高手帮忙 对 Ubuntu ssh git repo不懂刚接触。
IDEA maven设置里面的Repositories这个设置问题
各位大佬好。我的idea工程里面maven设置Repositories没有任何东西。![图片说明](https://img-ask.csdn.net/upload/201911/27/1574824792_987600.png) ![图片说明](https://img-ask.csdn.net/upload/201911/27/1574824602_936414.png) 然后我百度了很多办法,首先是对maven包的setting文件添加localRepository设置地址。 ``` <localRepository>D:\Java\repository</localRepository> ``` 然后还是没有显示。继续百度,让我在pom.xml插入以下代码 ``` <repositories> <repository> <id>spring-milestones</id> <name>Spring Milestones</name> <url>https://repo.spring.io/milestone</url> <snapshots> <enabled>false</enabled> </snapshots> </repository> </repositories> ``` 最后在Repositories这个设置里面出现了以下内容 ![图片说明](https://img-ask.csdn.net/upload/201911/27/1574825161_983557.png) 接下来就是我的问题了:我需要的其实就是在这个显示里面显示一个我自己的本地maven库的地址。 1.接上图,我点Update没有任何作用,他一直报错,更新失败。 2.我其实想要的这个URl地址应该是我自己的‘D:\Java\repository’这个地址,但是他为什么不能自动的把我自己的地址放进去。希望各位大佬多给建议,我一一排查。感谢。 目前已经做了的排查: 1.更换了maven 2.切换setting的仓库地址的斜杠‘D:/Java/repository’ 3.修改了idea中maven设置的地址的斜杠。 目前没有成功!还在思考中。
pip / conda install 报 SSLError
# 我想安装 pycurl 库一直报ssl的错 **安装其他库也报这个错 我python 和 anacoda 卸载重装还是这样** ![图片说明](https://img-ask.csdn.net/upload/201912/29/1577603682_113807.png) ![图片说明](https://img-ask.csdn.net/upload/201912/29/1577603787_388466.png) **网上查到说添加环境变量 添加了但还是不行** anacoda 安装文件夹是anacode (新建文件夹的时候打错了) Python 3.7.6 windows 10 系统 大佬们知道什么原因吗? ``` 错误文本: pip install pycurl WARNING: pip is configured with locations that require TLS/SSL, however the ssl module in Python is not available. Requirement already satisfied: pycurl in d:\anacode\lib\site-packages (7.43.0.3) WARNING: pip is configured with locations that require TLS/SSL, however the ssl module in Python is not available. Could not fetch URL https://pypi.org/simple/pip/: There was a problem confirming the ssl certificate: HTTPSConnectionPool(host='pypi.org', port=443): Max retries exceeded with url: /simple/pip/ (Caused by SSLError("Can't connect to HTTPS URL because the SSL module is not available.")) - skipping C:\Users\Enz>conda install scrapy Collecting package metadata (current_repodata.json): failed CondaHTTPError: HTTP 000 CONNECTION FAILED for url <https://repo.anaconda.com/pkgs/main/win-64/current_repodata.json> Elapsed: - An HTTP error occurred when trying to retrieve this URL. HTTP errors are often intermittent, and a simple retry will get you on your way. If your current network has https://www.anaconda.com blocked, please file a support request with your network engineering team. SSLError(MaxRetryError('HTTPSConnectionPool(host=\'repo.anaconda.com\', port=443): Max retries exceeded with url: /pkgs/main/win-64/current_repodata.json (Caused by SSLError("Can\'t connect to HTTPS URL because the SSL module is not available."))')) ```
ftp://192.168.0.9/pub/repo/repodata/repomd.xml: [Errno 14] FTP Error 500 - Access denied: 500 Trying other mirror怎么解决?
![图片说明](https://img-ask.csdn.net/upload/201912/17/1576570287_195383.jpg)我在用华为云做实验,搭了一个客户端ftp的yum源,但是在服务器yum repolist的时候总是出现这个报错,不知道怎么办了? 客户端ip192.168.0.8 服务器ip192.168.0.9
Jenkins打包项目报错,JDK1.8
``` [INFO] BUILD FAILURE [INFO] ------------------------------------------------------------------------ [INFO] Total time: 6.400 s [INFO] Finished at: 2019-12-31T17:08:37+08:00 [INFO] Final Memory: 32M/117M [INFO] ------------------------------------------------------------------------ [ERROR] Failed to execute goal org.apache.maven.plugins:maven-compiler-plugin:3.8.1:compile (default-compile) on project cmdbunion_eureka: Execution default-compile of goal org.apache.maven.plugins:maven-compiler-plugin:3.8.1:compile failed: A required class was missing while executing org.apache.maven.plugins:maven-compiler-plugin:3.8.1:compile: org/codehaus/plexus/compiler/util/scan/InclusionScanException [ERROR] ----------------------------------------------------- [ERROR] realm = plugin>org.apache.maven.plugins:maven-compiler-plugin:3.8.1 [ERROR] strategy = org.codehaus.plexus.classworlds.strategy.SelfFirstStrategy [ERROR] urls[0] = file:/DATA/repo/repository/org/apache/maven/plugins/maven-compiler-plugin/3.8.1/maven-compiler-plugin-3.8.1.jar [ERROR] urls[1] = file:/DATA/repo/repository/org/codehaus/plexus/plexus-utils/1.1/plexus-utils-1.1.jar [JENKINS] Archiving /DATA/var/lib/jenkins/workspace/cmdbunion_parent/cmdbunion_eureka/pom.xml to com.travelsky/cmdbunion_eureka/0.0.1-SNAPSHOT/cmdbunion_eureka-0.0.1-SNAPSHOT.pom [ERROR] Number of foreign imports: 1 [ERROR] import: Entry[import from realm ClassRealm[maven.api, parent: null]] [ERROR] [ERROR] -----------------------------------------------------: org.codehaus.plexus.compiler.util.scan.InclusionScanException [ERROR] -> [Help 1] [ERROR] [ERROR] To see the full stack trace of the errors, re-run Maven with the -e switch. [ERROR] Re-run Maven using the -X switch to enable full debug logging. [JENKINS] Archiving /DATA/var/lib/jenkins/workspace/cmdbunion_parent/cmdbunion_titsm/pom.xml to com.travelsky/cmdbunion_titsm/0.0.1-SNAPSHOT/cmdbunion_titsm-0.0.1-SNAPSHOT.pom [ERROR] [ERROR] For more information about the errors and possible solutions, please read the following articles: [ERROR] [Help 1] http://cwiki.apache.org/confluence/display/MAVEN/PluginContainerException [ERROR] [ERROR] After correcting the problems, you can resume the build with the command [ERROR] mvn <goals> -rf :cmdbunion_eureka ``` ![图片说明](https://img-ask.csdn.net/upload/201912/31/1577783774_342114.png) ![图片说明](https://img-ask.csdn.net/upload/201912/31/1577783814_821416.png)
conda update --all 失败
我想升级numpy,原先先后尝试conda update --all 以及conda update numpy,是可以的,但都因为网络还是什么原因中断了,两个命令都尝试了两次,都中断了。 后来过了一会,我再尝试conda update --all 以及conda update numpy,失败了,报错,报错原因都差不多,以下是conda update --all的报错代码,请各位大佬救救我,小白我万分感谢 ``` (base) C:\Users\RZW>conda update --all # >>>>>>>>>>>>>>>>>>>>>> ERROR REPORT <<<<<<<<<<<<<<<<<<<<<< Traceback (most recent call last): File "D:\Program files\Anaconda\lib\site-packages\libarchive\ffi.py", line 55, in <module> libarchive = ctypes.cdll.LoadLibrary(libarchive_path) File "D:\Program files\Anaconda\lib\ctypes\__init__.py", line 434, in LoadLibrary return self._dlltype(name) File "D:\Program files\Anaconda\lib\ctypes\__init__.py", line 356, in __init__ self._handle = _dlopen(self._name, mode) OSError: [WinError 126] 找不到指定的模块。 During handling of the above exception, another exception occurred: Traceback (most recent call last): File "D:\Program files\Anaconda\lib\site-packages\conda\exceptions.py", line 1062, in __call__ return func(*args, **kwargs) File "D:\Program files\Anaconda\lib\site-packages\conda\cli\main.py", line 84, in _main exit_code = do_call(args, p) File "D:\Program files\Anaconda\lib\site-packages\conda\cli\conda_argparse.py", line 82, in do_call exit_code = getattr(module, func_name)(args, parser) File "D:\Program files\Anaconda\lib\site-packages\conda\cli\main_update.py", line 20, in execute install(args, parser, 'update') File "D:\Program files\Anaconda\lib\site-packages\conda\cli\install.py", line 116, in install if context.use_only_tar_bz2: File "D:\Program files\Anaconda\lib\site-packages\conda\base\context.py", line 664, in use_only_tar_bz2 import conda_package_handling.api File "D:\Program files\Anaconda\lib\site-packages\conda_package_handling\api.py", line 3, in <module> from libarchive.exception import ArchiveError as _LibarchiveArchiveError File "D:\Program files\Anaconda\lib\site-packages\libarchive\__init__.py", line 1, in <module> from .entry import ArchiveEntry File "D:\Program files\Anaconda\lib\site-packages\libarchive\entry.py", line 6, in <module> from . import ffi File "D:\Program files\Anaconda\lib\site-packages\libarchive\ffi.py", line 57, in <module> raise ImportError("Failed to load libarchive library from %s - are any dependencies missing?" ImportError: Failed to load libarchive library from %s - are any dependencies missing?Is your environment activated? `$ D:\Program files\Anaconda\Scripts\conda-script.py update --all` environment variables: CIO_TEST=<not set> CONDA_DEFAULT_ENV=base CONDA_EXE=D:\Program files\Anaconda\condabin\..\Scripts\conda.exe CONDA_EXES="D:\Program files\Anaconda\condabin\..\Scripts\conda.exe" CONDA_PREFIX=D:\Program files\Anaconda CONDA_PROMPT_MODIFIER=(base) CONDA_PYTHON_EXE=D:\Program files\Anaconda\python.exe CONDA_ROOT=D:\Program files\Anaconda CONDA_SHLVL=1 HOMEPATH=\Users\RZW MOZ_PLUGIN_PATH=D:\Program files\Zeon\Gaaiho\Gaaiho Reader\Bin PATH=D:\Program files\Anaconda\Library\bin;D:\Program files\Anaconda;D:\Program files\Anaconda\Library\mingw-w64\bin;D:\Program files\Anaconda\Library\usr\bin;D:\Program files\Anaconda\Library\bin;D:\Program files\Anaconda\Scripts;D:\Program files\Anaconda\bin;D:\Program files\Anaconda;D:\Program files\Anaconda\Library\mingw-w64\bin;D:\Program files\Anaconda\Library\usr\bin;D:\Program files\Anaconda\Library\bin;D:\Program files\Anaconda\Scripts;D:\Program files\Anaconda\bin;D:\Program files\ Anaconda\condabin;C:\Windows\system32;C:\Windows;C:\Windows\System32\W bem;C:\Windows\System32\WindowsPowerShell\v1.0\锛汥:\Program files\Anaconda锛汥:\Program files\Anaconda\Scripts锛汥:\Program files\Anaconda\envs\tensorflow\Lib\site-packages;D:\Program files\Anaconda\Library\bin;D:\Program files\Anaconda;D:\Program files\Anaconda\Library\mingw-w64\bin;D:\Program files\Anaconda\Library\usr\bin;D:\Program files\Anaconda\Library\bin;D:\Program files\Anaconda\Scripts;D:\Program files PSMODULEPATH=C:\Windows\system32\WindowsPowerShell\v1.0\Modules\ REQUESTS_CA_BUNDLE=<not set> SSL_CERT_FILE=<not set> active environment : base active env location : D:\Program files\Anaconda shell level : 1 user config file : C:\Users\RZW\.condarc populated config files : C:\Users\RZW\.condarc conda version : 4.7.11 conda-build version : 3.18.8 python version : 3.7.3.final.0 virtual packages : base environment : D:\Program files\Anaconda (writable) channel URLs : https://mirrors.tuna.tsinghua.edu.cn/anaconda/cloud/msys2/win-64 https://mirrors.tuna.tsinghua.edu.cn/anaconda/cloud/msys2/noarch https://mirrors.tuna.tsinghua.edu.cn/anaconda/cloud/conda-forge/win-64 https://mirrors.tuna.tsinghua.edu.cn/anaconda/cloud/conda-forge/noarch https://mirrors.tuna.tsinghua.edu.cn/anaconda/pkgs/free/win-64 https://mirrors.tuna.tsinghua.edu.cn/anaconda/pkgs/free/noarch https://repo.anaconda.com/pkgs/main/win-64 https://repo.anaconda.com/pkgs/main/noarch https://repo.anaconda.com/pkgs/r/win-64 https://repo.anaconda.com/pkgs/r/noarch https://repo.anaconda.com/pkgs/msys2/win-64 https://repo.anaconda.com/pkgs/msys2/noarch package cache : D:\Program files\Anaconda\pkgs C:\Users\RZW\.conda\pkgs C:\Users\RZW\AppData\Local\conda\conda\pkgs envs directories : D:\Program files\Anaconda\envs C:\Users\RZW\.conda\envs C:\Users\RZW\AppData\Local\conda\conda\envs platform : win-64 user-agent : conda/4.7.11 requests/2.22.0 CPython/3.7.3 Windows/10 Windows/10.0.10240 administrator : False netrc file : None offline mode : False An unexpected error has occurred. Conda has prepared the above report. If submitted, this report will be used by core maintainers to improve future releases of conda. Would you like conda to send this report to the core maintainers? [y/N]: ```
关于odroid-xu4 android源码如何正确下载,项目有多大?
最近在弄xu4的android,由于某些问题,需要下载其源码看看,按照其官网的source code下载方式下载,现在下载了超过了150GB仍然没下完,我下其它的android源码也才50GB左右,希望下过了大佬能否告知下原因或者怎么查询该源码项目总大小?谢谢 官网提示下载步骤: $ repo init -u https://github.com/hardkernel/android.git -b 5422_4.4.4_master $ repo sync $ repo start 5422_4.4.4_master --all 源码介绍网站:https://wiki.odroid.com/odroid-xu4/os_images/android/v6.7
android组件集成支付宝SDK问题
Error:Could not resolve all files for configuration ':app:A001DebugCompileClasspath'. > Could not find :alipaySdk-15.6.8-20191021122514:. Searched in the following locations: file:/D:/Android/sdk/extras/m2repository//alipaySdk-15.6.8-20191021122514//alipaySdk-15.6.8-20191021122514-.pom file:/D:/Android/sdk/extras/m2repository//alipaySdk-15.6.8-20191021122514//alipaySdk-15.6.8-20191021122514-.aar file:/D:/Android/sdk/extras/google/m2repository//alipaySdk-15.6.8-20191021122514//alipaySdk-15.6.8-20191021122514-.pom file:/D:/Android/sdk/extras/google/m2repository//alipaySdk-15.6.8-20191021122514//alipaySdk-15.6.8-20191021122514-.aar file:/D:/Android/sdk/extras/android/m2repository//alipaySdk-15.6.8-20191021122514//alipaySdk-15.6.8-20191021122514-.pom file:/D:/Android/sdk/extras/android/m2repository//alipaySdk-15.6.8-20191021122514//alipaySdk-15.6.8-20191021122514-.aar file:/D:/Android/Studio3/gradle/m2repository//alipaySdk-15.6.8-20191021122514//alipaySdk-15.6.8-20191021122514-.pom file:/D:/Android/Studio3/gradle/m2repository//alipaySdk-15.6.8-20191021122514//alipaySdk-15.6.8-20191021122514-.aar https://jcenter.bintray.com//alipaySdk-15.6.8-20191021122514//alipaySdk-15.6.8-20191021122514-.pom https://jcenter.bintray.com//alipaySdk-15.6.8-20191021122514//alipaySdk-15.6.8-20191021122514-.aar file:/E:/wwwroot/gitweb/Android_NDK_YW/app/ELAndroidComponent/repo//alipaySdk-15.6.8-20191021122514//alipaySdk-15.6.8-20191021122514-.pom file:/E:/wwwroot/gitweb/Android_NDK_YW/app/ELAndroidComponent/repo//alipaySdk-15.6.8-20191021122514//alipaySdk-15.6.8-20191021122514-.aar http://maven.aliyun.com/nexus/content/repositories/releases//alipaySdk-15.6.8-20191021122514//alipaySdk-15.6.8-20191021122514-.pom http://maven.aliyun.com/nexus/content/repositories/releases//alipaySdk-15.6.8-20191021122514//alipaySdk-15.6.8-20191021122514-.aar https://dl.bintray.com/jetbrains/anko//alipaySdk-15.6.8-20191021122514//alipaySdk-15.6.8-20191021122514-.pom https://dl.bintray.com/jetbrains/anko//alipaySdk-15.6.8-20191021122514//alipaySdk-15.6.8-20191021122514-.aar https://jitpack.io//alipaySdk-15.6.8-20191021122514//alipaySdk-15.6.8-20191021122514-.pom https://jitpack.io//alipaySdk-15.6.8-20191021122514//alipaySdk-15.6.8-20191021122514-.aar https://repo1.maven.org/maven2//alipaySdk-15.6.8-20191021122514//alipaySdk-15.6.8-20191021122514-.pom https://repo1.maven.org/maven2//alipaySdk-15.6.8-20191021122514//alipaySdk-15.6.8-20191021122514-.aar https://dl.google.com/dl/android/maven2//alipaySdk-15.6.8-20191021122514//alipaySdk-15.6.8-20191021122514-.pom https://dl.google.com/dl/android/maven2//alipaySdk-15.6.8-20191021122514//alipaySdk-15.6.8-20191021122514-.aar file:/E:/wwwroot/gitweb/Android_NDK_YW/app/libs/alipaySdk-15.6.8-20191021122514-.aar file:/E:/wwwroot/gitweb/Android_NDK_YW/app/libs/alipaySdk-15.6.8-20191021122514.aar file:/C:/Users/Administrator/.m2/repository//alipaySdk-15.6.8-20191021122514//alipaySdk-15.6.8-20191021122514-.pom file:/C:/Users/Administrator/.m2/repository//alipaySdk-15.6.8-20191021122514//alipaySdk-15.6.8-20191021122514-.aar file:/E:/wwwroot/gitweb/Android_NDK_YW/ELAndroidComponent/repo/alipaySdk-15.6.8-20191021122514-.aar file:/E:/wwwroot/gitweb/Android_NDK_YW/ELAndroidComponent/repo/alipaySdk-15.6.8-20191021122514.aar file:/E:/wwwroot/gitweb/Android_NDK_YW/app/libs/alipaySdk-15.6.8-20191021122514-.aar file:/E:/wwwroot/gitweb/Android_NDK_YW/app/libs/alipaySdk-15.6.8-20191021122514.aar file:/E:/wwwroot/gitweb/Android_NDK_YW/ELAndroidComponent/repo//alipaySdk-15.6.8-20191021122514//alipaySdk-15.6.8-20191021122514-.pom file:/E:/wwwroot/gitweb/Android_NDK_YW/ELAndroidComponent/repo//alipaySdk-15.6.8-20191021122514//alipaySdk-15.6.8-20191021122514-.aar Required by: project :app > project :ELAndroidComponent:paycomponent 配置好后运行出现以上问题,不知怎么解决,有大神指导一下吗
使用虚拟机centos7搭建了proftpd环境,新建的虚拟用户登陆提示密码错误,已经使用正确密码了但还是提示错误
当我在自己的机器上用ftp客户端登陆到这个linux主机上去时,总是提示530 Login incorrect,提示密码错误,已经弄了两天了还没有解决。 具体操作过程如下: 1.安装epel源 wget -O /etc/yum.repos.d/epel.repo http://mirrors.aliyun.com/repo/epel-7.repo 2.安装proftpd yum install -y proftpd openssl proftpd-utils 3.启动proftpd systemctl start proftpd.service systemctl enable proftpd.service 4.创建ftp登录用户 a.创建ftp组:groupadd ftpgroup b.创建ftp用户,并关联ftp目录:useradd -G ftpgroup ftptest -s /sbin/nologin -d /home/ftptest/ c.设置ftptest用户密码:passwd ftptest 5.给目录设置权限, chmod -R 777 /home/ftptest/ 报错日志如下: Jul 11 01:14:00 localhost proftpd[80818]: 127.0.0.1 (192.168.2.146[192.168.2.146]) - USER ftpuser (Login failed): Incorrect password Jul 11 01:16:02 localhost proftpd[80837]: 127.0.0.1 (192.168.2.146[192.168.2.146]) - USER ftpuser (Login failed): Incorrect password Jul 11 01:18:05 localhost proftpd[80857]: 127.0.0.1 (192.168.2.146[192.168.2.146]) - USER ftpuser (Login failed): Incorrect password Jul 11 01:20:07 localhost proftpd[80930]: 127.0.0.1 (192.168.2.146[192.168.2.146]) - USER ftpuser (Login failed): Incorrect password
安装anaconda后输入conda info 报错求解
想问下这个administrator : false; offline mode : false是什么问题怎么解决. 并且输入python后显示是环境变量但未激活。并且安装后桌面找不到anaconda的图标。望大神救救我!!! active environment : base active env location : D:\anaconda shell level : 1 user config file : C:\Users\Katharine\.condarc populated config files : conda version : 4.7.10 conda-build version : 3.18.8 python version : 3.7.3.final.0 virtual packages : __cuda=10.0 base environment : D:\anaconda (writable) channel URLs : https://repo.anaconda.com/pkgs/main/win-64 https://repo.anaconda.com/pkgs/main/noarch https://repo.anaconda.com/pkgs/r/win-64 https://repo.anaconda.com/pkgs/r/noarch https://repo.anaconda.com/pkgs/msys2/win-64 https://repo.anaconda.com/pkgs/msys2/noarch package cache : D:\anaconda\pkgs C:\Users\Katharine\.conda\pkgs C:\Users\Katharine\AppData\Local\conda\conda\pkgs envs directories : D:\anaconda\envs C:\Users\Katharine\.conda\envs C:\Users\Katharine\AppData\Local\conda\conda\envs platform : win-64 user-agent : conda/4.7.10 requests/2.22.0 CPython/3.7.3 Windows/10 Windows/10.0.17134 administrator : False netrc file : None offline mode : False
检查源代码后,如何切换到一个特定的android版本?
如果我用下面的方法查看 android 源代码 repo init -u git://android.git.kernel.org/platform/manifest.git 如何转换到一个特定的 android 版本?例如1.6版本?
yum localinstall 遇到的问题
``` [root@bogon base]# yum localinstall -y gcc-4.8.5-39.el7.x86_64.rpm Loaded plugins: fastestmirror Examining gcc-4.8.5-39.el7.x86_64.rpm: gcc-4.8.5-39.el7.x86_64 Marking gcc-4.8.5-39.el7.x86_64.rpm to be installed Resolving Dependencies --> Running transaction check ---> Package gcc.x86_64 0:4.8.5-39.el7 will be installed --> Processing Dependency: cpp = 4.8.5-39.el7 for package: gcc-4.8.5-39.el7.x86_64 Loading mirror speeds from cached hostfile One of the configured repositories failed (Unknown), and yum doesn't have enough cached data to continue. At this point the only safe thing yum can do is fail. There are a few ways to work "fix" this: 1. Contact the upstream for the repository and get them to fix the problem. 2. Reconfigure the baseurl/etc. for the repository, to point to a working upstream. This is most often useful if you are using a newer distribution release than is supported by the repository (and the packages for the previous distribution release still work). 3. Run the command with the repository temporarily disabled yum --disablerepo=<repoid> ... 4. Disable the repository permanently, so yum won't use it by default. Yum will then just ignore the repository until you permanently enable it again or use --enablerepo for temporary usage: yum-config-manager --disable <repoid> or subscription-manager repos --disable=<repoid> 5. Configure the failing repository to be skipped, if it is unavailable. Note that yum will try to contact the repo. when it runs most commands, so will have to try and fail each time (and thus. yum will be be much slower). If it is a very temporary problem though, this is often a nice compromise: yum-config-manager --save --setopt=<repoid>.skip_if_unavailable=true Cannot retrieve metalink for repository: epel/x86_64. Please verify its path and try again ```
Android源码如何删除之前的repo仓库
想切换分支,更新一套代码.我把.repo/manifests/下一份项目xml文件拷出来,替换掉.repo/下的manifests.xml,然后sync,但是sync完发现.repo/并没有覆盖之前的,占的空间翻倍了,怎么能删掉.repo/之前那套代码的记录.
idea创建Maven项目没有src目录 Run有错误
![图片说明](https://img-ask.csdn.net/upload/201911/02/1572702296_122439.png) ``` "C:\Program Files\Java\jdk1.8.0_202\bin\java.exe" -Dmaven.multiModuleProjectDirectory=C:\Users\dx\AppData\Local\Temp\archetype1tmp -Xms128m -Xmx512m -Duser.language=zh -Dfile.encoding=UTF-8 -Dmaven.home=E:\server\apache-maven-3.6.1 -Dclassworlds.conf=E:\server\apache-maven-3.6.1\bin\m2.conf "-Dmaven.ext.class.path=E:\IntelliJ IDEA 2019.2\plugins\maven\lib\maven-event-listener.jar" -classpath E:\server\apache-maven-3.6.1\boot\plexus-classworlds-2.6.0.jar org.codehaus.classworlds.Launcher -Didea.version2019.2 --offline -s E:\server\apache-maven-3.6.1\conf\settings.xml -Dmaven.repo.local=E:\server\Repository -DinteractiveMode=false -DgroupId=com -DartifactId=demo33333333 -Dversion=1.0-SNAPSHOT -DarchetypeGroupId=org.apache.maven.archetypes -DarchetypeArtifactId=maven-archetype-webapp -DarchetypeVersion=RELEASE org.apache.maven.plugins:maven-archetype-plugin:RELEASE:generate [INFO] Scanning for projects... [INFO] ------------------------------------------------------------------------ [INFO] BUILD FAILURE [INFO] ------------------------------------------------------------------------ [INFO] Total time: 0.140 s [INFO] Finished at: 2019-11-02T21:41:10+08:00 [INFO] ------------------------------------------------------------------------ [ERROR] Plugin org.apache.maven.plugins:maven-archetype-plugin:RELEASE or one of its dependencies could not be resolved: Failed to read artifact descriptor for org.apache.maven.plugins:maven-archetype-plugin:jar:RELEASE: Failed to resolve version for org.apache.maven.plugins:maven-archetype-plugin:jar:RELEASE: Could not find metadata org.apache.maven.plugins:maven-archetype-plugin/maven-metadata.xml in local (E:\server\Repository) -> [Help 1] [ERROR] [ERROR] To see the full stack trace of the errors, re-run Maven with the -e switch. [ERROR] Re-run Maven using the -X switch to enable full debug logging. [ERROR] [ERROR] For more information about the errors and possible solutions, please read the following articles: [ERROR] [Help 1] http://cwiki.apache.org/confluence/display/MAVEN/PluginResolutionException 网上的解决方法我都试过了还是报错,有大佬帮忙看下吗? ```
Jmeter刚启动就报错,java.lang.StackOverflowError: null
* 刚启动就报错,反射错误?? ``` 2019-10-15 19:25:30,381 INFO o.j.r.JARSourceHTTP: Found cached repo 2019-10-15 19:25:30,490 INFO o.j.r.PluginManager: Plugins Status: [jpgc-graphs-basic=2.0, jpgc-graphs-additional=Extras, jpgc-autostop=Extras, jpgc-sense=Standard, jpgc-cmd=Standard, jpgc-graphs-composite=Standard, jpgc-csl=Standard, jpgc-functions=2.1, jpgc-casutg=2.7, jpgc-dbmon=Extras, jpgc-graphs-dist=Extras, jpgc-dummy=Standard, jpgc-filterresults=Standard, jpgc-ffw=Standard, jpgc-ggl=Extras, jpgc-httpraw=Extras, jpgc-sts=Extras, jpgc-fifo=Standard, jpgc-jmxmon=Extras, jpgc-graphs-vs=Extras, jpgc-lockfile=Extras, jpgc-mergeresults=Standard, jpgc-pde=Extras, jpgc-prmctl=Extras, jpgc-perfmon=Standard, jpgc-plugins-manager=1.3, jpgc-synthesis=Standard, jpgc-plancheck=Standard, jpgc-tst=Standard, jpgc-udp=Extras, jpgc-csvars=Extras, jpgc-wsc=Standard, jpgc-xml=Extras, jmeter-core=5.1, jmeter-ftp=5.1, jmeter-http=5.1, jmeter-jdbc=5.1, jmeter-jms=5.1, jmeter-junit=5.1, jmeter-java=5.1, jmeter-ldap=5.1, jmeter-mail=5.1, jmeter-mongodb=5.1, jmeter-native=5.1, jmeter-tcp=5.1, jmeter-components=5.1, jpgc-standard=2.0] 2019-10-15 19:25:30,490 INFO o.j.r.PluginManagerMenuItem: Plugins Manager has upgrades: [jpgc-casutg] 2019-10-15 19:25:30,928 WARN o.a.j.g.u.MenuFactory: Could not instantiate class: kg.apc.jmeter.reporters.LoadosophiaUploaderGui java.lang.reflect.InvocationTargetException: null at sun.reflect.NativeConstructorAccessorImpl.newInstance0(Native Method) ~[?:1.8.0_131] at sun.reflect.NativeConstructorAccessorImpl.newInstance(NativeConstructorAccessorImpl.java:62) ~[?:1.8.0_131] at sun.reflect.DelegatingConstructorAccessorImpl.newInstance(DelegatingConstructorAccessorImpl.java:45) ~[?:1.8.0_131] at java.lang.reflect.Constructor.newInstance(Constructor.java:423) ~[?:1.8.0_131] at org.apache.jmeter.gui.util.MenuFactory.getGUIComponent(MenuFactory.java:174) ~[ApacheJMeter_core.jar:5.1 r1853635] at org.apache.jmeter.gui.util.MenuFactory.initializeMenus(MenuFactory.java:141) ~[ApacheJMeter_core.jar:5.1 r1853635] at org.apache.jmeter.gui.util.MenuFactory.<clinit>(MenuFactory.java:106) ~[ApacheJMeter_core.jar:5.1 r1853635] at org.apache.jmeter.control.gui.TestPlanGui.createPopupMenu(TestPlanGui.java:92) ~[ApacheJMeter_core.jar:5.1 r1853635] at org.apache.jmeter.gui.tree.JMeterTreeNode.createPopupMenu(JMeterTreeNode.java:185) ~[ApacheJMeter_core.jar:5.1 r1853635] at org.apache.jmeter.gui.action.EditCommand.doAction(EditCommand.java:46) ~[ApacheJMeter_core.jar:5.1 r1853635] at org.apache.jmeter.gui.action.ActionRouter.performAction(ActionRouter.java:88) ~[ApacheJMeter_core.jar:5.1 r1853635] at org.apache.jmeter.gui.action.ActionRouter.lambda$actionPerformed$0(ActionRouter.java:70) ~[ApacheJMeter_core.jar:5.1 r1853635] at java.awt.event.InvocationEvent.dispatch(InvocationEvent.java:311) [?:1.8.0_131] at java.awt.EventQueue.dispatchEventImpl(EventQueue.java:756) [?:1.8.0_131] at java.awt.EventQueue.access$500(EventQueue.java:97) [?:1.8.0_131] at java.awt.EventQueue$3.run(EventQueue.java:709) [?:1.8.0_131] at java.awt.EventQueue$3.run(EventQueue.java:703) [?:1.8.0_131] at java.security.AccessController.doPrivileged(Native Method) [?:1.8.0_131] at java.security.ProtectionDomain$JavaSecurityAccessImpl.doIntersectionPrivilege(ProtectionDomain.java:80) [?:1.8.0_131] at java.awt.EventQueue.dispatchEvent(EventQueue.java:726) [?:1.8.0_131] at java.awt.EventDispatchThread.pumpOneEventForFilters(EventDispatchThread.java:201) [?:1.8.0_131] at java.awt.EventDispatchThread.pumpEventsForFilter(EventDispatchThread.java:116) [?:1.8.0_131] at java.awt.EventDispatchThread.pumpEventsForHierarchy(EventDispatchThread.java:105) [?:1.8.0_131] at java.awt.EventDispatchThread.pumpEvents(EventDispatchThread.java:101) [?:1.8.0_131] at java.awt.EventDispatchThread.pumpEvents(EventDispatchThread.java:93) [?:1.8.0_131] at java.awt.EventDispatchThread.run(EventDispatchThread.java:82) [?:1.8.0_131] Caused by: java.lang.NoClassDefFoundError: org/apache/commons/httpclient/methods/multipart/PartSource at kg.apc.jmeter.reporters.LoadosophiaUploaderGui.init(LoadosophiaUploaderGui.java:114) ~[JMeterPlugins-Standard.jar:?] at kg.apc.jmeter.reporters.LoadosophiaUploaderGui.<init>(LoadosophiaUploaderGui.java:28) ~[JMeterPlugins-Standard.jar:?] ... 26 more Caused by: java.lang.ClassNotFoundException: org.apache.commons.httpclient.methods.multipart.PartSource at java.net.URLClassLoader.findClass(URLClassLoader.java:381) ~[?:1.8.0_131] at java.lang.ClassLoader.loadClass(ClassLoader.java:424) ~[?:1.8.0_131] at java.lang.ClassLoader.loadClass(ClassLoader.java:357) ~[?:1.8.0_131] at kg.apc.jmeter.reporters.LoadosophiaUploaderGui.init(LoadosophiaUploaderGui.java:114) ~[JMeterPlugins-Standard.jar:?] at kg.apc.jmeter.reporters.LoadosophiaUploaderGui.<init>(LoadosophiaUploaderGui.java:28) ~[JMeterPlugins-Standard.jar:?] ... 26 more ```’ * 接着启动线程,又报错StackOverflowError, ``` 2019-10-15 19:25:44,875 INFO o.a.j.t.JMeterThread: Thread started: 线程组 2-1 2019-10-15 19:25:44,876 INFO o.a.j.t.JMeterThread: Thread is done: 线程组 2-1 2019-10-15 19:25:44,876 INFO o.a.j.t.JMeterThread: Thread finished: 线程组 2-1 2019-10-15 19:25:45,703 INFO o.a.j.t.JMeterThread: Thread started: jp@gc - Stepping Thread Group (deprecated) 1-2 2019-10-15 19:25:46,703 INFO o.a.j.t.JMeterThread: Thread started: jp@gc - Stepping Thread Group (deprecated) 1-3 2019-10-15 19:25:47,696 INFO o.a.j.t.JMeterThread: Thread started: jp@gc - Stepping Thread Group (deprecated) 1-4 2019-10-15 19:25:48,195 INFO o.a.j.t.JMeterThread: Thread finished: jp@gc - Stepping Thread Group (deprecated) 1-1 2019-10-15 19:25:48,196 ERROR o.a.j.JMeter: Uncaught exception: java.lang.StackOverflowError: null at org.apache.jmeter.testelement.AbstractTestElement.recoverRunningVersion(AbstractTestElement.java:514) ~[ApacheJMeter_core.jar:5.1 r1853635] at org.apache.jmeter.testelement.property.TestElementProperty.recoverRunningVersion(TestElementProperty.java:125) ~[ApacheJMeter_core.jar:5.1 r1853635] at org.apache.jmeter.testelement.property.MultiProperty.recoverRunningVersionOfSubElements(MultiProperty.java:75) ~[ApacheJMeter_core.jar:5.1 r1853635] at org.apache.jmeter.testelement.property.CollectionProperty.recoverRunningVersion(CollectionProperty.java:205) ~[ApacheJMeter_core.jar:5.1 r1853635] at org.apache.jmeter.testelement.AbstractTestElement.recoverRunningVersion(AbstractTestElement.java:514) ~[ApacheJMeter_core.jar:5.1 r1853635] at org.apache.jmeter.testelement.property.TestElementProperty.recoverRunningVersion(TestElementProperty.java:125) ~[ApacheJMeter_core.jar:5.1 r1853635] at org.apache.jmeter.testelement.AbstractTestElement.recoverRunningVersion(AbstractTestElement.java:514) ~[ApacheJMeter_core.jar:5.1 r1853635] at org.apache.jmeter.threads.JMeterThread.notifyTestListeners(JMeterThread.java:973) ~[ApacheJMeter_core.jar:5.1 r1853635] at org.apache.jmeter.threads.JMeterThread$IterationListener.iterationStart(JMeterThread.java:1054) ~[ApacheJMeter_core.jar:5.1 r1853635] at org.apache.jmeter.control.GenericController.fireIterationStart(GenericController.java:399) ~[ApacheJMeter_core.jar:5.1 r1853635] at org.apache.jmeter.control.GenericController.fireIterEvents(GenericController.java:391) ~[ApacheJMeter_core.jar:5.1 r1853635] at org.apache.jmeter.control.GenericController.next(GenericController.java:160) ~[ApacheJMeter_core.jar:5.1 r1853635] at org.apache.jmeter.control.LoopController.next(LoopController.java:135) ~[ApacheJMeter_core.jar:5.1 r1853635] at org.apache.jmeter.control.LoopController.nextIsNull(LoopController.java:167) ~[ApacheJMeter_core.jar:5.1 r1853635] at org.apache.jmeter.control.GenericController.next(GenericController.java:170) ~[ApacheJMeter_core.jar:5.1 r1853635] at org.apache.jmeter.control.LoopController.next(LoopController.java:135) ~[ApacheJMeter_core.jar:5.1 r1853635] at org.apache.jmeter.control.GenericController.nextIsAController(GenericController.java:225) ~[ApacheJMeter_core.jar:5.1 r1853635] at org.apache.jmeter.control.GenericController.next(GenericController.java:175) ~[ApacheJMeter_core.jar:5.1 r1853635] at org.apache.jmeter.control.LoopController.next(LoopController.java:135) ~[ApacheJMeter_core.jar:5.1 r1853635] at org.apache.jmeter.control.LoopController.nextIsNull(LoopController.java:167) ~[ApacheJMeter_core.jar:5.1 r1853635] at org.apache.jmeter.control.GenericController.next(GenericController.java:170) ~[ApacheJMeter_core.jar:5.1 r1853635] at org.apache.jmeter.control.LoopController.next(LoopController.java:135) ~[ApacheJMeter_core.jar:5.1 r1853635] at org.apache.jmeter.control.GenericController.nextIsAController(GenericController.java:225) ~[ApacheJMeter_core.jar:5.1 r1853635] at org.apache.jmeter.control.GenericController.next(GenericController.java:175) ~[ApacheJMeter_core.jar:5.1 r1853635] at org.apache.jmeter.control.LoopController.next(LoopController.java:135) ~[ApacheJMeter_core.jar:5.1 r1853635] at org.apache.jmeter.control.LoopController.nextIsNull(LoopController.java:167) ~[ApacheJMeter_core.jar:5.1 r1853635] at org.apache.jmeter.control.GenericController.next(GenericController.java:170) ~[ApacheJMeter_core.jar:5.1 r1853635] at org.apache.jmeter.control.LoopController.next(LoopController.java:135) ~[ApacheJMeter_core.jar:5.1 r1853635] at org.apache.jmeter.control.GenericController.nextIsAController(GenericController.java:225) ~[ApacheJMeter_core.jar:5.1 r1853635] at org.apache.jmeter.control.GenericController.next(GenericController.java:175) ~[ApacheJMeter_core.jar:5.1 r1853635] ``` 前辈们帮忙看看
刚同步的android系统源码 aosp,怎么切换到指定分支?
刚同步的aosp,怎么切换到指定分支? 我用的是 repo branch ......[No branch] repo init -b android-5.1.1_r9 repo start android-5.1.1_r9 --all 之后,报了错: Starting android-5.1.1_r9: 1% (4/371) error: in `start android-5.1.1_r9 --all`: [Errno 2] No such file or directory: u'/home/lhb/aosp/build/.git/HEAD' error: manifest missing or unreadable -- please run init
终于明白阿里百度这样的大公司,为什么面试经常拿ThreadLocal考验求职者了
点击上面↑「爱开发」关注我们每晚10点,捕获技术思考和创业资源洞察什么是ThreadLocalThreadLocal是一个本地线程副本变量工具类,各个线程都拥有一份线程私有的数
《奇巧淫技》系列-python!!每天早上八点自动发送天气预报邮件到QQ邮箱
此博客仅为我业余记录文章所用,发布到此,仅供网友阅读参考,如有侵权,请通知我,我会删掉。 补充 有不少读者留言说本文章没有用,因为天气预报直接打开手机就可以收到了,为何要多此一举发送到邮箱呢!!!那我在这里只能说:因为你没用,所以你没用!!! 这里主要介绍的是思路,不是天气预报!不是天气预报!!不是天气预报!!!天气预报只是用于举例。请各位不要再刚了!!! 下面是我会用到的两个场景: 每日下
面试官问我:什么是消息队列?什么场景需要他?用了会出现什么问题?
你知道的越多,你不知道的越多 点赞再看,养成习惯 GitHub上已经开源 https://github.com/JavaFamily 有一线大厂面试点脑图、个人联系方式,欢迎Star和完善 前言 消息队列在互联网技术存储方面使用如此广泛,几乎所有的后端技术面试官都要在消息队列的使用和原理方面对小伙伴们进行360°的刁难。 作为一个在互联网公司面一次拿一次Offer的面霸,打败了无数
8年经验面试官详解 Java 面试秘诀
    作者 | 胡书敏 责编 | 刘静 出品 | CSDN(ID:CSDNnews) 本人目前在一家知名外企担任架构师,而且最近八年来,在多家外企和互联网公司担任Java技术面试官,前后累计面试了有两三百位候选人。在本文里,就将结合本人的面试经验,针对Java初学者、Java初级开发和Java开发,给出若干准备简历和准备面试的建议。   Java程序员准备和投递简历的实
究竟你适不适合买Mac?
我清晰的记得,刚买的macbook pro回到家,开机后第一件事情,就是上了淘宝网,花了500元钱,找了一个上门维修电脑的师傅,上门给我装了一个windows系统。。。。。。 表砍我。。。 当时买mac的初衷,只是想要个固态硬盘的笔记本,用来运行一些复杂的扑克软件。而看了当时所有的SSD笔记本后,最终决定,还是买个好(xiong)看(da)的。 已经有好几个朋友问我mba怎么样了,所以今天尽量客观
MyBatis研习录(01)——MyBatis概述与入门
C语言自学完备手册(33篇) Android多分辨率适配框架 JavaWeb核心技术系列教程 HTML5前端开发实战系列教程 MySQL数据库实操教程(35篇图文版) 推翻自己和过往——自定义View系列教程(10篇) 走出思维困境,踏上精进之路——Android开发进阶精华录 讲给Android程序员看的前端系列教程(40集免费视频教程+源码) 版权声明 本文原创作者:谷哥的小弟 作者博客
程序员一般通过什么途径接私活?
二哥,你好,我想知道一般程序猿都如何接私活,我也想接,能告诉我一些方法吗? 上面是一个读者“烦不烦”问我的一个问题。其实不止是“烦不烦”,还有很多读者问过我类似这样的问题。 我接的私活不算多,挣到的钱也没有多少,加起来不到 20W。说实话,这个数目说出来我是有点心虚的,毕竟太少了,大家轻喷。但我想,恰好配得上“一般程序员”这个称号啊。毕竟苍蝇再小也是肉,我也算是有经验的人了。 唾弃接私活、做外
Python爬虫爬取淘宝,京东商品信息
小编是一个理科生,不善长说一些废话。简单介绍下原理然后直接上代码。 使用的工具(Python+pycharm2019.3+selenium+xpath+chromedriver)其中要使用pycharm也可以私聊我selenium是一个框架可以通过pip下载 pip install selenium -i https://pypi.tuna.tsinghua.edu.cn/simple/ 
阿里程序员写了一个新手都写不出的低级bug,被骂惨了。
你知道的越多,你不知道的越多 点赞再看,养成习惯 本文 GitHub https://github.com/JavaFamily 已收录,有一线大厂面试点思维导图,也整理了很多我的文档,欢迎Star和完善,大家面试可以参照考点复习,希望我们一起有点东西。 前前言 为啥今天有个前前言呢? 因为你们的丙丙啊,昨天有牌面了哟,直接被微信官方推荐,知乎推荐,也就仅仅是还行吧(心里乐开花)
Java工作4年来应聘要16K最后没要,细节如下。。。
前奏: 今天2B哥和大家分享一位前几天面试的一位应聘者,工作4年26岁,统招本科。 以下就是他的简历和面试情况。 基本情况: 专业技能: 1、&nbsp;熟悉Sping了解SpringMVC、SpringBoot、Mybatis等框架、了解SpringCloud微服务 2、&nbsp;熟悉常用项目管理工具:SVN、GIT、MAVEN、Jenkins 3、&nbsp;熟悉Nginx、tomca
Python爬虫精简步骤1 获取数据
爬虫的工作分为四步: 1.获取数据。爬虫程序会根据我们提供的网址,向服务器发起请求,然后返回数据。 2.解析数据。爬虫程序会把服务器返回的数据解析成我们能读懂的格式。 3.提取数据。爬虫程序再从中提取出我们需要的数据。 4.储存数据。爬虫程序把这些有用的数据保存起来,便于你日后的使用和分析。 这一篇的内容就是:获取数据。 首先,我们将会利用一个强大的库——requests来获取数据。 在电脑上安装
Python绘图,圣诞树,花,爱心 | Turtle篇
1.画圣诞树 import turtle screen = turtle.Screen() screen.setup(800,600) circle = turtle.Turtle() circle.shape('circle') circle.color('red') circle.speed('fastest') circle.up() square = turtle.Turtle()
作为一个程序员,CPU的这些硬核知识你必须会!
CPU对每个程序员来说,是个既熟悉又陌生的东西? 如果你只知道CPU是中央处理器的话,那可能对你并没有什么用,那么作为程序员的我们,必须要搞懂的就是CPU这家伙是如何运行的,尤其要搞懂它里面的寄存器是怎么一回事,因为这将让你从底层明白程序的运行机制。 随我一起,来好好认识下CPU这货吧 把CPU掰开来看 对于CPU来说,我们首先就要搞明白它是怎么回事,也就是它的内部构造,当然,CPU那么牛的一个东
破14亿,Python分析我国存在哪些人口危机!
2020年1月17日,国家统计局发布了2019年国民经济报告,报告中指出我国人口突破14亿。 猪哥的朋友圈被14亿人口刷屏,但是很多人并没有看到我国复杂的人口问题:老龄化、男女比例失衡、生育率下降、人口红利下降等。 今天我们就来分析一下我们国家的人口数据吧! 更多有趣分析教程,扫描下方二维码关注vx公号「裸睡的猪」 即可查看! 一、背景 1.人口突破14亿 2020年1月17日,国家统计局发布
web前端javascript+jquery知识点总结
Javascript javascript 在前端网页中占有非常重要的地位,可以用于验证表单,制作特效等功能,它是一种描述语言,也是一种基于对象(Object)和事件驱动并具有安全性的脚本语言 ,语法同java类似,是一种解释性语言,边执行边解释。 JavaScript的组成: ECMAScipt 用于描述: 语法,变量和数据类型,运算符,逻辑控制语句,关键字保留字,对象。 浏览器对象模型(Br
Python实战:抓肺炎疫情实时数据,画2019-nCoV疫情地图
文章目录1. 前言2. 数据下载3. 数据处理4. 数据可视化 1. 前言 今天,群里白垩老师问如何用python画武汉肺炎疫情地图。白垩老师是研究海洋生态与地球生物的学者,国家重点实验室成员,于不惑之年学习python,实为我等学习楷模。先前我并没有关注武汉肺炎的具体数据,也没有画过类似的数据分布图。于是就拿了两个小时,专门研究了一下,遂成此文。 2月6日追记:本文发布后,腾讯的数据源多次变更u
听说想当黑客的都玩过这个Monyer游戏(1~14攻略)
第零关 进入传送门开始第0关(游戏链接) 请点击链接进入第1关: 连接在左边→ ←连接在右边 看不到啊。。。。(只能看到一堆大佬做完的留名,也能看到菜鸡的我,在后面~~) 直接fn+f12吧 &lt;span&gt;连接在左边→&lt;/span&gt; &lt;a href="first.php"&gt;&lt;/a&gt; &lt;span&gt;←连接在右边&lt;/span&gt; o
在家远程办公效率低?那你一定要收好这个「在家办公」神器!
相信大家都已经收到国务院延长春节假期的消息,接下来,在家远程办公可能将会持续一段时间。 但是问题来了。远程办公不是人在电脑前就当坐班了,相反,对于沟通效率,文件协作,以及信息安全都有着极高的要求。有着非常多的挑战,比如: 1在异地互相不见面的会议上,如何提高沟通效率? 2文件之间的来往反馈如何做到及时性?如何保证信息安全? 3如何规划安排每天工作,以及如何进行成果验收? ......
作为一个程序员,内存和磁盘的这些事情,你不得不知道啊!!!
截止目前,我已经分享了如下几篇文章: 一个程序在计算机中是如何运行的?超级干货!!! 作为一个程序员,CPU的这些硬核知识你必须会! 作为一个程序员,内存的这些硬核知识你必须懂! 这些知识可以说是我们之前都不太重视的基础知识,可能大家在上大学的时候都学习过了,但是嘞,当时由于老师讲解的没那么有趣,又加上这些知识本身就比较枯燥,所以嘞,大家当初几乎等于没学。 再说啦,学习这些,也看不出来有什么用啊!
渗透测试-灰鸽子远控木马
木马概述 灰鸽子( Huigezi),原本该软件适用于公司和家庭管理,其功能十分强大,不但能监视摄像头、键盘记录、监控桌面、文件操作等。还提供了黑客专用功能,如:伪装系统图标、随意更换启动项名称和表述、随意更换端口、运行后自删除、毫无提示安装等,并采用反弹链接这种缺陷设计,使得使用者拥有最高权限,一经破解即无法控制。最终导致被黑客恶意使用。原作者的灰鸽子被定义为是一款集多种控制方式于一体的木马程序
Python:爬取疫情每日数据
前言 有部分同学留言说为什么412,这是因为我代码里全国的cookies需要你自己打开浏览器更新好后替换,而且这个cookies大概只能持续20秒左右! 另外全国卫健委的数据格式一直在变,也有可能会导致爬取失败! 我现在已根据2月14日最新通报稿的格式修正了! 目前每天各大平台,如腾讯、今日头条都会更新疫情每日数据,他们的数据源都是一样的,主要都是通过各地的卫健委官网通报。 为什么已经有大量平台做
这个世界上人真的分三六九等,你信吗?
偶然间,在知乎上看到一个问题 一时间,勾起了我深深的回忆。 以前在厂里打过两次工,做过家教,干过辅导班,做过中介。零下几度的晚上,贴过广告,满脸、满手地长冻疮。   再回首那段岁月,虽然苦,但让我学会了坚持和忍耐。让我明白了,在这个世界上,无论环境多么的恶劣,只要心存希望,星星之火,亦可燎原。   下文是原回答,希望能对你能有所启发。   如果我说,这个世界上人真的分三六九等,
B 站上有哪些很好的学习资源?
哇说起B站,在小九眼里就是宝藏般的存在,放年假宅在家时一天刷6、7个小时不在话下,更别提今年的跨年晚会,我简直是跪着看完的!! 最早大家聚在在B站是为了追番,再后来我在上面刷欧美新歌和漂亮小姐姐的舞蹈视频,最近两年我和周围的朋友们已经把B站当作学习教室了,而且学习成本还免费,真是个励志的好平台ヽ(.◕ฺˇд ˇ◕ฺ;)ノ 下面我们就来盘点一下B站上优质的学习资源: 综合类 Oeasy: 综合
雷火神山直播超两亿,Web播放器事件监听是怎么实现的?
Web播放器解决了在手机浏览器和PC浏览器上播放音视频数据的问题,让视音频内容可以不依赖用户安装App,就能进行播放以及在社交平台进行传播。在视频业务大数据平台中,播放数据的统计分析非常重要,所以Web播放器在使用过程中,需要对其内部的数据进行收集并上报至服务端,此时,就需要对发生在其内部的一些播放行为进行事件监听。 那么Web播放器事件监听是怎么实现的呢? 01 监听事件明细表 名
3万字总结,Mysql优化之精髓
本文知识点较多,篇幅较长,请耐心学习 MySQL已经成为时下关系型数据库产品的中坚力量,备受互联网大厂的青睐,出门面试想进BAT,想拿高工资,不会点MySQL优化知识,拿offer的成功率会大大下降。 为什么要优化 系统的吞吐量瓶颈往往出现在数据库的访问速度上 随着应用程序的运行,数据库的中的数据会越来越多,处理时间会相应变慢 数据是存放在磁盘上的,读写速度无法和内存相比 如何优化 设计
Python新型冠状病毒疫情数据自动爬取+统计+发送报告+数据屏幕(三)发送篇
今天介绍的项目是使用 Itchat 发送统计报告 项目功能设计: 定时爬取疫情数据存入Mysql 进行数据分析制作疫情报告 使用itchat给亲人朋友发送分析报告(本文) 基于Django做数据屏幕 使用Tableau做数据分析 来看看最终效果 目前已经完成,预计2月12日前更新 使用 itchat 发送数据统计报告 itchat 是一个基于 web微信的一个框架,但微信官方并不允
作为程序员的我,大学四年一直自学,全靠这些实用工具和学习网站!
我本人因为高中沉迷于爱情,导致学业荒废,后来高考,毫无疑问进入了一所普普通通的大学,实在惭愧...... 我又是那么好强,现在学历不行,没办法改变的事情了,所以,进入大学开始,我就下定决心,一定要让自己掌握更多的技能,尤其选择了计算机这个行业,一定要多学习技术。 在进入大学学习不久后,我就认清了一个现实:我这个大学的整体教学质量和学习风气,真的一言难尽,懂的人自然知道怎么回事? 怎么办?我该如何更好的提升
粒子群算法求解物流配送路线问题(python)
粒子群算法求解物流配送路线问题(python) 1.查找论文文献 找一篇物流配送路径优化+粒子群算法求解的论文 参考文献:基于混沌粒子群算法的物流配送路径优化 2.了解粒子群算法的原理 讲解通俗易懂,有数学实例的博文:https://blog.csdn.net/daaikuaichuan/article/details/81382794 3.确定编码方式和解码策略 3.1编码方式 物流配送路线的
教你如何编写第一个简单的爬虫
很多人知道爬虫,也很想利用爬虫去爬取自己想要的数据,那么爬虫到底怎么用呢?今天就教大家编写一个简单的爬虫。 下面以爬取笔者的个人博客网站为例获取第一篇文章的标题名称,教大家学会一个简单的爬虫。 第一步:获取页面 #!/usr/bin/python # coding: utf-8 import requests #引入包requests link = "http://www.santostang.
前端JS初级面试题二 (。•ˇ‸ˇ•。)老铁们!快来瞧瞧自己都会了么
1. 传统事件绑定和符合W3C标准的事件绑定有什么区别? 传统事件绑定 &lt;div onclick=""&gt;123&lt;/div&gt; div1.onclick = function(){}; &lt;button onmouseover=""&gt;&lt;/button&gt; 注意: 如果给同一个元素绑定了两次或多次相同类型的事件,那么后面的绑定会覆盖前面的绑定 (不支持DOM事...
相关热词 c# 压缩图片好麻烦 c#计算数组中的平均值 c#获取路由参数 c#日期精确到分钟 c#自定义异常必须继承 c#查表并返回值 c# 动态 表达式树 c# 监控方法耗时 c# listbox c#chart显示滚动条
立即提问