makefile把一个 .cpp文件和它所依赖的几个 .a(静态库文件 ) 生成一个动态库文件.so

假设编译交叉编译工具路径为dir1(arm-linux-androideabi-gcc-4.9 ),存放生成的.so文件的路径为dir2,test.cpp,依赖1.a,2.a,3.a这三个静态文件库,Makefile文件应该怎么写

1个回答

arm-linux-androideabi-gcc-4.9 -fPIC -shared -o dir2/xxx.so test.cpp 1.a 2.a 3.a

Csdn user default icon
上传中...
上传图片
插入图片
抄袭、复制答案,以达到刷声望分或其他目的的行为,在CSDN问答是严格禁止的,一经发现立刻封号。是时候展现真正的技术了!
其他相关推荐
ubuntu 安装配置c++的opencv 报错
我在ubuntu 上打算安装和配置c++的Opencv, 下载了opencv3.1.0版本的代码,然后也手动的下载了ippicv_linux_20151201.tgz。创建build文件夹后Cmake命令已经可以编译过去了。 但是在执行make命令的时候,经常会报错: ``` [ 15%] Building CXX object modules/core/CMakeFiles/opencv_core.dir/opencl_kernels_core.cpp.o [ 15%] Linking CXX shared library ../../lib/libopencv_core.so /usr/bin/ld: CMakeFiles/opencv_core.dir/src/va_intel.cpp.o: relocation R_X86_64_32 against `.rodata' can not be used when making a shared object; recompile with -fPIC CMakeFiles/opencv_core.dir/src/va_intel.cpp.o: 无法添加符号: 错误的值 collect2: error: ld returned 1 exit status modules/core/CMakeFiles/opencv_core.dir/build.make:1382: recipe for target 'lib/libopencv_core.so.3.1.0' failed make[2]: *** [lib/libopencv_core.so.3.1.0] Error 1 CMakeFiles/Makefile2:1420: recipe for target 'modules/core/CMakeFiles/opencv_core.dir/all' failed make[1]: *** [modules/core/CMakeFiles/opencv_core.dir/all] Error 2 Makefile:160: recipe for target 'all' failed make: *** [all] Error 2 ``` 有时候在33%进度的时候报这个错误,有时候就在15%时候报。我整整试了一整天,查遍了各种解决方法都无济于事。请大侠们帮忙解决下吧。跪谢。 是否有直接加载已经编译好的库的方式,可以快速实现配置,因为我急需要用Opencv实现代码。感谢各位大侠了。
使用CLion遇到的问题 multiple definition of `main' ld returned 1 exit status
![图片说明](https://img-ask.csdn.net/upload/202001/09/1578585095_670327.png) [ 33%] Linking CXX executable untitled.exe CMakeFiles\untitled.dir/objects.a(test.cpp.obj): In function `main': C:/Users/Lee/CLionProjects/untitled/test.cpp:2: multiple definition of `main' CMakeFiles\untitled.dir/objects.a(main.cpp.obj):C:/Users/Lee/CLionProjects/untitled/main.cpp:3: first defined here collect2.exe: error: ld returned 1 exit status mingw32-make.exe[3]: *** [CMakeFiles\untitled.dir\build.make:100: untitled.exe] Error 1 mingw32-make.exe[2]: *** [CMakeFiles\Makefile2:75: CMakeFiles/untitled.dir/all] Error 2 mingw32-make.exe[1]: *** [CMakeFiles\Makefile2:82: CMakeFiles/untitled.dir/rule] Error 2 mingw32-make.exe: *** [Makefile:117: untitled] Error 2 最开始是Cmake有问题 用大佬帖子里的方法改了系统文件夹名字之后好了 然鹅 不知道是什么情况 麻烦大佬们帮忙看看
用Ubuntu16.04编译iDT算法(c++)时报错:/usr/lib/gcc/x86_64-linux-gnu/5/../../../x86_64-linux-gnu/crt1.o: In function `_start':(.text+0x20): undefined reference to `main'
最近在学习iDT算法,刚刚接触Ubuntu也刚刚接触c++,很多东西不是很懂,请教各位: 我在编译iDT算法的时候,需要依赖opencv和ffmpeg两个库,我安装成功并且确保这两个库能用之后,去编译iDT算法,'make'之后报错: ![图片说明](https://img-ask.csdn.net/upload/202001/10/1578648835_846854.png) 查过资料,有的人说是缺少main函数,但是我确保.cpp文件里是有main函数的。 也有帖子说是crt1.o文件的问题,也有帖子说是动态库的问题,现在很迷茫,不知道问题出在哪里,希望各位能够帮助我,万分感谢。 同时为了方便各位帮我找到问题,我上一下我的makefile文件以及Opencv和ffmpeg的安装信息。 Makefile文件 ``` # set the binaries that have to be built TARGETS := DenseTrack Video # set the build configuration set BUILD := release #BUILD := debug # set bin and build dirs BUILDDIR := .build_$(BUILD) BINDIR := $(BUILD) # libraries LDLIBS = $(addprefix -l, $(LIBS) $(LIBS_$(notdir $*))) LIBS := \ opencv_core opencv_highgui opencv_video opencv_imgproc \ avformat avdevice avutil avcodec swscale # set some flags and compiler/linker specific commands CXXFLAGS = -pipe -D __STDC_CONSTANT_MACROS -D STD=std -Wall $(CXXFLAGS_$(BUILD)) -I. -I/opt/include CXXFLAGS_debug := -ggdb CXXFLAGS_release := -O3 -DNDEBUG -ggdb LDFLAGS = -L/opt/lib -pipe -Wall $(LDFLAGS_$(BUILD)) LDFLAGS_debug := -ggdb LDFLAGS_release := -O3 -ggdb include make/generic.mk ``` 下面是opencv和ffmpeg的安装信息: ffmpeg: ![图片说明](https://img-ask.csdn.net/upload/202001/10/1578649174_591798.png) opencv: ![图片说明](https://img-ask.csdn.net/upload/202001/10/1578649330_643110.png) 恳请各位帮忙!!(小弟没有金币,没办法给悬赏,还请各位见谅!)
一个简单的 Makefile 问题
``` 12 13 #每个 obj 的依赖项,最好写上依赖的 .h,否则 .h 更改将不重新编译 .o 14 15 CRequestHandlerFactory.o:./CRequestHandlerFactory.cpp ./CRequestHandlerFactory.h ./CRequestHandler.h 16 $(CXX) -c $(CXXFLAGS) -o CRequestHandlerFactory.o ./CRequestHandlerFactory.cpp 17 18 CRequestHandler.o:./CRequestHandler.cpp ./CRequestHandler.h 19 $(CXX) -c $(CXXFLAGS) -o CRequestHandler.o ./CRequestHandler.cpp 20 21 22 23 24 25 all:CRequestHandler.o CRequestHandlerFactory.o 26 27 .PHONY: clean 28 clean : 29 rm -rf $(OBJS) ``` 为啥我这里指定了两个 目标, Makefile 每次确只生成上面那个目标。
makefile编译不能检测到头文件类中的函数修改
很奇怪的问题,我写了一个测试程序,用makefile进行编译,但如果我在头文件里声明了新的函数,在.cpp文件中定义这个函数,make时会提示我----错误:成员函数‘int mysql_soci_test::sum()’未在类‘mysql_soci_test’中声明--这个错误,但如果我不用makefile编译,用g++直接编译,就不会有问题。 下面是我的g++语句:g++ mysql_soci_test.h mysql_soci_test.cpp mysql_main.cpp -I include/soci -I /usr/include/mysql -L./lib -L /usr/lib64/mysql -lmysqlclient 下面是我的makefile中的语句: INCLUDES = -I include/soci -I /usr/include/mysql LIBS = -lmysqlclient -L./lib -L /usr/lib64/mysql calc: mysql_main.cpp mysql_soci_test.cpp mysql_soci_test.h g++ -o calc mysql_soci_test.h mysql_main.cpp mysql_soci_test.cpp -I. $(INCLUDES) $(LIBS) 感觉应该是没有问题的,但就是会出错,有哪位高手要是知道还望能告知一下,谢谢,在线等......
编写makefile.am时,如果库之间相互依赖依赖,该如何编写?
如题,比如有两个库:a.a和b.a。如果这两个库之间存在相互依赖的关系,在使用LDADD 变量时,应该把哪个库放在前面?这样的相互依赖能够编译通过吗?会有什么后果吗?
如何在qt上build Mysql drive
楼主系统是win10,最近在研究mysql和qt。 我在尝试用qt连接mysql服务器的时候, qt creator 告诉我说mysql drive no lead. 我去qt 的论坛上面问,人家说现在已经qt不提供mysql的drive,想用要自己搭。给我一个官方的文档,https://doc.qt.io/qt-5/sql-driver.html#how-to-build-the-qmysql-plugin-on-windows。 问题是,写文档的人估计很久没有装过mysql了,mysql安装器的Custom Install,已经没有Libs & Include Files的选项了。所以我很难确定如何执行cmd代码 ``` cd %QTDIR%\qtbase\src\plugins\sqldrivers qmake -- MYSQL_INCDIR=C:/MySQL/include "MYSQL_LIBDIR=C:/MYSQL/MySQL Server <version>/lib/opt" ``` 最后,我选择使用mysql server的文件, ``` cd %QTDIR%\qtbase\src\plugins\sqldrivers qmake -- "MYSQL_INCDIR=C:/MySql/MySQL Server 8.0/include" "MYSQL_LIBDIR=C:/MySql/MySQL Server 8.0/lib" ``` 得到结论, ``` Info: creating stash file C:\Qt\5.12.6\Src\qtbase\src\plugins\sqldrivers\.qmake.stash Running configuration tests... Checking for DB2 (IBM)... no Checking for InterBase... no Checking for MySQL... no Checking for OCI (Oracle)... no Checking for ODBC... yes Checking for PostgreSQL... no Checking for SQLite (version 2)... no Checking for TDS (Sybase)... no Done running configuration tests. Configure summary: Qt Sql Drivers: DB2 (IBM) .............................. no InterBase .............................. no MySql .................................. no OCI (Oracle) ........................... no ODBC ................................... yes PostgreSQL ............................. no SQLite2 ................................ no SQLite ................................. yes Using system provided SQLite ......... no TDS (Sybase) ........................... no Qt is now configured for building. Just run 'mingw32-make'. Once everything is built, you must run 'mingw32-make install'. Qt will be installed into 'C:\Qt\5.12.6\mingw73_32'. Prior to reconfiguration, make sure you remove any leftovers from the previous build. ``` 我检查了一下qmake log ``` Trying source 5 (type inline) of library mysql ... + cd /d C:\Qt\5.12.6\Src\qtbase\src\plugins\sqldrivers\config.tests\mysql && C:\Qt\5.12.6\mingw73_32\bin\qmake.exe "CONFIG -= qt debug_and_release app_bundle lib_bundle" "CONFIG += shared warn_off console single_arch" "QMAKE_LIBDIR += C:\\openssl\\lib C:\\Utils\\my_sql\\mysql-5.6.11-win32\\lib C:\\Utils\\postgresql\\pgsql\\lib" "INCLUDEPATH += C:\\openssl\\include C:\\Utils\\my_sql\\mysql-5.6.11-win32\\include C:\\Utils\\postgresql\\pgsql\\include" "QMAKE_USE += mysql" "QMAKE_LIBS_MYSQL = C:/MySQL/lib/libmysql.lib" "QMAKE_INCDIR_MYSQL = C:/MySQL/include" C:/Qt/5.12.6/Src/qtbase/src/plugins/sqldrivers/config.tests/mysql > Info: creating stash file C:\Qt\5.12.6\Src\qtbase\src\plugins\sqldrivers\config.tests\.qmake.stash + cd /d C:\Qt\5.12.6\Src\qtbase\src\plugins\sqldrivers\config.tests\mysql && set MAKEFLAGS=& mingw32-make > g++ -c -fno-keep-inline-dllexport -O2 -w -fexceptions -mthreads -DUNICODE -D_UNICODE -DWIN32 -DMINGW_HAS_SECURE_API=1 -I. -IC:\openssl\include -IC:\Utils\my_sql\mysql-5.6.11-win32\include -IC:\Utils\postgresql\pgsql\include -IC:\MySQL\include -IC:\Qt\5.12.6\mingw73_32\mkspecs\win32-g++ -o main.o main.cpp > g++ -Wl,-s -Wl,-subsystem,console -mthreads -o mysql.exe main.o -LC:\openssl\lib -LC:\Utils\my_sql\mysql-5.6.11-win32\lib -LC:\Utils\postgresql\pgsql\lib C:\MySQL\lib\libmysql.lib > c:/mingw/bin/../lib/gcc/mingw32/8.2.0/../../../../mingw32/bin/ld.exe: main.o:main.cpp:(.text.startup+0xc): undefined reference to `mysql_get_client_version@0' > collect2.exe: error: ld returned 1 exit status > mingw32-make: *** [Makefile:66: mysql.exe] Error 1 ``` 看来问题是出在了 undefined reference to `mysql_get_client_version@0' mysql看起来并没有进去。有没有熟悉mysql和qt的大佬解答一下。多谢了和最近有用qt的大佬解答一下。
Makefile找不到头文件
小白学习Makefile遇到一个小问题,一直没找到解决方案,求教各位大神解答 系统环境:Ubuntu14.04 文件夹目录下的文件:main.c,add.c,math.h,defi.h,Makefile 文件内容: math.h ``` int add(int x,int y); ``` add.c ``` #include<math.h> int add(int x,int y) { return x+y; } ``` defi.h ``` #define A 1 ``` main.c ``` #include<stdio.h> #include<math.h> #include<defi.h> int main() { int result = 0; result = add(4,A); printf("result:%d\n",result); return 0; } ``` Makefile ``` edit : main.o add.o gcc -o edit main.o add.o main.o: main.c math.h defi.h gcc -c main.c add.o: add.c math.h gcc -c add.c clean: rm edit main.o add.o ``` 在Linux该文件夹目录下执行make总是提示找不到defi.h头文件,但是我在Makefile和main.c中去掉defi.h头文件,并将main.c文件中的“A”用“1”来代替就可以运行 请问各位大神这是什么原因导致的啊,本人新手,所以makefile中没用变量这些来定义头文件路径,只是用这种最基础的方式来写
Linux系统下编写一个C++程序 如何正确的写makefile
我写了一个很简单的程序有 main.cpp display.cpp display.h 可是make时 总显示找不到 display.h 求问怎么写makefile呀
openssl 静态库libcrypto.a怎样用?
各位大佬,我现在在项目中需要用libcrypto.a静态库,现在已经生成了libcrypto.a,可是在 在makefile中 -L libcrypto.a的路径之后,还是提示有的函数找不着,用动态库libcrypto.so 倒是可以,这个libcrypto.a到底该怎样用啊?
Ubuntu18.04配置OPENCV3.3.1时make报错
在给Ubuntu18.04下载编译openCV3.3.1时, 参照https://blog.csdn.net/zhaoxr233/article/details/90036824 在做到make那一步时,报了以下error,在网上查询无果,不知如何解决,烦请各位大佬指点 ``` Linking CXX executable ../../bin/opencv_visualisation ../../lib/libopencv_core.a(hal_internal.cpp.o):在函数‘lapack_gemm32f(float const*, unsigned long, float const*, unsigned long, float, float const*, unsigned long, float, float*, unsigned long, int, int, int, int)’中: hal_internal.cpp:(.text._Z14lapack_gemm32fPKfmS0_mfS0_mfPfmiiii+0x3d2):对‘cblas_sgemm(CBLAS_ORDER, CBLAS_TRANSPOSE, CBLAS_TRANSPOSE, int, int, int, float, float const*, int, float const*, int, float, float*, int)’未定义的引用 ............ ../../lib/libopencv_core.a(hal_internal.cpp.o):在函数‘lapack_gemm64fc(double const*, unsigned long, double const*, unsigned long, double, double const*, unsigned long, double, double*, unsigned long, int, int, int, int)’中: hal_internal.cpp:(.text._Z15lapack_gemm64fcPKdmS0_mdS0_mdPdmiiii+0x29e):对‘cblas_zgemm(CBLAS_ORDER, CBLAS_TRANSPOSE, CBLAS_TRANSPOSE, int, int, int, void const*, void const*, int, void const*, int, void const*, void*, int)’未定义的引用 hal_internal.cpp:(.text._Z15lapack_gemm64fcPKdmS0_mdS0_mdPdmiiii+0x2f5):对‘cblas_cgemm(CBLAS_ORDER, CBLAS_TRANSPOSE, CBLAS_TRANSPOSE, int, int, int, void const*, void const*, int, void const*, int, void const*, void*, int)’未定义的引用 collect2: error: ld returned 1 exit status apps/annotation/CMakeFiles/opencv_annotation.dir/build.make:119: recipe for target 'bin/opencv_annotation' failed make[2]: *** [bin/opencv_annotation] Error 1 CMakeFiles/Makefile2:4522: recipe for target 'apps/annotation/CMakeFiles/opencv_annotation.dir/all' failed make[1]: *** [apps/annotation/CMakeFiles/opencv_annotation.dir/all] Error 2 ```
makefile 基本用法问题
一直以来都是直接用别人的makefile,今天想学一下makefile怎么用。我做的就第一个测试出错了。 makefile 如下(tab 按键问题我没有出现) ``` CC = clang++ app : main.o CC -o app main.o main.o : main.cpp CC -c main.cpp clean : app main.o ``` 这里只有一个 main.cpp ``` #include <iostream> int main(int argc,char* argv[]) { std::cout<<"Hello World!\n"; } ``` 直接在终端用 clang++ ./main.cpp -o app 一切都很和谐,用这个makefile make 就出错。 我这makefile 错在哪里了?
在树莓派(Raspbian系统)下安装open,编译时,cap_ffmpeg.cpp报错不通过
如题,已经两天了!在试了opencv2.4.9,2.4.10,2.3.1三个版本,在make时都是在 同一个地方报错,下贴上报错的内容 modules/highgui/CMakeFiles/opencv_highgui.dir/build.make:215: recipe for target 'modules/highgui/CMakeFiles/opencv_highgui.dir/src/cap_ffmpeg.cpp.o' failed make[2]: *** [modules/highgui/CMakeFiles/opencv_highgui.dir/src/cap_ffmpeg.cpp.o ] Error 1 CMakeFiles/Makefile2:1772: recipe for target 'modules/highgui/CMakeFiles/opencv_ highgui.dir/all' failed make[1]: *** [modules/highgui/CMakeFiles/opencv_highgui.dir/all] Error 2 Makefile:137: recipe for target 'all' failed make: *** [all] Error 2 我怀疑是cap_ffmpeg.h或者cap_ffmpeg.cpp有什么问题,但是不知道该怎么办, 百度了很多,其中这个帖子http://www.xuebuyuan.com/2046558.html似乎问题 和我很相似,但是并没有解决办法。找到了另外一个帖子http://blog.csdn.net/xizero00/article/details/7386695,问题也一样,它给出了解决办法还有改好的cap_ffmpeg.h,但是放上去,还是不管用。 毕设就差这个问题了.....求解救
C语言中编写makefile遇到的问题
自己在博客中写了由几个文件构成的代码,最后生成了一个静态库叫做libsum.a,里面保存着几个供main() 函数调用的函数,自己最后再把这个库和mian.c文件一起编译。可是makefile中一直报错 (具体的错误在博客最后面写出来了,我感觉不知道为什么?我用gcc -o 有问题吗?) [自己写的博客](http://blog.csdn.net/u013610563/article/details/50748187 "") 感谢大家,感谢平台。
/usr/bin/ld: cannot find -lOPTIONS 无法找到OPTIONS库。
我在UBUNTU 18.04 下用CUDA 10.2 和 C++11标准编译一个较大的工程。 Makefile 是用CMAKE文件生成的。当我在terminal完成编译时显示了如下错误: ``` /usr/bin/ld: cannot find -lOPTIONS collect2: error: ld returned 1 exit status CMakeFiles/cuda_othermain.dir/build.make:132: recipe for target 'bin/cuda_othermain' failed make[2]: *** [bin/cuda_othermain] Error 1 CMakeFiles/Makefile2:79: recipe for target 'CMakeFiles/cuda_othermain.dir/all' failed make[1]: *** [CMakeFiles/cuda_othermain.dir/all] Error 2 Makefile:83: recipe for target 'all' failed make: *** [all] Error 2 ``` 提示是找不到一个叫OPTIONS的库。我的camke和源码里都没有链接这个库,而且我在网上搜索也根本没有一个库叫做OPTIONS。我很疑惑,编译工程时没有显示任何其他错误,顶多就是有几个warning,我查了一下都是没有太大关系的。所以现在没有什么思路去解决这个问题。 所以想请教一下各位有没有什么解决思路。 CMAKE文件如下: ``` cmake_minimum_required (VERSION 3.8 FATAL_ERROR) #project (cusam_cuda) project(cusam_cuda LANGUAGES C CXX CUDA) find_package(CUDA 10.2 REQUIRED) set(CUDA_NVCC_FLAGS -std=c++11 -L/usr/local/cuda-10.2/lib64 -lcudart -lcuda) set(CMAKE_CXX_STANDARD 11) if (CUDA_VERBOSE_PTXAS) set(VERBOSE_PTXAS --ptxas-options=-v) endif (CUDA_VERBOSE_PTXAS) #set(CMAKE_BUILD_TYPE "Release") set(CMAKE_BUILD_TYPE "Debug") SET(CMAKE_CXX_FLAGS_DEBUG "$ENV{CUDA_NVCC_FLAGS} -O0 -Wall -g -ggdb") SET(CMAKE_CXX_FLAGS_RELEASE "$ENV{CUDA_NVCC_FLAGS} -O3 -Wall") set(CMAKE_RUNTIME_OUTPUT_DIRECTORY ${CMAKE_BINARY_DIR}/bin) set(GENCODE_SM30 -gencode=arch=compute_30,code=sm_30 -gencode=arch=compute_30,code=compute_30) set(GENCODE_SM35 -gencode=arch=compute_35,code=sm_35 -gencode=arch=compute_35,code=compute_35) set(GENCODE_SM37 -gencode=arch=compute_37,code=sm_37 -gencode=arch=compute_37,code=compute_37) set(GENCODE_SM50 -gencode=arch=compute_50,code=sm_50 -gencode=arch=compute_50,code=compute_50) set(GENCODE_SM60 -gencode=arch=compute_60,code=sm_60 -gencode=arch=compute_60,code=compute_60) set(GENCODE_SM61 -gencode=arch=compute_61,code=sm_61 -gencode=arch=compute_61,code=compute_61) set(GENCODE_SM70 -gencode=arch=compute_70,code=sm_70 -gencode=arch=compute_70,code=compute_70) set(GENCODE_SM71 -gencode=arch=compute_71,code=sm_71 -gencode=arch=compute_71,code=compute_71) set(GENCODE_SM75 -gencode=arch=compute_75,code=sm_75 -gencode=arch=compute_75,code=compute_75) option(CUDAMATRIX_GENCODE_SM30 "GENCODE_SM30" OFF) option(CUDAMATRIX_GENCODE_SM35 "GENCODE_SM35" ON) option(CUDAMATRIX_GENCODE_SM37 "GENCODE_SM37" OFF) option(CUDAMATRIX_GENCODE_SM50 "GENCODE_SM50" OFF) option(CUDAMATRIX_GENCODE_SM60 "GENCODE_SM60" OFF) option(CUDAMATRIX_GENCODE_SM61 "GENCODE_SM61" OFF) option(CUDAMATRIX_GENCODE_SM70 "GENCODE_SM70" OFF) option(CUDAMATRIX_GENCODE_SM71 "GENCODE_SM71" OFF) option(CUDAMATRIX_GENCODE_SM75 "GENCODE_SM75" OFF) if (CUDAMATRIX_GENCODE_SM37) set(GENCODE ${GENCODE} ${GENCODE_SM37}) endif(CUDAMATRIX_GENCODE_SM37) if (CUDAMATRIX_GENCODE_SM50) set(GENCODE ${GENCODE} ${GENCODE_SM50}) endif(CUDAMATRIX_GENCODE_SM50) if (CUDAMATRIX_GENCODE_SM60) set(GENCODE ${GENCODE} ${GENCODE_SM60}) endif(CUDAMATRIX_GENCODE_SM60) if (CUDAMATRIX_GENCODE_SM61) set(GENCODE ${GENCODE} ${GENCODE_SM61}) endif(CUDAMATRIX_GENCODE_SM61) if (CUDAMATRIX_GENCODE_SM70) set(GENCODE ${GENCODE} ${GENCODE_SM70}) endif(CUDAMATRIX_GENCODE_SM70) if(CUDAMATRIX_GENCODE_SM71) set(GENCODE ${GENCODE} ${GENCODE_SM71}) endif(CUDAMATRIX_GENCODE_SM71) if(CUDAMATRIX_GENCODE_SM75) set(GENCODE ${GENCODE} ${GENCODE_SM75}) endif(CUDAMATRIX_GENCODE_SM75) include_directories(/usr/local/cuda/include) include_directories(utils) #include_directories(3rdparty/googletest/googletest) #include_directories(3rdparty/googletest/googletest/include) #add_subdirectory(3rdparty/googletest/googletest googletest.out) add_subdirectory(geometry) add_subdirectory(navigation) add_subdirectory(3rdparty) add_subdirectory(nonlinear) add_subdirectory(inference) add_subdirectory(mat) add_subdirectory(miniblas) add_subdirectory(miniblas/cblas) add_subdirectory(miniblas/blas) add_subdirectory(miniblas/permutation) add_subdirectory(miniblas/sys) add_subdirectory(miniblas/linalg) add_subdirectory(linear) #add_subdirectory(test) #cuda_add_executable(imukittiexamplegps_gaussiannewton imukittiexamplegps_gaussiannewton.cpp # OPTIONS ${GENCODE} ${CUDA_VERBOSE_PTXAS}) #target_link_libraries(imukittiexamplegps_gaussiannewton geometry miniblas blas cblas linalg permutation sys navigation 3rdparty linear nonlinear inference mat) #cuda_add_executable(othermain othermain.cpp # OPTIONS ${GENCODE} ${CUDA_VERBOSE_PTXAS}) #target_link_libraries(othermain geometry miniblas blas cblas linalg permutation sys navigation 3rdparty linear nonlinear inference mat) target_compile_features(nonlinear PUBLIC cxx_std_11) cuda_add_executable(cuda_othermain cuda_othermain.cu OPTIONS ${GENCODE} ${CUDA_VERBOSE_PTXAS}) target_compile_features(cuda_othermain PUBLIC cxx_std_11) set_target_properties(cuda_othermain PROPERTIES CUDA_SEPARABLE_COMPILATION ON) target_link_libraries(cuda_othermain geometry miniblas blas cblas linalg permutation sys navigation 3rdparty linear nonlinear inference mat) ``` 源代码就没发帖了,因为工程还算比较大。有劳各位了。
关于大程序代码包的函数库使用问题
感谢诸位能够关注我的这个问题, 我有一个程序代码包,里面都是.h和.c文件,它只提供了linux和macos版本的makefile文件,具体程序包感兴趣可以搜索vega fem第一个主页就有了 这个是一个工具包,里面有很多opengl相关的函数和接口,我是可以在未来直接使用这些.h和.c文件吗? 我目前的想法是把它编译成.lib包,然后需要在每一个.h文件中加入#pragma comment 链接.lib文件,但是在windows上不能直接编译,无法使用nmake直接生成.lib(makefile目标只有.a),所以想问下大家有没有什么好的方法使用这些工具函数。
关于caffe修改源码和编译的疑问
配置完caffe之后,最近想做一件事情,就是我想对制作lmdb文件的过程做一点修改,所以我打算改一下原来的convert_imageset.cpp文件,并重新编译生成可执行文件convert_imageset。 首先,我尝试着用: g++ convert_imageset.cpp -o convert_imageset 编译,这时候终端提醒的错误是: convert_imageset.cpp:22:29: fatal error: caffe/util/db.hpp: 没有那个文件或目录 #include "caffe/util/db.hpp" 意识到是头文件的问题,那我就重新试了一下: g++ convert_imageset.cpp -o convert_imageset -I/home/lichenyang/caffe/include 结果出现了下面的错误: /home/lichenyang/caffe/include/caffe/util/device_alternate.hpp:34:23: fatal error: cublas_v2.h: 没有那个文件或目录 #include <cublas_v2.h> 这个我估计是CPU和GPU的问题。 我的显卡是A卡,当时在配置caffe的时候修改了Makefile.config,将CPU_ONLY := 1的注释去掉了,caffe的配置也没有出错。 所以我的疑问是:如果我想对caffe的某个.cpp文件进行修改(比如:convert_imageset.cpp),那么我在修改完成之后,应该如何正确变编译出可执行文件?有没有大神能够指点一下,或者提供一下这方面的博文,感激不尽!
求教一个makefile文件的具体含义
makefile文件内容如下: CFLAGS=-O3 -mcpu=cortex-a8 -mfpu=neon -std=gnu99 -Wall -pedantic -Wno-long-long all: check bench debug: @$(CC) $(CFLAGS) -DNORX_DEBUG -I. -o debug ../../utils/debug.c norx.c @./debug @rm debug bench: @$(CC) $(CFLAGS) -o bench ../../utils/bench.c norx.c caesar.c @./bench @rm bench check: @$(CC) $(CFLAGS) -I../ -o check ../../utils/check.c norx.c caesar.c @./check @rm check .PHONY: check debug bench 求教此makefile文件具体的生效过程是什么,使用make命令后,是怎样进行编译链接的
vs2010错误机器人足球
最近在学习机器人足球 用的是vs2010运行代码 老是出现错误 3> ------ Building libbhuman (Release) ------ 3> bhuman.cpp 1> Enum.cpp 1> Global.cpp 1> Geometry.cpp 1> Pose2D.cpp 1> OutStreams.cpp 3> ..\..\Src\libbhuman\bhuman.cpp(14) :28: warning: alcore\altypes.h: No such file or directory 3> ..\..\Src\libbhuman\bhuman.cpp(15) :28: warning: alcore\alerror.h: No such file or directory 3> ..\..\Src\libbhuman\bhuman.cpp(16) :31: warning: alcommon\albroker.h: No such file or directory 3> ..\..\Src\libbhuman\bhuman.cpp(17) :30: warning: alcommon\alproxy.h: No such file or directory 3> ..\..\Src\libbhuman\bhuman.cpp(18) :32: warning: alproxies\dcmproxy.h: No such file or directory 3> ..\..\Src\libbhuman\bhuman.cpp(19) :37: warning: alproxies\almemoryproxy.h: No such file or directory 3>..\..\Src\libbhuman\bhuman.cpp(29): error : 'AL' has not been declared 3>..\..\Src\libbhuman\bhuman.cpp(29): error : expected constructor, destructor, or type conversion before '*' token 3>..\..\Src\libbhuman\bhuman.cpp(30): error : 'AL' has not been declared 3>..\..\Src\libbhuman\bhuman.cpp(30): error : expected constructor, destructor, or type conversion before '*' token 3>..\..\Src\libbhuman\bhuman.cpp(31): error : 'AL' has not been declared 3>..\..\Src\libbhuman\bhuman.cpp(31): error : expected constructor, destructor, or type conversion before '*' token 3>..\..\Src\libbhuman\bhuman.cpp(32): error : 'AL' has not been declared 3>..\..\Src\libbhuman\bhuman.cpp(32): error : expected constructor, destructor, or type conversion before '*' token 3>..\..\Src\libbhuman\bhuman.cpp(33): error : 'AL' has not been declared 3>..\..\Src\libbhuman\bhuman.cpp(33): error : expected constructor, destructor, or type conversion before '*' token 3>..\..\Src\libbhuman\bhuman.cpp(34): error : 'AL' has not been declared 3>..\..\Src\libbhuman\bhuman.cpp(34): error : expected constructor, destructor, or type conversion before '*' token 3> ..\..\Src\libbhuman\bhuman.cpp: In function 'void sitDown(float, float*)': 3>..\..\Src\libbhuman\bhuman.cpp(424): error : 'positionRequest' was not declared in this scope 3>..\..\Src\libbhuman\bhuman.cpp(425): error : 'hardnessRequest' was not declared in this scope 3> ..\..\Src\libbhuman\bhuman.cpp: In function 'void standUp(float, float*, float*)': 3>..\..\Src\libbhuman\bhuman.cpp(455): error : 'positionRequest' was not declared in this scope 3> ..\..\Src\libbhuman\bhuman.cpp: In function 'void onPreProcess()': 3>..\..\Src\libbhuman\bhuman.cpp(475): error : 'proxy' was not declared in this scope 3>..\..\Src\libbhuman\bhuman.cpp(475): error : 'positionRequest' was not declared in this scope 3>..\..\Src\libbhuman\bhuman.cpp(475): error : 'hardnessRequest' was not declared in this scope 3>..\..\Src\libbhuman\bhuman.cpp(486): error : 'stderr' was not declared in this scope 3>..\..\Src\libbhuman\bhuman.cpp(486): error : 'fprintf' was not declared in this scope 3>..\..\Src\libbhuman\bhuman.cpp(563): error : 'usRequest' was not declared in this scope 3>..\..\Src\libbhuman\bhuman.cpp(575): error : 'ledRequest' was not declared in this scope 3>..\..\Src\libbhuman\bhuman.cpp(575): error : 'string' is not a member of 'std' 3>..\..\Src\libbhuman\bhuman.cpp(582): error : expected type-specifier before 'AL' 3>..\..\Src\libbhuman\bhuman.cpp(582): error : expected `)' before '::' token 3>..\..\Src\libbhuman\bhuman.cpp(582): error : expected `{' before '::' token 3>..\..\Src\libbhuman\bhuman.cpp(582): error : '::ALError' has not been declared 3>..\..\Src\libbhuman\bhuman.cpp(582): error : 'e' was not declared in this scope 3>..\..\Src\libbhuman\bhuman.cpp(582): error : expected `;' before ')' token 3> ..\..\Src\libbhuman\bhuman.cpp: In function 'void onPostProcess()': 3>..\..\Src\libbhuman\bhuman.cpp(591): error : 'memory' was not declared in this scope 3>..\..\Src\libbhuman\bhuman.cpp(591): error : 'proxy' was not declared in this scope 3>..\..\Src\libbhuman\bhuman.cpp(601): error : 'assert' was not declared in this scope 3>..\..\Src\libbhuman\bhuman.cpp(616): error : 'system' was not declared in this scope 3>..\..\Src\libbhuman\bhuman.cpp(618): error : 'system' was not declared in this scope 3>..\..\Src\libbhuman\bhuman.cpp(622): error : expected type-specifier before 'AL' 3>..\..\Src\libbhuman\bhuman.cpp(622): error : expected `)' before '::' token 3>..\..\Src\libbhuman\bhuman.cpp(622): error : expected `{' before '::' token 3>..\..\Src\libbhuman\bhuman.cpp(622): error : '::ALError' has not been declared 3>..\..\Src\libbhuman\bhuman.cpp(622): error : 'e' was not declared in this scope 3>..\..\Src\libbhuman\bhuman.cpp(622): error : expected `;' before ')' token 3>..\..\Src\libbhuman\bhuman.cpp(641): error : 'stderr' was not declared in this scope 3>..\..\Src\libbhuman\bhuman.cpp(641): error : 'fprintf' was not declared in this scope 3> ..\..\Src\libbhuman\bhuman.cpp: In function 'void close()': 3>..\..\Src\libbhuman\bhuman.cpp(650): error : 'stderr' was not declared in this scope 3>..\..\Src\libbhuman\bhuman.cpp(650): error : 'fprintf' was not declared in this scope 3>..\..\Src\libbhuman\bhuman.cpp(648): error : too many arguments to function 'void close()' 3>..\..\Src\libbhuman\bhuman.cpp(662): error : at this point in file 3>..\..\Src\libbhuman\bhuman.cpp(674): error : 'proxy' was not declared in this scope 3>..\..\Src\libbhuman\bhuman.cpp(676): error : type '<type error>' argument given to 'delete', expected pointer 3>..\..\Src\libbhuman\bhuman.cpp(679): error : 'positionRequest' was not declared in this scope 3>..\..\Src\libbhuman\bhuman.cpp(681): error : type '<type error>' argument given to 'delete', expected pointer 3>..\..\Src\libbhuman\bhuman.cpp(684): error : 'hardnessRequest' was not declared in this scope 3>..\..\Src\libbhuman\bhuman.cpp(686): error : type '<type error>' argument given to 'delete', expected pointer 3>..\..\Src\libbhuman\bhuman.cpp(689): error : 'usRequest' was not declared in this scope 3>..\..\Src\libbhuman\bhuman.cpp(691): error : type '<type error>' argument given to 'delete', expected pointer 3>..\..\Src\libbhuman\bhuman.cpp(694): error : 'ledRequest' was not declared in this scope 3>..\..\Src\libbhuman\bhuman.cpp(696): error : type '<type error>' argument given to 'delete', expected pointer 3>..\..\Src\libbhuman\bhuman.cpp(699): error : 'memory' was not declared in this scope 3>..\..\Src\libbhuman\bhuman.cpp(701): error : type '<type error>' argument given to 'delete', expected pointer 3> ..\..\Src\libbhuman\bhuman.cpp: At global scope: 3>..\..\Src\libbhuman\bhuman.cpp(708): error : 'AL' has not been declared 3>..\..\Src\libbhuman\bhuman.cpp(708): error : 'AL' has not been declared 3>..\..\Src\libbhuman\bhuman.cpp(708): error : 'pBroker' was not declared in this scope 3>..\..\Src\libbhuman\bhuman.cpp(709): error : expected ',' or ';' before '{' token 3> make: *** [../../Build/libbhuman/Linux/Release/bhuman.o] Error 1 3>C:\Program Files\MSBuild\Microsoft.Cpp\v4.0\Microsoft.MakeFile.Targets(43,5): error MSB3073: 命令“bash -c "../../Util/zbuildgen/Win32/bin/zbuildgen.exe ../Linux/libbhuman.make.zbuild && make -f ../Linux/libbhuman.make clean CONFIG=Release SHELLOPTS=igncr && make -j 2 -f ../Linux/libbhuman.make CONFIG=Release SHELLOPTS=igncr"”已退出,代码为 2。 3> 3>生成失败。
相见恨晚的超实用网站
搞学习 知乎:www.zhihu.com 简答题:http://www.jiandati.com/ 网易公开课:https://open.163.com/ted/ 网易云课堂:https://study.163.com/ 中国大学MOOC:www.icourse163.org 网易云课堂:study.163.com 哔哩哔哩弹幕网:www.bilibili.com 我要自学网:www.51zxw
花了20分钟,给女朋友们写了一个web版群聊程序
参考博客 [1]https://www.byteslounge.com/tutorials/java-ee-html5-websocket-example
爬虫福利二 之 妹子图网MM批量下载
爬虫福利一:27报网MM批量下载    点击 看了本文,相信大家对爬虫一定会产生强烈的兴趣,激励自己去学习爬虫,在这里提前祝:大家学有所成! 目标网站:妹子图网 环境:Python3.x 相关第三方模块:requests、beautifulsoup4 Re:各位在测试时只需要将代码里的变量 path 指定为你当前系统要保存的路径,使用 python xxx.py 或IDE运行即可。
字节跳动视频编解码面经
引言 本文主要是记录一下面试字节跳动的经历。 三四月份投了字节跳动的实习(图形图像岗位),然后hr打电话过来问了一下会不会opengl,c++,shador,当时只会一点c++,其他两个都不会,也就直接被拒了。 七月初内推了字节跳动的提前批,因为内推没有具体的岗位,hr又打电话问要不要考虑一下图形图像岗,我说实习投过这个岗位不合适,不会opengl和shador,然后hr就说秋招更看重基础。我当时
开源一个功能完整的SpringBoot项目框架
福利来了,给大家带来一个福利。 最近想了解一下有关Spring Boot的开源项目,看了很多开源的框架,大多是一些demo或者是一个未成形的项目,基本功能都不完整,尤其是用户权限和菜单方面几乎没有完整的。 想到我之前做的框架,里面通用模块有:用户模块,权限模块,菜单模块,功能模块也齐全了,每一个功能都是完整的。 打算把这个框架分享出来,供大家使用和学习。 为什么用框架? 框架可以学习整体
Java学习的正确打开方式
在博主认为,对于入门级学习java的最佳学习方法莫过于视频+博客+书籍+总结,前三者博主将淋漓尽致地挥毫于这篇博客文章中,至于总结在于个人,实际上越到后面你会发现学习的最好方式就是阅读参考官方文档其次就是国内的书籍,博客次之,这又是一个层次了,这里暂时不提后面再谈。博主将为各位入门java保驾护航,各位只管冲鸭!!!上天是公平的,只要不辜负时间,时间自然不会辜负你。 何谓学习?博主所理解的学习,它
程序员必须掌握的核心算法有哪些?
由于我之前一直强调数据结构以及算法学习的重要性,所以就有一些读者经常问我,数据结构与算法应该要学习到哪个程度呢?,说实话,这个问题我不知道要怎么回答你,主要取决于你想学习到哪些程度,不过针对这个问题,我稍微总结一下我学过的算法知识点,以及我觉得值得学习的算法。这些算法与数据结构的学习大多数是零散的,并没有一本把他们全部覆盖的书籍。下面是我觉得值得学习的一些算法以及数据结构,当然,我也会整理一些看过
Python——画一棵漂亮的樱花树(不同种樱花+玫瑰+圣诞树喔)
最近翻到一篇知乎,上面有不少用Python(大多是turtle库)绘制的树图,感觉很漂亮,我整理了一下,挑了一些我觉得不错的代码分享给大家(这些我都测试过,确实可以生成喔~) one 樱花树 动态生成樱花 效果图(这个是动态的): 实现代码 import turtle as T import random import time # 画樱花的躯干(60,t) def Tree(branch
深深的码丨Java HashMap 透析
HashMap 相关概念 HashTab、HashMap、TreeMap 均以键值对像是存储或操作数据元素。HashTab继承自Dictionary,HashMap、TreeMap继承自AbstractMap,三者均实现Map接口 **HashTab:**同步哈希表,不支持null键或值,因为同步导致性能影响,很少被使用 **HashMap:**应用较多的非同步哈希表,支持null键或值,是键值对...
大学四年自学走来,这些私藏的实用工具/学习网站我贡献出来了
大学四年,看课本是不可能一直看课本的了,对于学习,特别是自学,善于搜索网上的一些资源来辅助,还是非常有必要的,下面我就把这几年私藏的各种资源,网站贡献出来给你们。主要有:电子书搜索、实用工具、在线视频学习网站、非视频学习网站、软件下载、面试/求职必备网站。 注意:文中提到的所有资源,文末我都给你整理好了,你们只管拿去,如果觉得不错,转发、分享就是最大的支持了。 一、电子书搜索 对于大部分程序员...
linux系列之常用运维命令整理笔录
本博客记录工作中需要的linux运维命令,大学时候开始接触linux,会一些基本操作,可是都没有整理起来,加上是做开发,不做运维,有些命令忘记了,所以现在整理成博客,当然vi,文件操作等就不介绍了,慢慢积累一些其它拓展的命令,博客不定时更新 顺便拉下票,我在参加csdn博客之星竞选,欢迎投票支持,每个QQ或者微信每天都可以投5票,扫二维码即可,http://m234140.nofollow.ax.
Python 基础(一):入门必备知识
目录1 标识符2 关键字3 引号4 编码5 输入输出6 缩进7 多行8 注释9 数据类型10 运算符10.1 常用运算符10.2 运算符优先级 1 标识符 标识符是编程时使用的名字,用于给变量、函数、语句块等命名,Python 中标识符由字母、数字、下划线组成,不能以数字开头,区分大小写。 以下划线开头的标识符有特殊含义,单下划线开头的标识符,如:_xxx ,表示不能直接访问的类属性,需通过类提供
程序员接私活怎样防止做完了不给钱?
首先跟大家说明一点,我们做 IT 类的外包开发,是非标品开发,所以很有可能在开发过程中会有这样那样的需求修改,而这种需求修改很容易造成扯皮,进而影响到费用支付,甚至出现做完了项目收不到钱的情况。 那么,怎么保证自己的薪酬安全呢? 我们在开工前,一定要做好一些证据方面的准备(也就是“讨薪”的理论依据),这其中最重要的就是需求文档和验收标准。一定要让需求方提供这两个文档资料作为开发的基础。之后开发
网页实现一个简单的音乐播放器(大佬别看。(⊙﹏⊙))
今天闲着无事,就想写点东西。然后听了下歌,就打算写个播放器。 于是乎用h5 audio的加上js简单的播放器完工了。 欢迎 改进 留言。 演示地点跳到演示地点 html代码如下`&lt;!DOCTYPE html&gt; &lt;html&gt; &lt;head&gt; &lt;title&gt;music&lt;/title&gt; &lt;meta charset="utf-8"&gt
Python十大装B语法
Python 是一种代表简单思想的语言,其语法相对简单,很容易上手。不过,如果就此小视 Python 语法的精妙和深邃,那就大错特错了。本文精心筛选了最能展现 Python 语法之精妙的十个知识点,并附上详细的实例代码。如能在实战中融会贯通、灵活使用,必将使代码更为精炼、高效,同时也会极大提升代码B格,使之看上去更老练,读起来更优雅。 1. for - else 什么?不是 if 和 else 才
数据库优化 - SQL优化
前面一篇文章从实例的角度进行数据库优化,通过配置一些参数让数据库性能达到最优。但是一些“不好”的SQL也会导致数据库查询变慢,影响业务流程。本文从SQL角度进行数据库优化,提升SQL运行效率。 判断问题SQL 判断SQL是否有问题时可以通过两个表象进行判断: 系统级别表象 CPU消耗严重 IO等待严重 页面响应时间过长
2019年11月中国大陆编程语言排行榜
2019年11月2日,我统计了某招聘网站,获得有效程序员招聘数据9万条。针对招聘信息,提取编程语言关键字,并统计如下: 编程语言比例 rank pl_ percentage 1 java 33.62% 2 c/c++ 16.42% 3 c_sharp 12.82% 4 javascript 12.31% 5 python 7.93% 6 go 7.25% 7
通俗易懂地给女朋友讲:线程池的内部原理
餐厅的约会 餐盘在灯光的照耀下格外晶莹洁白,女朋友拿起红酒杯轻轻地抿了一小口,对我说:“经常听你说线程池,到底线程池到底是个什么原理?”我楞了一下,心里想女朋友今天是怎么了,怎么突然问出这么专业的问题,但做为一个专业人士在女朋友面前也不能露怯啊,想了一下便说:“我先给你讲讲我前同事老王的故事吧!” 大龄程序员老王 老王是一个已经北漂十多年的程序员,岁数大了,加班加不动了,升迁也无望,于是拿着手里
经典算法(5)杨辉三角
杨辉三角 是经典算法,这篇博客对它的算法思想进行了讲解,并有完整的代码实现。
腾讯算法面试题:64匹马8个跑道需要多少轮才能选出最快的四匹?
昨天,有网友私信我,说去阿里面试,彻底的被打击到了。问了为什么网上大量使用ThreadLocal的源码都会加上private static?他被难住了,因为他从来都没有考虑过这个问题。无独有偶,今天笔者又发现有网友吐槽了一道腾讯的面试题,我们一起来看看。 腾讯算法面试题:64匹马8个跑道需要多少轮才能选出最快的四匹? 在互联网职场论坛,一名程序员发帖求助到。二面腾讯,其中一个算法题:64匹
面试官:你连RESTful都不知道我怎么敢要你?
面试官:了解RESTful吗? 我:听说过。 面试官:那什么是RESTful? 我:就是用起来很规范,挺好的 面试官:是RESTful挺好的,还是自我感觉挺好的 我:都挺好的。 面试官:… 把门关上。 我:… 要干嘛?先关上再说。 面试官:我说出去把门关上。 我:what ?,夺门而去 文章目录01 前言02 RESTful的来源03 RESTful6大原则1. C-S架构2. 无状态3.统一的接
JDK12 Collectors.teeing 你真的需要了解一下
前言 在 Java 12 里面有个非常好用但在官方 JEP 没有公布的功能,因为它只是 Collector 中的一个小改动,它的作用是 merge 两个 collector 的结果,这句话显得很抽象,老规矩,我们先来看个图(这真是一个不和谐的图????): 管道改造经常会用这个小东西,通常我们叫它「三通」,它的主要作用就是将 downstream1 和 downstre...
为啥国人偏爱Mybatis,而老外喜欢Hibernate/JPA呢?
关于SQL和ORM的争论,永远都不会终止,我也一直在思考这个问题。昨天又跟群里的小伙伴进行了一番讨论,感触还是有一些,于是就有了今天这篇文。 声明:本文不会下关于Mybatis和JPA两个持久层框架哪个更好这样的结论。只是摆事实,讲道理,所以,请各位看官勿喷。 一、事件起因 关于Mybatis和JPA孰优孰劣的问题,争论已经很多年了。一直也没有结论,毕竟每个人的喜好和习惯是大不相同的。我也看
项目中的if else太多了,该怎么重构?
介绍 最近跟着公司的大佬开发了一款IM系统,类似QQ和微信哈,就是聊天软件。我们有一部分业务逻辑是这样的 if (msgType = "文本") { // dosomething } else if(msgType = "图片") { // doshomething } else if(msgType = "视频") { // doshomething } else { // doshom...
致 Python 初学者
欢迎来到“Python进阶”专栏!来到这里的每一位同学,应该大致上学习了很多 Python 的基础知识,正在努力成长的过程中。在此期间,一定遇到了很多的困惑,对未来的学习方向感到迷茫。我非常理解你们所面临的处境。我从2007年开始接触 python 这门编程语言,从2009年开始单一使用 python 应对所有的开发工作,直至今天。回顾自己的学习过程,也曾经遇到过无数的困难,也曾经迷茫过、困惑过。开办这个专栏,正是为了帮助像我当年一样困惑的 Python 初学者走出困境、快速成长。希望我的经验能真正帮到你
“狗屁不通文章生成器”登顶GitHub热榜,分分钟写出万字形式主义大作
一、垃圾文字生成器介绍 最近在浏览GitHub的时候,发现了这样一个骨骼清奇的雷人项目,而且热度还特别高。 项目中文名:狗屁不通文章生成器 项目英文名:BullshitGenerator 根据作者的介绍,他是偶尔需要一些中文文字用于GUI开发时测试文本渲染,因此开发了这个废话生成器。但由于生成的废话实在是太过富于哲理,所以最近已经被小伙伴们给玩坏了。 他的文风可能是这样的: 你发现,...
程序员:我终于知道post和get的区别
是一个老生常谈的话题,然而随着不断的学习,对于以前的认识有很多误区,所以还是需要不断地总结的,学而时习之,不亦说乎
《程序人生》系列-这个程序员只用了20行代码就拿了冠军
你知道的越多,你不知道的越多 点赞再看,养成习惯GitHub上已经开源https://github.com/JavaFamily,有一线大厂面试点脑图,欢迎Star和完善 前言 这一期不算《吊打面试官》系列的,所有没前言我直接开始。 絮叨 本来应该是没有这期的,看过我上期的小伙伴应该是知道的嘛,双十一比较忙嘛,要值班又要去帮忙拍摄年会的视频素材,还得搞个程序员一天的Vlog,还要写BU...
加快推动区块链技术和产业创新发展,2019可信区块链峰会在京召开
11月8日,由中国信息通信研究院、中国通信标准化协会、中国互联网协会、可信区块链推进计划联合主办,科技行者协办的2019可信区块链峰会将在北京悠唐皇冠假日酒店开幕。   区块链技术被认为是继蒸汽机、电力、互联网之后,下一代颠覆性的核心技术。如果说蒸汽机释放了人类的生产力,电力解决了人类基本的生活需求,互联网彻底改变了信息传递的方式,区块链作为构造信任的技术有重要的价值。   1...
程序员把地府后台管理系统做出来了,还有3.0版本!12月7号最新消息:已在开发中有github地址
第一幕:缘起 听说阎王爷要做个生死簿后台管理系统,我们派去了一个程序员…… 996程序员做的梦: 第一场:团队招募 为了应对地府管理危机,阎王打算找“人”开发一套地府后台管理系统,于是就在地府总经办群中发了项目需求。 话说还是中国电信的信号好,地府都是满格,哈哈!!! 经常会有外行朋友问:看某网站做的不错,功能也简单,你帮忙做一下? 而这次,面对这样的需求,这个程序员...
相关热词 c# 图片上传 c# gdi 占用内存 c#中遍历字典 c#控制台模拟dos c# 斜率 最小二乘法 c#进程延迟 c# mysql完整项目 c# grid 总行数 c# web浏览器插件 c# xml 生成xsd
立即提问