apache-maven-3.2.5安装后运行报错

maven版本是最新的apache-maven-3.2.5,jdk版本32位jdk1.6u22.
报错信息如图
环境变量如图
由于提示没有找到org/apache/commons/cli/ParseException的定义
尝试解决方案:下载commons-cli-1.0.jar放到classpath中未能解决.
有没有谁碰到过,请高手指点或提供解决思路.

2个回答

maven 是绿色免安装的。下载 apache-maven-3.2.5-bin.zip 后你只需要将其解压缩即可运行(前提是你已安装 jdk),或者你将 %apache-maven-3.2.5-bin%/bin 加到环境变量 Path 里边,你即可随时运行它了。
请楼主核实以下问题:
1. 你下载的 maven 是 bin 版本的 zip 吗?
2. 如果你下载的是 apache-maven-3.2.5-bin.zip,检查你的下载完成了没?检查 %apache-maven-3.2.5-bin%/lib 目录下有没有 commons-cli-1.2.jar。
3. maven 解压缩后的完整路径中最好不要有空格、中文。

knfprex3a29
knfprex3a29 非常感谢,我检查lib库发现没有commons-cli-1.2.jar. 重新下了个,已经解决了. 应该是下载或者解压过程没完成.
大约 5 年之前 回复

非常感谢,我检查lib库发现没有commons-cli-1.2.jar.
重新下了个,已经解决了.
应该是下载或者解压过程没完成.

Csdn user default icon
上传中...
上传图片
插入图片
抄袭、复制答案,以达到刷声望分或其他目的的行为,在CSDN问答是严格禁止的,一经发现立刻封号。是时候展现真正的技术了!
其他相关推荐
maven配置私服打包报错Failed to execute goal org.apache.maven.plugins:maven-compiler-plugin:3.5:compile
直接使用阿里云镜像仓库打包没问题,替换为私服镜像仓库后报错: 就是pom.xml中的plugin报错 ``` <plugin> <groupId>org.apache.maven.plugins</groupId> <artifactId>maven-compiler-plugin</artifactId> <version>3.5</version> <configuration> <source>1.8</source> <target>1.8</target> <encoding>UTF-8</encoding> </configuration> </plugin> ``` 网上找了半天说这个指定的jdk版本的问题,查了一下版本没问题都是1.8 报错内容: [ERROR] Failed to execute goal org.apache.maven.plugins:maven-compiler-plugin:3.5:compile (default-compile) on project mytest-web: Execution default-compile of goal org.apache.maven.plugins:maven-compiler-plugin:3.5:compile failed: Plugin org.apache.maven.plugins:maven-compiler-plugin:3.5 or one of its dependencies could not be resolved: Failed to collect dependencies at org.apache.maven.plugins:maven-compiler-plugin:jar:3.5 -> org.apache.maven:maven-toolchain:jar:2.2.1 -> org.apache.maven:maven-core:jar:2.2.1 -> commons-cli:commons-cli:jar:1.2: Failed to read artifact descriptor for commons-cli:commons-cli:jar:1.2: Failure to find org.apache:apache:pom:4 in http://localhost:8081/nexus/content/groups/public/ was cached in the local repository, resolution will not be reattempted until the update interval of public has elapsed or updates are forced -> [Help 1] org.apache.maven.lifecycle.LifecycleExecutionException: Failed to execute goal org.apache.maven.plugins:maven-compiler-plugin:3.5:compile (default-compile) on project mytest-web: Execution default-compile of goal org.apache.maven.plugins:maven-compiler-plugin:3.5:compile failed: Plugin org.apache.maven.plugins:maven-compiler-plugin:3.5 or one of its dependencies could not be resolved: Failed to collect dependencies at org.apache.maven.plugins:maven-compiler-plugin:jar:3.5 -> org.apache.maven:maven-toolchain:jar:2.2.1 -> org.apache.maven:maven-core:jar:2.2.1 -> commons-cli:commons-cli:jar:1.2 at org.apache.maven.lifecycle.internal.MojoExecutor.execute(MojoExecutor.java:213) at org.apache.maven.lifecycle.internal.MojoExecutor.execute(MojoExecutor.java:154) at org.apache.maven.lifecycle.internal.MojoExecutor.execute(MojoExecutor.java:146) at org.apache.maven.lifecycle.internal.LifecycleModuleBuilder.buildProject(LifecycleModuleBuilder.java:117) at org.apache.maven.lifecycle.internal.LifecycleModuleBuilder.buildProject(LifecycleModuleBuilder.java:81) at org.apache.maven.lifecycle.internal.builder.singlethreaded.SingleThreadedBuilder.build(SingleThreadedBuilder.java:51) at org.apache.maven.lifecycle.internal.LifecycleStarter.execute(LifecycleStarter.java:128) at org.apache.maven.DefaultMaven.doExecute(DefaultMaven.java:309) at org.apache.maven.DefaultMaven.doExecute(DefaultMaven.java:194) at org.apache.maven.DefaultMaven.execute(DefaultMaven.java:107) at org.apache.maven.cli.MavenCli.execute(MavenCli.java:993) at org.apache.maven.cli.MavenCli.doMain(MavenCli.java:345) at org.apache.maven.cli.MavenCli.main(MavenCli.java:191) at sun.reflect.NativeMethodAccessorImpl.invoke0(Native Method) at sun.reflect.NativeMethodAccessorImpl.invoke(NativeMethodAccessorImpl.java:62) at sun.reflect.DelegatingMethodAccessorImpl.invoke(DelegatingMethodAccessorImpl.java:43) at java.lang.reflect.Method.invoke(Method.java:498) at org.codehaus.plexus.classworlds.launcher.Launcher.launchEnhanced(Launcher.java:289) at org.codehaus.plexus.classworlds.launcher.Launcher.launch(Launcher.java:229) at org.codehaus.plexus.classworlds.launcher.Launcher.mainWithExitCode(Launcher.java:415) at org.codehaus.plexus.classworlds.launcher.Launcher.main(Launcher.java:356) Caused by: org.apache.maven.plugin.PluginExecutionException: Execution default-compile of goal org.apache.maven.plugins:maven-compiler-plugin:3.5:compile failed: Plugin org.apache.maven.plugins:maven-compiler-plugin:3.5 or one of its dependencies could not be resolved: Failed to collect dependencies at org.apache.maven.plugins:maven-compiler-plugin:jar:3.5 -> org.apache.maven:maven-toolchain:jar:2.2.1 -> org.apache.maven:maven-core:jar:2.2.1 -> commons-cli:commons-cli:jar:1.2 at org.apache.maven.plugin.DefaultBuildPluginManager.executeMojo(DefaultBuildPluginManager.java:106) at org.apache.maven.lifecycle.internal.MojoExecutor.execute(MojoExecutor.java:208) ... 20 more Caused by: org.apache.maven.plugin.PluginResolutionException: Plugin org.apache.maven.plugins:maven-compiler-plugin:3.5 or one of its dependencies could not be resolved: Failed to collect dependencies at org.apache.maven.plugins:maven-compiler-plugin:jar:3.5 -> org.apache.maven:maven-toolchain:jar:2.2.1 -> org.apache.maven:maven-core:jar:2.2.1 -> commons-cli:commons-cli:jar:1.2 at org.apache.maven.plugin.internal.DefaultPluginDependenciesResolver.resolveInternal(DefaultPluginDependenciesResolver.java:214) at org.apache.maven.plugin.internal.DefaultPluginDependenciesResolver.resolve(DefaultPluginDependenciesResolver.java:149) at org.apache.maven.plugin.internal.DefaultMavenPluginManager.createPluginRealm(DefaultMavenPluginManager.java:402) at org.apache.maven.plugin.internal.DefaultMavenPluginManager.setupPluginRealm(DefaultMavenPluginManager.java:374) at org.apache.maven.plugin.DefaultBuildPluginManager.getPluginRealm(DefaultBuildPluginManager.java:231) at org.apache.maven.plugin.DefaultBuildPluginManager.executeMojo(DefaultBuildPluginManager.java:102) ... 21 more Caused by: org.eclipse.aether.collection.DependencyCollectionException: Failed to collect dependencies at org.apache.maven.plugins:maven-compiler-plugin:jar:3.5 -> org.apache.maven:maven-toolchain:jar:2.2.1 -> org.apache.maven:maven-core:jar:2.2.1 -> commons-cli:commons-cli:jar:1.2 at org.eclipse.aether.internal.impl.DefaultDependencyCollector.collectDependencies(DefaultDependencyCollector.java:300) at org.eclipse.aether.internal.impl.DefaultRepositorySystem.collectDependencies(DefaultRepositorySystem.java:325) at org.apache.maven.plugin.internal.DefaultPluginDependenciesResolver.resolveInternal(DefaultPluginDependenciesResolver.java:202) ... 26 more Caused by: org.eclipse.aether.resolution.ArtifactDescriptorException: Failed to read artifact descriptor for commons-cli:commons-cli:jar:1.2 at org.apache.maven.repository.internal.DefaultArtifactDescriptorReader.loadPom(DefaultArtifactDescriptorReader.java:330) at org.apache.maven.repository.internal.DefaultArtifactDescriptorReader.readArtifactDescriptor(DefaultArtifactDescriptorReader.java:199) at org.eclipse.aether.internal.impl.DefaultDependencyCollector.resolveCachedArtifactDescriptor(DefaultDependencyCollector.java:544) at org.eclipse.aether.internal.impl.DefaultDependencyCollector.getArtifactDescriptorResult(DefaultDependencyCollector.java:528) at org.eclipse.aether.internal.impl.DefaultDependencyCollector.processDependency(DefaultDependencyCollector.java:418) at org.eclipse.aether.internal.impl.DefaultDependencyCollector.processDependency(DefaultDependencyCollector.java:372) at org.eclipse.aether.internal.impl.DefaultDependencyCollector.process(DefaultDependencyCollector.java:360) at org.eclipse.aether.internal.impl.DefaultDependencyCollector.doRecurse(DefaultDependencyCollector.java:513) at org.eclipse.aether.internal.impl.DefaultDependencyCollector.processDependency(DefaultDependencyCollector.java:467) at org.eclipse.aether.internal.impl.DefaultDependencyCollector.processDependency(DefaultDependencyCollector.java:372) at org.eclipse.aether.internal.impl.DefaultDependencyCollector.process(DefaultDependencyCollector.java:360) at org.eclipse.aether.internal.impl.DefaultDependencyCollector.doRecurse(DefaultDependencyCollector.java:513) at org.eclipse.aether.internal.impl.DefaultDependencyCollector.processDependency(DefaultDependencyCollector.java:467) at org.eclipse.aether.internal.impl.DefaultDependencyCollector.processDependency(DefaultDependencyCollector.java:372) at org.eclipse.aether.internal.impl.DefaultDependencyCollector.process(DefaultDependencyCollector.java:360) at org.eclipse.aether.internal.impl.DefaultDependencyCollector.collectDependencies(DefaultDependencyCollector.java:263) ... 28 more Caused by: org.apache.maven.model.resolution.UnresolvableModelException: Failure to find org.apache:apache:pom:4 in http://localhost:8081/nexus/content/groups/public/ was cached in the local repository, resolution will not be reattempted until the update interval of public has elapsed or updates are forced at org.apache.maven.repository.internal.DefaultModelResolver.resolveModel(DefaultModelResolver.java:178) at org.apache.maven.repository.internal.DefaultModelResolver.resolveModel(DefaultModelResolver.java:224) at org.apache.maven.model.building.DefaultModelBuilder.readParentExternally(DefaultModelBuilder.java:1051) at org.apache.maven.model.building.DefaultModelBuilder.readParent(DefaultModelBuilder.java:829) at org.apache.maven.model.building.DefaultModelBuilder.build(DefaultModelBuilder.java:331) at org.apache.maven.repository.internal.DefaultArtifactDescriptorReader.loadPom(DefaultArtifactDescriptorReader.java:321) ... 43 more Caused by: org.eclipse.aether.resolution.ArtifactResolutionException: Failure to find org.apache:apache:pom:4 in http://localhost:8081/nexus/content/groups/public/ was cached in the local repository, resolution will not be reattempted until the update interval of public has elapsed or updates are forced at org.eclipse.aether.internal.impl.DefaultArtifactResolver.resolve(DefaultArtifactResolver.java:453) at org.eclipse.aether.internal.impl.DefaultArtifactResolver.resolveArtifacts(DefaultArtifactResolver.java:255) at org.eclipse.aether.internal.impl.DefaultArtifactResolver.resolveArtifact(DefaultArtifactResolver.java:232) at org.apache.maven.repository.internal.DefaultModelResolver.resolveModel(DefaultModelResolver.java:174) ... 48 more Caused by: org.eclipse.aether.transfer.ArtifactNotFoundException: Failure to find org.apache:apache:pom:4 in http://localhost:8081/nexus/content/groups/public/ was cached in the local repository, resolution will not be reattempted until the update interval of public has elapsed or updates are forced at org.eclipse.aether.internal.impl.DefaultUpdateCheckManager.newException(DefaultUpdateCheckManager.java:240) at org.eclipse.aether.internal.impl.DefaultUpdateCheckManager.checkArtifact(DefaultUpdateCheckManager.java:215) at org.eclipse.aether.internal.impl.DefaultArtifactResolver.gatherDownloads(DefaultArtifactResolver.java:594) at org.eclipse.aether.internal.impl.DefaultArtifactResolver.performDownloads(DefaultArtifactResolver.java:512) at org.eclipse.aether.internal.impl.DefaultArtifactResolver.resolve(DefaultArtifactResolver.java:430) ... 51 more [ERROR] [ERROR] Re-run Maven using the -X switch to enable full debug logging. [ERROR] [ERROR] For more information about the errors and possible solutions, please read the following articles: [ERROR] [Help 1] http://cwiki.apache.org/confluence/display/MAVEN/PluginResolutionException
maven3.3.9编译hadoop2.6.5报错 帮忙解决问题
[INFO] Building Apache Hadoop Main 2.6.5 [INFO] ------------------------------------------------------------------------ Downloading: http://mirrors.ibiblio.org/pub/mirrors/maven2/org/apache/maven/plugins/maven-javadoc-plugin/maven-metadata.xml [WARNING] Checksum validation failed, expected <html> but is b113767b47336dcc165c5dd2222b5df4cb86b7ce for http://mirrors.ibiblio.org/pub/mirrors/maven2/org/apache/maven/plugins/maven-javadoc-plugin/maven-metadata.xml [WARNING] Could not validate integrity of download from http://mirrors.ibiblio.org/pub/mirrors/maven2/org/apache/maven/plugins/maven-javadoc-plugin/maven-metadata.xml: Checksum validation failed, expected <html> but is b113767b47336dcc165c5dd2222b5df4cb86b7ce [WARNING] Checksum validation failed, expected <html> but is b113767b47336dcc165c5dd2222b5df4cb86b7ce for http://mirrors.ibiblio.org/pub/mirrors/maven2/org/apache/maven/plugins/maven-javadoc-plugin/maven-metadata.xml Downloaded: http://mirrors.ibiblio.org/pub/mirrors/maven2/org/apache/maven/plugins/maven-javadoc-plugin/maven-metadata.xml (99 KB at 11.8 KB/sec) [WARNING] The metadata /root/.m2/repository/org/apache/maven/plugins/maven-javadoc-plugin/maven-metadata-ibiblio.org.xml is invalid: end tag name </body> must match start tag name <hr> from line 888 (position: START_TAG seen ... 08-Nov-2014 19:04 207\r\n</pre><hr></body>... @888:18) [INFO] ------------------------------------------------------------------------ [INFO] Reactor Summary: [INFO] [INFO] Apache Hadoop Main ................................. FAILURE [ 8.416 s] [INFO] Apache Hadoop Build Tools .......................... SKIPPED [INFO] Apache Hadoop Project POM .......................... SKIPPED [INFO] Apache Hadoop Annotations .......................... SKIPPED [INFO] Apache Hadoop Assemblies ........................... SKIPPED [INFO] Apache Hadoop Project Dist POM ..................... SKIPPED [INFO] Apache Hadoop Maven Plugins ........................ SKIPPED [INFO] Apache Hadoop MiniKDC .............................. SKIPPED [INFO] Apache Hadoop Auth ................................. SKIPPED [INFO] Apache Hadoop Auth Examples ........................ SKIPPED [INFO] Apache Hadoop Common ............................... SKIPPED [INFO] Apache Hadoop NFS .................................. SKIPPED [INFO] Apache Hadoop KMS .................................. SKIPPED [INFO] Apache Hadoop Common Project ....................... SKIPPED [INFO] Apache Hadoop HDFS ................................. SKIPPED [INFO] Apache Hadoop HttpFS ............................... SKIPPED [INFO] Apache Hadoop HDFS BookKeeper Journal .............. SKIPPED [INFO] Apache Hadoop HDFS-NFS ............................. SKIPPED [INFO] Apache Hadoop HDFS Project ......................... SKIPPED [INFO] hadoop-yarn ........................................ SKIPPED [INFO] hadoop-yarn-api .................................... SKIPPED [INFO] hadoop-yarn-common ................................. SKIPPED [INFO] hadoop-yarn-server ................................. SKIPPED [INFO] hadoop-yarn-server-common .......................... SKIPPED [INFO] hadoop-yarn-server-nodemanager ..................... SKIPPED [INFO] hadoop-yarn-server-web-proxy ....................... SKIPPED [INFO] hadoop-yarn-server-applicationhistoryservice ....... SKIPPED [INFO] hadoop-yarn-server-resourcemanager ................. SKIPPED [INFO] hadoop-yarn-server-tests ........................... SKIPPED [INFO] hadoop-yarn-client ................................. SKIPPED [INFO] hadoop-yarn-applications ........................... SKIPPED [INFO] hadoop-yarn-applications-distributedshell .......... SKIPPED [INFO] hadoop-yarn-applications-unmanaged-am-launcher ..... SKIPPED [INFO] hadoop-yarn-site ................................... SKIPPED [INFO] hadoop-yarn-registry ............................... SKIPPED [INFO] hadoop-yarn-project ................................ SKIPPED [INFO] hadoop-mapreduce-client ............................ SKIPPED [INFO] hadoop-mapreduce-client-core ....................... SKIPPED [INFO] hadoop-mapreduce-client-common ..................... SKIPPED [INFO] hadoop-mapreduce-client-shuffle .................... SKIPPED [INFO] hadoop-mapreduce-client-app ........................ SKIPPED [INFO] hadoop-mapreduce-client-hs ......................... SKIPPED [INFO] hadoop-mapreduce-client-jobclient .................. SKIPPED [INFO] hadoop-mapreduce-client-hs-plugins ................. SKIPPED [INFO] Apache Hadoop MapReduce Examples ................... SKIPPED [INFO] hadoop-mapreduce ................................... SKIPPED [INFO] Apache Hadoop MapReduce Streaming .................. SKIPPED [INFO] Apache Hadoop Distributed Copy ..................... SKIPPED [INFO] Apache Hadoop Archives ............................. SKIPPED [INFO] Apache Hadoop Rumen ................................ SKIPPED [INFO] Apache Hadoop Gridmix .............................. SKIPPED [INFO] Apache Hadoop Data Join ............................ SKIPPED [INFO] Apache Hadoop Ant Tasks ............................ SKIPPED [INFO] Apache Hadoop Extras ............................... SKIPPED [INFO] Apache Hadoop Pipes ................................ SKIPPED [INFO] Apache Hadoop OpenStack support .................... SKIPPED [INFO] Apache Hadoop Amazon Web Services support .......... SKIPPED [INFO] Apache Hadoop Client ............................... SKIPPED [INFO] Apache Hadoop Mini-Cluster ......................... SKIPPED [INFO] Apache Hadoop Scheduler Load Simulator ............. SKIPPED [INFO] Apache Hadoop Tools Dist ........................... SKIPPED [INFO] Apache Hadoop Tools ................................ SKIPPED [INFO] Apache Hadoop Distribution ......................... SKIPPED [INFO] ------------------------------------------------------------------------ [INFO] BUILD FAILURE [INFO] ------------------------------------------------------------------------ [INFO] Total time: 06:03 min [INFO] Finished at: 2018-06-23T11:25:17+08:00 [INFO] Final Memory: 27M/69M [INFO] ------------------------------------------------------------------------ [ERROR] Error resolving version for plugin 'org.apache.maven.plugins:maven-javadoc-plugin' from the repositories [local (/root/.m2/repository), ibiblio.org (http://mirrors.ibiblio.org/pub/mirrors/maven2)]: Plugin not found in any plugin repository -> [Help 1] [ERROR] [ERROR] To see the full stack trace of the errors, re-run Maven with the -e switch. [ERROR] Re-run Maven using the -X switch to enable full debug logging. [ERROR] [ERROR] For more information about the errors and possible solutions, please read the following articles: [ERROR] [Help 1] http://cwiki.apache.org/confluence/display/MAVEN/PluginVersionResolutionException You have new mail in /var/spool/mail/root
Maven多渠道打包报错,求解!
## 这是异常: D:\makeApk\MavenBuild>D:\makeApk\MavenBuild\build.bat [INFO] Scanning for projects... [INFO] [INFO] ------------------------------------------------------------------------ [INFO] Building mavenbuild-test 1.0.0 [INFO] ------------------------------------------------------------------------ Exception in thread "pool-1-thread-1" java.lang.NoClassDefFoundError: org/eclips e/aether/spi/connector/Transfer$State at org.eclipse.aether.connector.wagon.WagonRepositoryConnector$GetTask.r un(WagonRepositoryConnector.java:608) at org.eclipse.aether.util.concurrency.RunnableErrorForwarder$1.run(Runn ableErrorForwarder.java:67) at java.util.concurrent.ThreadPoolExecutor.runWorker(ThreadPoolExecutor. java:1145) at java.util.concurrent.ThreadPoolExecutor$Worker.run(ThreadPoolExecutor .java:615) at java.lang.Thread.run(Thread.java:724) [INFO] ------------------------------------------------------------------------C aused by: java.lang.ClassNotFoundException: org.eclipse.aether.spi.connector.Tra nsfer$State at org.codehaus.plexus.classworlds.strategy.SelfFirstStrategy.loadClass( SelfFirstStrategy.java:50)[INFO] BUILD FAILURE at org.codehaus.plexus.classworlds.realm.ClassRealm.unsynchronizedLoadCl ass(ClassRealm.java:271)[INFO] ------------------------------------------------- ----------------------- at org.codehaus.plexus.classworlds.realm.ClassRealm.loadClass(ClassRealm .java:247) at org.codehaus.plexus.classworlds.realm.ClassRealm.loadClass(ClassRealm .java:239) ... 5 more [INFO] Total time: 2.117 s [INFO] Finished at: 2015-07-23T11:06:57+08:00 [INFO] Final Memory: 14M/213M [INFO] ------------------------------------------------------------------------ --------------------------------------------------- constituent[0]: file:/D:/Soft/apache-maven-3.3.3/lib/aether-api-1.0.2.v20150114. jar constituent[1]: file:/D:/Soft/apache-maven-3.3.3/lib/aether-connector-basic-1.0. 2.v20150114.jar constituent[2]: file:/D:/Soft/apache-maven-3.3.3/lib/aether-impl-1.0.2.v20150114 .jar constituent[3]: file:/D:/Soft/apache-maven-3.3.3/lib/aether-spi-1.0.2.v20150114. jar constituent[4]: file:/D:/Soft/apache-maven-3.3.3/lib/aether-transport-wagon-1.0. 2.v20150114.jar constituent[5]: file:/D:/Soft/apache-maven-3.3.3/lib/aether-util-1.0.2.v20150114 .jar constituent[6]: file:/D:/Soft/apache-maven-3.3.3/lib/aopalliance-1.0.jar constituent[7]: file:/D:/Soft/apache-maven-3.3.3/lib/cdi-api-1.0.jar constituent[8]: file:/D:/Soft/apache-maven-3.3.3/lib/commons-cli-1.2.jar constituent[9]: file:/D:/Soft/apache-maven-3.3.3/lib/commons-io-2.2.jar constituent[10]: file:/D:/Soft/apache-maven-3.3.3/lib/commons-lang-2.6.jar constituent[11]: file:/D:/Soft/apache-maven-3.3.3/lib/guava-18.0.jar constituent[12]: file:/D:/Soft/apache-maven-3.3.3/lib/javax.inject-1.jar constituent[13]: file:/D:/Soft/apache-maven-3.3.3/lib/jsoup-1.7.2.jar constituent[14]: file:/D:/Soft/apache-maven-3.3.3/lib/jsr250-api-1.0.jar constituent[15]: file:/D:/Soft/apache-maven-3.3.3/lib/maven-aether-provider-3.3. 3.jar constituent[16]: file:/D:/Soft/apache-maven-3.3.3/lib/maven-artifact-3.3.3.jar constituent[17]: file:/D:/Soft/apache-maven-3.3.3/lib/maven-builder-support-3.3. 3.jar constituent[18]: file:/D:/Soft/apache-maven-3.3.3/lib/maven-compat-3.3.3.jar constituent[19]: file:/D:/Soft/apache-maven-3.3.3/lib/maven-core-3.3.3.jar constituent[20]: file:/D:/Soft/apache-maven-3.3.3/lib/maven-embedder-3.3.3.jar constituent[21]: file:/D:/Soft/apache-maven-3.3.3/lib/maven-model-3.3.3.jar constituent[22]: file:/D:/Soft/apache-maven-3.3.3/lib/maven-model-builder-3.3.3. jar constituent[23]: file:/D:/Soft/apache-maven-3.3.3/lib/maven-plugin-api-3.3.3.jar constituent[24]: file:/D:/Soft/apache-maven-3.3.3/lib/maven-repository-metadata- 3.3.3.jar constituent[25]: file:/D:/Soft/apache-maven-3.3.3/lib/maven-settings-3.3.3.jar constituent[26]: file:/D:/Soft/apache-maven-3.3.3/lib/maven-settings-builder-3.3 .3.jar constituent[27]: file:/D:/Soft/apache-maven-3.3.3/lib/org.eclipse.sisu.inject-0. 3.0.jar constituent[28]: file:/D:/Soft/apache-maven-3.3.3/lib/org.eclipse.sisu.plexus-0. 3.0.jar constituent[29]: file:/D:/Soft/apache-maven-3.3.3/lib/plexus-cipher-1.7.jar constituent[30]: file:/D:/Soft/apache-maven-3.3.3/lib/plexus-component-annotatio ns-1.5.5.jar constituent[31]: file:/D:/Soft/apache-maven-3.3.3/lib/plexus-interpolation-1.21. jar constituent[32]: file:/D:/Soft/apache-maven-3.3.3/lib/plexus-sec-dispatcher-1.3. jar constituent[33]: file:/D:/Soft/apache-maven-3.3.3/lib/plexus-utils-3.0.20.jar constituent[34]: file:/D:/Soft/apache-maven-3.3.3/lib/sisu-guice-3.2.5-no_aop.ja r constituent[35]: file:/D:/Soft/apache-maven-3.3.3/lib/slf4j-api-1.7.5.jar constituent[36]: file:/D:/Soft/apache-maven-3.3.3/lib/slf4j-simple-1.7.5.jar constituent[37]: file:/D:/Soft/apache-maven-3.3.3/lib/wagon-file-2.9.jar constituent[38]: file:/D:/Soft/apache-maven-3.3.3/lib/wagon-http-2.9-shaded.jar constituent[39]: file:/D:/Soft/apache-maven-3.3.3/lib/wagon-http-shared-2.9.jar constituent[40]: file:/D:/Soft/apache-maven-3.3.3/lib/wagon-provider-api-2.9.jar constituent[41]: file:/D:/Soft/apache-maven-3.3.3/conf/logging/ --------------------------------------------------- Exception in thread "main" java.lang.NoClassDefFoundError: org/eclipse/aether/sp i/connector/Transfer$State at org.eclipse.aether.connector.wagon.WagonRepositoryConnector$GetTask.r un(WagonRepositoryConnector.java:608) at org.eclipse.aether.util.concurrency.RunnableErrorForwarder$1.run(Runn ableErrorForwarder.java:67) at java.util.concurrent.ThreadPoolExecutor.runWorker(ThreadPoolExecutor. java:1145) at java.util.concurrent.ThreadPoolExecutor$Worker.run(ThreadPoolExecutor .java:615) at java.lang.Thread.run(Thread.java:724) Caused by: java.lang.ClassNotFoundException: org.eclipse.aether.spi.connector.Tr ansfer$State at org.codehaus.plexus.classworlds.strategy.SelfFirstStrategy.loadClass( SelfFirstStrategy.java:50) at org.codehaus.plexus.classworlds.realm.ClassRealm.unsynchronizedLoadCl ass(ClassRealm.java:271) at org.codehaus.plexus.classworlds.realm.ClassRealm.loadClass(ClassRealm .java:247) at org.codehaus.plexus.classworlds.realm.ClassRealm.loadClass(ClassRealm .java:239) ... 5 more 系统找不到指定的路径。 子目录或文件 assets 已经存在。 'assets/common.properties'... 正在添加: META-INF/MANIFEST.MF 正在添加: META-INF/DREAMZON.SF 正在添加: META-INF/DREAMZON.RSA 正在签名: assets/common.properties 子目录或文件 assets 已经存在。 'assets/common.properties'... 正在添加: META-INF/MANIFEST.MF 正在添加: META-INF/DREAMZON.SF 正在添加: META-INF/DREAMZON.RSA 正在签名: assets/common.properties 子目录或文件 assets 已经存在。 'assets/common.properties'... 正在添加: META-INF/MANIFEST.MF 正在添加: META-INF/DREAMZON.SF 正在添加: META-INF/DREAMZON.RSA 正在签名: assets/common.properties D:\makeApk> ## 这是pom.xml: <?xml version="1.0" encoding="utf-8"?> <project xmlns="http://maven.apache.org/POM/4.0.0" xmlns:xsi="http://www.w3.org/2001/XMLSchema-instance" xsi:schemaLocation="http://maven.apache.org/POM/4.0.0 http://maven.apache.org/maven-v4_0_0.xsd"> <modelVersion>4.0.0</modelVersion> <groupId>com.example.mavenbuild</groupId> <artifactId>mavenbuild-test</artifactId> <version>1.0.0</version> <packaging>apk</packaging> <properties> <project.build.sourceEncoding>UTF-8</project.build.sourceEncoding> </properties> <dependencies> <dependency> <groupId>com.google.android</groupId> <artifactId>android</artifactId> <version>4.1.1.4</version> <scope>provided</scope> </dependency> </dependencies> <build> <sourceDirectory>src</sourceDirectory> <finalName>${project.artifactId}</finalName> <pluginManagement> <plugins> <plugin> <groupId>com.jayway.maven.plugins.android.generation2</groupId> <artifactId>android-maven-plugin</artifactId> <version>3.8.2</version> <extensions>true</extensions> </plugin> </plugins> </pluginManagement> <plugins> <plugin> <groupId>com.jayway.maven.plugins.android.generation2</groupId> <artifactId>android-maven-plugin</artifactId> <configuration> <sdk> <!-- platform as api level (api level 16 = platform 4.1)--> <platform>16</platform> </sdk> <sign> <debug>false</debug> </sign> </configuration> </plugin> </plugins> </build> </project>
用maven进行install的时候报错Error injecting: org.apache.maven.plugin.install.InstallMojo
[code="java"] ------------------------------------------------------- T E S T S ------------------------------------------------------- There are no tests to run. Results : Tests run: 0, Failures: 0, Errors: 0, Skipped: 0 [INFO] [INFO] --- maven-war-plugin:2.1.1:war (default-war) @ llemaicai --- [INFO] Packaging webapp [INFO] Assembling webapp [llemaicai] in [E:\dev\maicai\pro\llemaicai\target\llemaicai] [INFO] Processing war project [INFO] Copying webapp resources [E:\dev\maicai\pro\llemaicai\src\main\webapp] [INFO] Webapp assembled in [35 msecs] [INFO] Building war: E:\dev\maicai\pro\llemaicai\target\llemaicai.war [WARNING] Warning: selected war files include a WEB-INF/web.xml which will be ignored (webxml attribute is missing from war task, or ignoreWebxml attribute is specified as 'true') [INFO] [INFO] --- maven-install-plugin:2.3.1:install (default-install) @ llemaicai --- [WARNING] The POM for org.codehaus.plexus:plexus-digest:jar:1.0 is invalid, transitive dependencies (if any) will not be available, enable debug logging for more details 2013-2-20 14:41:14 org.sonatype.guice.bean.reflect.LoadedClass 警告: Error injecting: org.apache.maven.plugin.install.InstallMojo java.lang.NoClassDefFoundError: org/codehaus/plexus/digest/DigesterException at java.lang.Class.getDeclaredConstructors0(Native Method) at java.lang.Class.privateGetDeclaredConstructors(Class.java:2389) at java.lang.Class.getDeclaredConstructors(Class.java:1836) at com.google.inject.spi.InjectionPoint.forConstructorOf(InjectionPoint.java:243) at com.google.inject.internal.ConstructorBindingImpl.create(ConstructorBindingImpl.java:96) at com.google.inject.internal.InjectorImpl.createUninitializedBinding(InjectorImpl.java:628) at com.google.inject.internal.InjectorImpl.createJustInTimeBinding(InjectorImpl.java:835) at com.google.inject.internal.InjectorImpl.createJustInTimeBindingRecursive(InjectorImpl.java:769) at com.google.inject.internal.InjectorImpl.getJustInTimeBinding(InjectorImpl.java:254) at com.google.inject.internal.InjectorImpl.getBindingOrThrow(InjectorImpl.java:205) at com.google.inject.internal.InjectorImpl.getInternalFactory(InjectorImpl.java:843) at com.google.inject.internal.InjectorImpl.getProviderOrThrow(InjectorImpl.java:957) at com.google.inject.internal.InjectorImpl.getProvider(InjectorImpl.java:990) at com.google.inject.internal.InjectorImpl.getProvider(InjectorImpl.java:951) at com.google.inject.internal.InjectorImpl.getInstance(InjectorImpl.java:1003) at org.sonatype.guice.bean.reflect.AbstractDeferredClass.get(AbstractDeferredClass.java:47) at com.google.inject.internal.InternalFactoryToProviderAdapter.get(InternalFactoryToProviderAdapter.java:40) at com.google.inject.internal.InjectorImpl$4$1.call(InjectorImpl.java:968) at com.google.inject.internal.InjectorImpl.callInContext(InjectorImpl.java:1014) at com.google.inject.internal.InjectorImpl$4.get(InjectorImpl.java:964) at com.google.inject.Scopes$1$1.get(Scopes.java:59) at org.sonatype.guice.bean.locators.LazyBeanEntry.getValue(LazyBeanEntry.java:79) at org.sonatype.guice.plexus.locators.LazyPlexusBean.getValue(LazyPlexusBean.java:53) at org.codehaus.plexus.DefaultPlexusContainer.lookup(DefaultPlexusContainer.java:243) at org.codehaus.plexus.DefaultPlexusContainer.lookup(DefaultPlexusContainer.java:235) at org.apache.maven.plugin.internal.DefaultMavenPluginManager.getConfiguredMojo(DefaultMavenPluginManager.java:455) at org.apache.maven.plugin.DefaultBuildPluginManager.executeMojo(DefaultBuildPluginManager.java:92) at org.apache.maven.lifecycle.internal.MojoExecutor.execute(MojoExecutor.java:209) at org.apache.maven.lifecycle.internal.MojoExecutor.execute(MojoExecutor.java:153) at org.apache.maven.lifecycle.internal.MojoExecutor.execute(MojoExecutor.java:145) at org.apache.maven.lifecycle.internal.LifecycleModuleBuilder.buildProject(LifecycleModuleBuilder.java:84) at org.apache.maven.lifecycle.internal.LifecycleModuleBuilder.buildProject(LifecycleModuleBuilder.java:59) at org.apache.maven.lifecycle.internal.LifecycleStarter.singleThreadedBuild(LifecycleStarter.java:183) at org.apache.maven.lifecycle.internal.LifecycleStarter.execute(LifecycleStarter.java:161) at org.apache.maven.DefaultMaven.doExecute(DefaultMaven.java:319) at org.apache.maven.DefaultMaven.execute(DefaultMaven.java:156) at org.apache.maven.cli.MavenCli.execute(MavenCli.java:537) at org.apache.maven.cli.MavenCli.doMain(MavenCli.java:196) at org.apache.maven.cli.MavenCli.main(MavenCli.java:141) at sun.reflect.NativeMethodAccessorImpl.invoke0(Native Method) at sun.reflect.NativeMethodAccessorImpl.invoke(NativeMethodAccessorImpl.java:39) at sun.reflect.DelegatingMethodAccessorImpl.invoke(DelegatingMethodAccessorImpl.java:25) at java.lang.reflect.Method.invoke(Method.java:597) at org.codehaus.plexus.classworlds.launcher.Launcher.launchEnhanced(Launcher.java:290) at org.codehaus.plexus.classworlds.launcher.Launcher.launch(Launcher.java:230) at org.codehaus.plexus.classworlds.launcher.Launcher.mainWithExitCode(Launcher.java:409) at org.codehaus.plexus.classworlds.launcher.Launcher.main(Launcher.java:352) Caused by: java.lang.ClassNotFoundException: org.codehaus.plexus.digest.DigesterException at org.codehaus.plexus.classworlds.strategy.SelfFirstStrategy.loadClass(SelfFirstStrategy.java:50) at org.codehaus.plexus.classworlds.realm.ClassRealm.loadClass(ClassRealm.java:244) at org.codehaus.plexus.classworlds.realm.ClassRealm.loadClass(ClassRealm.java:230) ... 47 more [INFO] ------------------------------------------------------------------------ [INFO] BUILD FAILURE [INFO] ------------------------------------------------------------------------ [INFO] Total time: 1.669s [INFO] Finished at: Wed Feb 20 14:41:14 CST 2013 [INFO] Final Memory: 4M/15M [INFO] ------------------------------------------------------------------------ [ERROR] Failed to execute goal org.apache.maven.plugins:maven-install-plugin:2.3.1:install (default-install) on project llemaicai: Execution default-install of goal org.apache.maven.plugins:maven-install-plugin:2.3.1:install failed: Unable to load the mojo 'install' in the plugin 'org.apache.maven.plugins:maven-install-plugin:2.3.1'. A required class is missing: org/codehaus/plexus/digest/DigesterException [ERROR] ----------------------------------------------------- [ERROR] realm = plugin>org.apache.maven.plugins:maven-install-plugin:2.3.1 [ERROR] strategy = org.codehaus.plexus.classworlds.strategy.SelfFirstStrategy [ERROR] urls[0] = file:/D:/javalib/repository/org/apache/maven/plugins/maven-install-plugin/2.3.1/maven-install-plugin-2.3.1.jar [ERROR] urls[1] = file:/D:/javalib/repository/junit/junit/3.8.1/junit-3.8.1.jar [ERROR] urls[2] = file:/D:/javalib/repository/org/codehaus/plexus/plexus-utils/2.0.5/plexus-utils-2.0.5.jar [ERROR] urls[3] = file:/D:/javalib/repository/org/codehaus/plexus/plexus-digest/1.0/plexus-digest-1.0.jar [ERROR] Number of foreign imports: 1 [ERROR] import: Entry[import from realm ClassRealm[maven.api, parent: null]] [ERROR] [ERROR] -----------------------------------------------------: org.codehaus.plexus.digest.DigesterException [ERROR] -> [Help 1] [ERROR] [ERROR] To see the full stack trace of the errors, re-run Maven with the -e switch. [ERROR] Re-run Maven using the -X switch to enable full debug logging. [ERROR] [ERROR] For more information about the errors and possible solutions, please read the following articles: [ERROR] [Help 1] http://cwiki.apache.org/confluence/display/MAVEN/PluginContainerException [/code]
maven3.5.0创建项目报错,求解决!!!
mvn archetype:generate -DgroupId=com.mycompany.app -DartifactId=my-app -DarchetypeArtifactId=maven-archetype-quickstart -DinteractiveMode=false 报错: [ERROR] Failed to execute goal org.apache.maven.plugins:maven-archetype-plugin:3 .0.1:generate (default-cli) on project standalone-pom: Execution default-cli of goal org.apache.maven.plugins:maven-archetype-plugin:3.0.1:generate failed: Plug in org.apache.maven.plugins:maven-archetype-plugin:3.0.1 or one of its dependenc ies could not be resolved: Could not transfer artifact org.codehaus.plexus:plexu s-component-annotations:jar:1.6 from/to central (https://repo.maven.apache.org/m aven2): Connect to repo.maven.apache.org:443 [repo.maven.apache.org/151.101.24.2 15] failed: Connection timed out: connect -> [Help 1] 求解答!!!
NetBeans清理构建报错,请大佬帮帮忙谢谢.
Cannot run program "cmd" (in directory "D:\Job\jobgit\aidamall"): Malformed argument has embedded quote: "D:\DevelopmentTool\maven\apache-maven-3.6.2\apache-maven-3.6.2\bin\mvn.cmd" -Dmaven.ext.class.path=D:\DevelopmentTool\NetBeans\NetBeans11.1\NetBeans11.1\netbeans-11.1-bin\netbeans\java\maven-nblib\netbeans-eventspy.jar -Dfile.encoding=UTF-8 clean install
求助sprinboot整合 elasticsearch-rest-high-level-client-5.6.4报错
以下是报错信息: Description: An attempt was made to call a method that does not exist. The attempt was made from the following location: org.springframework.boot.autoconfigure.elasticsearch.rest.RestClientConfigurations$RestHighLevelClientConfiguration.elasticsearchRestHighLevelClient(RestClientConfigurations.java:75) The following method did not exist: org.elasticsearch.client.RestHighLevelClient.<init>(Lorg/elasticsearch/client/RestClientBuilder;)V The method's class, org.elasticsearch.client.RestHighLevelClient, is available from the following locations: jar:file:/Users/jianxiaowen/.m2/repository/org/elasticsearch/client/elasticsearch-rest-high-level-client/5.6.4/elasticsearch-rest-high-level-client-5.6.4.jar!/org/elasticsearch/client/RestHighLevelClient.class It was loaded from the following location: file:/Users/jianxiaowen/.m2/repository/org/elasticsearch/client/elasticsearch-rest-high-level-client/5.6.4/elasticsearch-rest-high-level-client-5.6.4.jar Action: Correct the classpath of your application so that it contains a single, compatible version of org.elasticsearch.client.RestHighLevelClient 以下是pom文件,是springboot版本和这个es不兼容吗,原来用的es6.x是可以的,换成5.x就不行了,但是公司环境就要求5.x: ``` <?xml version="1.0" encoding="UTF-8"?> <project xmlns="http://maven.apache.org/POM/4.0.0" xmlns:xsi="http://www.w3.org/2001/XMLSchema-instance" xsi:schemaLocation="http://maven.apache.org/POM/4.0.0 http://maven.apache.org/xsd/maven-4.0.0.xsd"> <modelVersion>4.0.0</modelVersion> <groupId>com.xxx</groupId> <artifactId>repservice</artifactId> <version>1.0</version> <modules> <module>kg-business</module> </modules> <packaging>pom</packaging> <name>repservice</name> <parent> <groupId>org.springframework.boot</groupId> <artifactId>spring-boot-starter-parent</artifactId> <version>2.1.7.RELEASE</version> <relativePath/> <!-- lookup parent from repository --> </parent> <properties> <elasticsearch.version>5.6.4</elasticsearch.version> <project.build.sourceEncoding>UTF-8</project.build.sourceEncoding> <project.reporting.outputEncoding>UTF-8</project.reporting.outputEncoding> <java.version>1.8</java.version> </properties> <dependencies> <dependency> <groupId>org.springframework.boot</groupId> <artifactId>spring-boot-starter-web</artifactId> <exclusions> <exclusion> <groupId>org.springframework.boot</groupId> <artifactId>spring-boot-starter-logging</artifactId> </exclusion> </exclusions> </dependency> <dependency> <groupId>org.springframework.boot</groupId> <artifactId>spring-boot-starter-log4j2</artifactId> </dependency> <dependency> <groupId>org.springframework.boot</groupId> <artifactId>spring-boot-configuration-processor</artifactId> <optional>true</optional> </dependency> <dependency> <groupId>com.x x x.datanlp</groupId> <artifactId>graph-db-sdk</artifactId> <version>1.1-SNAPSHOT</version> </dependency> <dependency> <groupId>mysql</groupId> <artifactId>mysql-connector-java</artifactId> <scope>runtime</scope> </dependency> <dependency> <groupId>org.apache.commons</groupId> <artifactId>commons-lang3</artifactId> </dependency> <dependency> <groupId>commons-codec</groupId> <artifactId>commons-codec</artifactId> <version>1.13</version> </dependency> <dependency> <groupId>org.springframework.data</groupId> <artifactId>spring-data-commons</artifactId> <version>2.1.10.RELEASE</version> </dependency> <dependency> <groupId>org.projectlombok</groupId> <artifactId>lombok</artifactId> <optional>true</optional> </dependency> <dependency> <groupId>org.springframework.boot</groupId> <artifactId>spring-boot-starter-test</artifactId> <exclusions> <exclusion> <groupId>org.springframework.boot</groupId> <artifactId>spring-boot-starter-logging</artifactId> </exclusion> </exclusions> <scope>test</scope> </dependency> <dependency> <groupId>org.springframework.restdocs</groupId> <artifactId>spring-restdocs-mockmvc</artifactId> <scope>test</scope> </dependency> <dependency> <groupId>org.springframework.boot</groupId> <artifactId>spring-boot-starter-jdbc</artifactId> </dependency> <dependency> <groupId>org.mybatis.spring.boot</groupId> <artifactId>mybatis-spring-boot-starter</artifactId> <version>2.1.0</version> </dependency> <dependency> <groupId>org.mybatis.spring.boot</groupId> <artifactId>mybatis-spring-boot-starter-test</artifactId> <version>2.1.0</version> <scope>test</scope> </dependency> <dependency> <groupId>org.flywaydb</groupId> <artifactId>flyway-core</artifactId> <version>5.2.4</version> </dependency> <dependency> <groupId>commons-fileupload</groupId> <artifactId>commons-fileupload</artifactId> <version>1.3.3</version> </dependency> <dependency> <groupId>org.apache.httpcomponents</groupId> <artifactId>httpcore</artifactId> <version>4.4.12</version> </dependency> <dependency> <groupId>org.apache.httpcomponents</groupId> <artifactId>httpclient</artifactId> <version>4.5.10</version> </dependency> <dependency> <groupId>org.apache.httpcomponents</groupId> <artifactId>httpmime</artifactId> <version>4.5.10</version> </dependency> <dependency> <groupId>io.reactivex.rxjava2</groupId> <artifactId>rxjava</artifactId> <version>2.2.9</version> </dependency> <dependency> <groupId>org.springframework.boot</groupId> <artifactId>spring-boot-starter-aop</artifactId> </dependency> <dependency> <groupId>commons-net</groupId> <artifactId>commons-net</artifactId> <version>3.6</version> </dependency> <!-- 引入 redis 依赖 --> <dependency> <groupId>org.springframework.boot</groupId> <artifactId>spring-boot-starter-data-redis</artifactId> </dependency> <dependency> <groupId>redis.clients</groupId> <artifactId>jedis</artifactId> <version>2.9.0</version> </dependency> <!-- https://mvnrepository.com/artifact/org.apache.solr/solr-solrj --> <dependency> <groupId>org.apache.solr</groupId> <artifactId>solr-solrj</artifactId> <version>8.2.0</version> </dependency> <!-- 解压rar --> <dependency> <groupId>com.github.junrar</groupId> <artifactId>junrar</artifactId> <version>4.0.0</version> </dependency> <!-- 解压zip --> <dependency> <groupId>org.apache.ant</groupId> <artifactId>ant</artifactId> <version>1.10.7</version> </dependency> <!--结果验证--> <dependency> <groupId>com.jayway.jsonpath</groupId> <artifactId>json-path</artifactId> <version>2.4.0</version> </dependency> <!-- 临时--> <dependency> <groupId>com.alibaba</groupId> <artifactId>fastjson</artifactId> <version>1.2.51</version> </dependency> <dependency> <groupId>com.arangodb</groupId> <artifactId>arangodb-java-driver</artifactId> <version>5.0.0</version> </dependency> <!-- https://mvnrepository.com/artifact/org.apache.logging.log4j/log4j-web --> <dependency> <groupId>org.apache.logging.log4j</groupId> <artifactId>log4j-web</artifactId> <version>2.7</version> </dependency> <dependency> <groupId>org.elasticsearch</groupId> <artifactId>elasticsearch</artifactId> <version>5.6.4</version> </dependency> <!-- Java Low Level REST Client --> <dependency> <groupId>org.elasticsearch.client</groupId> <artifactId>elasticsearch-rest-client</artifactId> <version>5.6.4</version> </dependency> <dependency> <groupId>org.elasticsearch.client</groupId> <artifactId>elasticsearch-rest-high-level-client</artifactId> <version>5.6.4</version> </dependency> </dependencies> <build> <plugins> <plugin> <groupId>org.apache.maven.plugins</groupId> <artifactId>maven-surefire-plugin</artifactId> <configuration> <skipTests>true</skipTests> </configuration> </plugin> <plugin> <groupId>org.springframework.boot</groupId> <artifactId>spring-boot-maven-plugin</artifactId> </plugin> <plugin> <groupId>org.apache.maven.plugins</groupId> <artifactId>maven-dependency-plugin</artifactId> <executions> <execution> ```
小白提问idea怎么创建maven 按照教程一直报错啊
http://www.cnblogs.com/-xuzhankun/p/6627424.html教程 ![点击完这些后 idea 就报错了 dom4j的问题么](http://images2015.cnblogs.com/blog/959364/201703/959364-20170331121900180-1689499358.png) "C:\Program Files\Java\jdk1.8.0_60\bin\java" -Dmaven.multiModuleProjectDirectory=C:\Users\Administrator\AppData\Local\Temp\archetypetmp -Dmaven.multiModuleProjectDirectory=$M2_HOME -Dmaven.home=E:\maven\apache-maven-3.3.9 -Dclassworlds.conf=E:\maven\apache-maven-3.3.9\bin\m2.conf -Dfile.encoding=UTF-8 -classpath E:\maven\apache-maven-3.3.9\boot\plexus-classworlds-2.5.2.jar org.codehaus.classworlds.Launcher -Didea.version=2017.2.2 -s E:\maven\apache-maven-3.3.9\conf\settings.xml -DskipTests=true -DinteractiveMode=false -DgroupId=cn.deyou.demo1 -DartifactId=spring_b_m -Dversion=1.0-SNAPSHOT -DarchetypeGroupId=org.apache.maven.archetypes -DarchetypeArtifactId=maven-archetype-webapp -DarchetypeVersion=RELEASE org.apache.maven.plugins:maven-archetype-plugin:RELEASE:generate [INFO] Scanning for projects... [INFO] [INFO] ------------------------------------------------------------------------ [INFO] Building Maven Stub Project (No POM) 1 [INFO] ------------------------------------------------------------------------ [INFO] [INFO] >>> maven-archetype-plugin:3.0.1:generate (default-cli) > generate-sources @ standalone-pom >>> [INFO] [INFO] <<< maven-archetype-plugin:3.0.1:generate (default-cli) < generate-sources @ standalone-pom <<< [INFO] [INFO] --- maven-archetype-plugin:3.0.1:generate (default-cli) @ standalone-pom --- [WARNING] Error injecting: org.apache.maven.archetype.common.DefaultPomManager java.lang.NoClassDefFoundError: org/dom4j/DocumentException at java.lang.Class.getDeclaredMethods0(Native Method) ........ at org.codehaus.classworlds.Launcher.main(Launcher.java:47) [WARNING] Error injecting: org.apache.maven.archetype.creator.FilesetArchetypeCreator java.lang.NoClassDefFoundError: org/dom4j/DocumentException at java.lang.Class.getDeclaredMethods0(Native Method) ........ at org.codehaus.classworlds.Launcher.main(Launcher.java:47) [WARNING] Error injecting: org.apache.maven.archetype.DefaultArchetypeManager java.lang.NoClassDefFoundError: org/dom4j/DocumentException .............................
不知道有没有大神研究openmeetings,使用的是3.0.3版本,使用ant+ivy构建依赖和项目的
ant运行build.xml过程中老出错 <untar src="${red5.server.dir}/target/red5-server-${red5.server.version}-server.tar.gz" dest="${red5.server.dir}/target" compression="gzip"/> 这句报错,好像是不能压缩到那个路径下 附上部分打印信息: [artifact:mvn] [main] INFO org.apache.maven.cli.event.ExecutionEventLogger - [artifact:mvn] [main] INFO org.apache.maven.cli.event.ExecutionEventLogger - --- maven-install-plugin:2.4:install (default-install) @ red5-server --- [artifact:mvn] [main] INFO org.apache.maven.DefaultMaven - Installing F:\J2EEMyEclipse\apache-openmeetings-3.0.3-src\build\red5\server\target\red5-server-1.0.3-RELEASE.jar to C:\Users\ZhangV\.m2\repository\org\red5\red5-server\1.0.3-RELEASE\red5-server-1.0.3-RELEASE.jar [artifact:mvn] [main] INFO org.apache.maven.DefaultMaven - Installing F:\J2EEMyEclipse\apache-openmeetings-3.0.3-src\build\red5\server\pom.xml to C:\Users\ZhangV\.m2\repository\org\red5\red5-server\1.0.3-RELEASE\red5-server-1.0.3-RELEASE.pom [artifact:mvn] [main] INFO org.apache.maven.DefaultMaven - Installing F:\J2EEMyEclipse\apache-openmeetings-3.0.3-src\build\red5\server\target\red5-server-1.0.3-RELEASE-sources.jar to C:\Users\ZhangV\.m2\repository\org\red5\red5-server\1.0.3-RELEASE\red5-server-1.0.3-RELEASE-sources.jar [artifact:mvn] [main] INFO org.apache.maven.DefaultMaven - Installing F:\J2EEMyEclipse\apache-openmeetings-3.0.3-src\build\red5\server\target\red5-server-1.0.3-RELEASE-server.tar.gz to C:\Users\ZhangV\.m2\repository\org\red5\red5-server\1.0.3-RELEASE\red5-server-1.0.3-RELEASE-server.tar.gz [artifact:mvn] [main] INFO org.apache.maven.DefaultMaven - Installing F:\J2EEMyEclipse\apache-openmeetings-3.0.3-src\build\red5\server\target\red5-server-1.0.3-RELEASE-server.zip to C:\Users\ZhangV\.m2\repository\org\red5\red5-server\1.0.3-RELEASE\red5-server-1.0.3-RELEASE-server.zip [artifact:mvn] [main] INFO org.apache.maven.DefaultMaven - Installing F:\J2EEMyEclipse\apache-openmeetings-3.0.3-src\build\red5\server\target\red5-server-1.0.3-RELEASE-javadoc.jar to C:\Users\ZhangV\.m2\repository\org\red5\red5-server\1.0.3-RELEASE\red5-server-1.0.3-RELEASE-javadoc.jar [artifact:mvn] [main] INFO org.apache.maven.cli.event.ExecutionEventLogger - ------------------------------------------------------------------------ [artifact:mvn] [main] INFO org.apache.maven.cli.event.ExecutionEventLogger - BUILD SUCCESS [artifact:mvn] [main] INFO org.apache.maven.cli.event.ExecutionEventLogger - ------ ------------------------------------------------------------------ [artifact:mvn] [main] INFO org.apache.maven.cli.event.ExecutionEventLogger - Total time: 02:54 min [artifact:mvn] [main] INFO org.apache.maven.cli.event.ExecutionEventLogger - Finished at: 2014-09-30T11:24:54+08:00 [artifact:mvn] [main] INFO org.apache.maven.cli.event.ExecutionEventLogger - Final Memory: 20M/97M [artifact:mvn] [main] INFO org.apache.maven.cli.event.ExecutionEventLogger - ------------------------------------------------------------------------ [untar] Expanding: F:\J2EEMyEclipse\apache-openmeetings-3.0.3-src\build\red5\server\target\red5-server-1.0.3-RELEASE-server.tar.gz into F:\J2EEMyEclipse\apache-openmeetings-3.0.3-src\build\red5\server\target BUILD FAILED F:\J2EEMyEclipse\apache-openmeetings-3.0.3-src\build.xml:1185: Error while expanding F:\J2EEMyEclipse\apache-openmeetings-3.0.3-src\build\red5\server\target\red5-server-1.0.3-RELEASE-server.tar.gz java.io.IOException: Error detected parsing the header Total time: 5 minutes 41 seconds
怎么查看maven的pom.xml是否成功下载了所需jar包
## 如题,pom.xml动不动就要报错,不知道是不是因为没有成功下载jar的原因? ![图片说明](https://img-ask.csdn.net/upload/201606/23/1466666764_888875.jpg) Multiple annotations found at this line: - Missing artifact org.apache.maven:maven-artifact:jar:2.0.6:compile - Missing artifact org.apache.maven.shared:maven-filtering:jar:1.0-beta-4:compile - Missing artifact org.apache.maven:maven-profile:jar:2.0.6:compile - Missing artifact org.apache.maven.reporting:maven-reporting-api:jar: 2.0.6:compile - Missing artifact org.apache.maven:maven-plugin-descriptor:jar:2.0.6:compile - Missing artifact org.apache.maven.wagon:wagon-ssh:jar:1.0-beta-2:runtime - Missing artifact org.apache.maven.wagon:wagon-ssh-external:jar:1.0- beta-2:runtime - Missing artifact org.apache.maven:maven-artifact-manager:jar:2.0.6:compile - Missing artifact org.apache.maven:maven-plugin-registry:jar:2.0.6:compile - Missing artifact org.apache.maven:maven-project:jar:2.0.6:compile - Missing artifact org.apache.maven:maven-plugin-api:jar:2.0.6:compile - Missing artifact org.codehaus.plexus:plexus-utils:jar:2.0.5:compile - Missing artifact com.jcraft:jsch:jar:0.1.27:runtime - Missing artifact commons-cli:commons-cli:jar:1.0:compile - Missing artifact org.apache.maven.wagon:wagon-ssh-common:jar:1.0- beta-2:runtime - Missing artifact org.codehaus.plexus:plexus-interactivity-api:jar:1.0- alpha-4:compile - Missing artifact org.wisdom-framework:mysql-connector-java:jar:5.1.34_1:compile - Failed to read artifact descriptor for org.wisdom-framework:abstract-jdbc- driver:jar:0.5 - Missing artifact org.apache.maven.wagon:wagon-file:jar:1.0-beta-2:runtime - Missing artifact org.sonatype.plexus:plexus-build-api:jar:0.0.4:compile - Missing artifact classworlds:classworlds:jar:1.1:compile - Missing artifact org.apache.maven.plugins:maven-resources-plugin:jar: 2.4.3:compile - Missing artifact org.apache.felix:org.apache.felix.ipojo.annotations:jar: 1.12.1:compile - Missing artifact org.codehaus.plexus:plexus-interpolation:jar:1.13:compile - Missing artifact org.apache.maven.wagon:wagon-provider-api:jar:1.0- beta-2:compile - Missing artifact org.apache.maven:maven-monitor:jar:2.0.6:compile - Missing artifact xml-apis:xml-apis:jar:1.0.b2:runtime - Missing artifact org.apache.maven.wagon:wagon-http-shared:jar:1.0- beta-2:runtime - Missing artifact jtidy:jtidy:jar:4aug2000r7-dev:runtime - Missing artifact org.apache.maven:maven-core:jar:2.0.6:compile - Missing artifact org.apache.maven:maven-settings:jar:2.0.6:compile - Missing artifact org.apache.maven:maven-model:jar:2.0.6:compile - Missing artifact org.apache.maven.doxia:doxia-sink-api:jar:1.0-alpha-7:compile - Missing artifact org.apache.maven.wagon:wagon-http-lightweight:jar:1.0- beta-2:runtime - Missing artifact org.apache.maven:maven-repository-metadata:jar:2.0.6:compile - Missing artifact org.apache.maven:maven-error-diagnostics:jar:2.0.6:compile - Missing artifact org.codehaus.plexus:plexus-container-default:jar:1.0-alpha-9- stable-1:compile - Missing artifact junit:junit:jar:3.8.1:test - Missing artifact org.apache.maven:maven-plugin-parameter-documenter:jar: 2.0.6:compile
hadoop-common-2.8.2搭建环境,报错 org.apache.htrace.core.Tracer$Builder.<init>(Ljava/lang/String;)V
# 报错:Exception in thread "main" java.lang.NoSuchMethodError: org.apache.htrace.core.Tracer$Builder.<init>(Ljava/lang/String;)V Exception in thread "main" java.lang.NoSuchMethodError: org.apache.htrace.core.Tracer$Builder.<init>(Ljava/lang/String;)V at org.apache.hadoop.fs.FsTracer.get(FsTracer.java:42) at org.apache.hadoop.fs.FileSystem.createFileSystem(FileSystem.java:2806) at org.apache.hadoop.fs.FileSystem.access$200(FileSystem.java:100) at org.apache.hadoop.fs.FileSystem$Cache.getInternal(FileSystem.java:2849) at org.apache.hadoop.fs.FileSystem$Cache.get(FileSystem.java:2831) at org.apache.hadoop.fs.FileSystem.get(FileSystem.java:389) at org.apache.hadoop.fs.FileSystem.get(FileSystem.java:181) at org.apache.hadoop.fs.FileSystem.get(FileSystem.java:373) at org.apache.hadoop.fs.Path.getFileSystem(Path.java:356) at org.apache.hadoop.mapreduce.lib.input.FileInputFormat.addInputPath(FileInputFormat.java:526) at org.apache.hadoop.mapreduce.lib.input.FileInputFormat.addInputPaths(FileInputFormat.java:491) at com.knn.c.SortMR.main(SortMR.java:65) 换了三个版本的架包htrace-core-3.0.4,htrace-core-3.1.0-incubating,htrace-core-4.0.0-incubating,htrace-core-2.00都试过了,但是还是依旧报错,被这个问题烦死了,在这里卡住了
idea创建Maven项目没有src目录 Run有错误
![图片说明](https://img-ask.csdn.net/upload/201911/02/1572702296_122439.png) ``` "C:\Program Files\Java\jdk1.8.0_202\bin\java.exe" -Dmaven.multiModuleProjectDirectory=C:\Users\dx\AppData\Local\Temp\archetype1tmp -Xms128m -Xmx512m -Duser.language=zh -Dfile.encoding=UTF-8 -Dmaven.home=E:\server\apache-maven-3.6.1 -Dclassworlds.conf=E:\server\apache-maven-3.6.1\bin\m2.conf "-Dmaven.ext.class.path=E:\IntelliJ IDEA 2019.2\plugins\maven\lib\maven-event-listener.jar" -classpath E:\server\apache-maven-3.6.1\boot\plexus-classworlds-2.6.0.jar org.codehaus.classworlds.Launcher -Didea.version2019.2 --offline -s E:\server\apache-maven-3.6.1\conf\settings.xml -Dmaven.repo.local=E:\server\Repository -DinteractiveMode=false -DgroupId=com -DartifactId=demo33333333 -Dversion=1.0-SNAPSHOT -DarchetypeGroupId=org.apache.maven.archetypes -DarchetypeArtifactId=maven-archetype-webapp -DarchetypeVersion=RELEASE org.apache.maven.plugins:maven-archetype-plugin:RELEASE:generate [INFO] Scanning for projects... [INFO] ------------------------------------------------------------------------ [INFO] BUILD FAILURE [INFO] ------------------------------------------------------------------------ [INFO] Total time: 0.140 s [INFO] Finished at: 2019-11-02T21:41:10+08:00 [INFO] ------------------------------------------------------------------------ [ERROR] Plugin org.apache.maven.plugins:maven-archetype-plugin:RELEASE or one of its dependencies could not be resolved: Failed to read artifact descriptor for org.apache.maven.plugins:maven-archetype-plugin:jar:RELEASE: Failed to resolve version for org.apache.maven.plugins:maven-archetype-plugin:jar:RELEASE: Could not find metadata org.apache.maven.plugins:maven-archetype-plugin/maven-metadata.xml in local (E:\server\Repository) -> [Help 1] [ERROR] [ERROR] To see the full stack trace of the errors, re-run Maven with the -e switch. [ERROR] Re-run Maven using the -X switch to enable full debug logging. [ERROR] [ERROR] For more information about the errors and possible solutions, please read the following articles: [ERROR] [Help 1] http://cwiki.apache.org/confluence/display/MAVEN/PluginResolutionException 网上的解决方法我都试过了还是报错,有大佬帮忙看下吗? ```
idea运行maven项目报错:WARNING [RMI TCP Connection(3)-127.0.0.1]
## 下面是控制台报错的一部分,其他的都是一样的错,不知道什么原因! 08-Jan-2019 16:01:33.442 WARNING [RMI TCP Connection(3)-127.0.0.1] org.apache.catalina.webresources.Cache.getResource Unable to add the resource at [/WEB-INF/lib/spring-tx-4.2.6.RELEASE.jar] to the cache because there was insufficient free space available after evicting expired cache entries - consider increasing the maximum size of the cache 08-Jan-2019 16:01:33.446 WARNING [RMI TCP Connection(3)-127.0.0.1] org.apache.catalina.webresources.Cache.getResource Unable to add the resource at [/WEB-INF/lib/validation-api-1.1.0.Final.jar] to the cache because there was insufficient free space available after evicting expired cache entries - consider increasing the maximum size of the cache 08-Jan-2019 16:01:33.448 WARNING [RMI TCP Connection(3)-127.0.0.1] org.apache.catalina.webresources.Cache.getResource Unable to add the resource at [/WEB-INF/lib/wechat-sdk-android-with-mta-1.0.2.jar] to the cache because there was insufficient free space available after evicting expired cache entries - consider increasing the maximum size of the cache 08-Jan-2019 16:01:33.451 WARNING [RMI TCP Connection(3)-127.0.0.1] org.apache.catalina.webresources.Cache.getResource Unable to add the resource at [/WEB-INF/lib/xml-apis-1.3.04.jar] to the cache because there was insufficient free space available after evicting expired cache entries - consider increasing the maximum size of the cache 08-Jan-2019 16:01:33.455 WARNING [RMI TCP Connection(3)-127.0.0.1] org.apache.catalina.webresources.Cache.getResource Unable to add the resource at [/WEB-INF/lib/xml-apis-ext-1.3.04.jar] to the cache because there was insufficient free space available after evicting expired cache entries - consider increasing the maximum size of the cache 08-Jan-2019 16:01:35.887 WARNING [RMI TCP Connection(3)-127.0.0.1] org.apache.catalina.webresources.Cache.getResource Unable to add the resource at [/WEB-INF/classes] to the cache because there was insufficient free space available after evicting expired cache entries - consider increasing the maximum size of the cache
redis集群被禁用,启动工程报错
[INFO] Initializing Logback from [classpath:logback.xml] [INFO] Removing all previous handlers for JUL to SLF4J bridge [INFO] Installing JUL to SLF4J bridge [INFO] Initializing Spring root WebApplicationContext 2017-03-09 08:40:02.054 [main] ERROR org.springframework.web.context.ContextLoader - Context initialization failed org.springframework.beans.factory.BeanCreationException: Error creating bean with name 'jedisCluster' defined in class path resource [spring-redis.xml]: Invocation of init method failed; nested exception is redis.clients.jedis.exceptions.JedisDataException: ERR This instance has cluster support disabled at org.springframework.beans.factory.support.AbstractAutowireCapableBeanFactory.initializeBean(AbstractAutowireCapableBeanFactory.java:1512) ~[spring-beans-3.2.5.RELEASE.jar:3.2.5.RELEASE] at org.springframework.beans.factory.support.AbstractAutowireCapableBeanFactory.doCreateBean(AbstractAutowireCapableBeanFactory.java:521) ~[spring-beans-3.2.5.RELEASE.jar:3.2.5.RELEASE] at org.springframework.beans.factory.support.AbstractAutowireCapableBeanFactory.createBean(AbstractAutowireCapableBeanFactory.java:458) ~[spring-beans-3.2.5.RELEASE.jar:3.2.5.RELEASE] at org.springframework.beans.factory.support.AbstractBeanFactory$1.getObject(AbstractBeanFactory.java:296) ~[spring-beans-3.2.5.RELEASE.jar:3.2.5.RELEASE] at org.springframework.beans.factory.support.DefaultSingletonBeanRegistry.getSingleton(DefaultSingletonBeanRegistry.java:223) ~[spring-beans-3.2.5.RELEASE.jar:3.2.5.RELEASE] at org.springframework.beans.factory.support.AbstractBeanFactory.doGetBean(AbstractBeanFactory.java:293) ~[spring-beans-3.2.5.RELEASE.jar:3.2.5.RELEASE] at org.springframework.beans.factory.support.AbstractBeanFactory.getBean(AbstractBeanFactory.java:194) ~[spring-beans-3.2.5.RELEASE.jar:3.2.5.RELEASE] at org.springframework.beans.factory.support.DefaultListableBeanFactory.preInstantiateSingletons(DefaultListableBeanFactory.java:610) ~[spring-beans-3.2.5.RELEASE.jar:3.2.5.RELEASE] at org.springframework.context.support.AbstractApplicationContext.finishBeanFactoryInitialization(AbstractApplicationContext.java:932) ~[spring-context-3.2.5.RELEASE.jar:3.2.5.RELEASE] at org.springframework.context.support.AbstractApplicationContext.refresh(AbstractApplicationContext.java:479) ~[spring-context-3.2.5.RELEASE.jar:3.2.5.RELEASE] at org.springframework.web.context.ContextLoader.configureAndRefreshWebApplicationContext(ContextLoader.java:389) ~[spring-web-3.2.5.RELEASE.jar:3.2.5.RELEASE] at org.springframework.web.context.ContextLoader.initWebApplicationContext(ContextLoader.java:294) ~[spring-web-3.2.5.RELEASE.jar:3.2.5.RELEASE] at org.springframework.web.context.ContextLoaderListener.contextInitialized(ContextLoaderListener.java:112) [spring-web-3.2.5.RELEASE.jar:3.2.5.RELEASE] at org.eclipse.jetty.server.handler.ContextHandler.callContextInitialized(ContextHandler.java:775) [jetty-server-8.1.11.v20130520.jar:8.1.11.v20130520] at org.eclipse.jetty.servlet.ServletContextHandler.callContextInitialized(ServletContextHandler.java:424) [jetty-servlet-8.1.11.v20130520.jar:8.1.11.v20130520] at org.eclipse.jetty.server.handler.ContextHandler.startContext(ContextHandler.java:767) [jetty-server-8.1.11.v20130520.jar:8.1.11.v20130520] at org.eclipse.jetty.servlet.ServletContextHandler.startContext(ServletContextHandler.java:249) [jetty-servlet-8.1.11.v20130520.jar:8.1.11.v20130520] at org.eclipse.jetty.webapp.WebAppContext.startContext(WebAppContext.java:1252) [jetty-webapp-8.1.11.v20130520.jar:8.1.11.v20130520] at org.eclipse.jetty.server.handler.ContextHandler.doStart(ContextHandler.java:710) [jetty-server-8.1.11.v20130520.jar:8.1.11.v20130520] at org.eclipse.jetty.webapp.WebAppContext.doStart(WebAppContext.java:494) [jetty-webapp-8.1.11.v20130520.jar:8.1.11.v20130520] at org.mortbay.jetty.plugin.JettyWebAppContext.doStart(JettyWebAppContext.java:293) [jetty-maven-plugin-8.1.11.v20130520.jar:8.1.11.v20130520] at org.eclipse.jetty.util.component.AbstractLifeCycle.start(AbstractLifeCycle.java:64) [jetty-util-8.1.11.v20130520.jar:8.1.11.v20130520] at org.eclipse.jetty.server.handler.HandlerCollection.doStart(HandlerCollection.java:229) [jetty-server-8.1.11.v20130520.jar:8.1.11.v20130520] at org.eclipse.jetty.server.handler.ContextHandlerCollection.doStart(ContextHandlerCollection.java:172) [jetty-server-8.1.11.v20130520.jar:8.1.11.v20130520] at org.eclipse.jetty.util.component.AbstractLifeCycle.start(AbstractLifeCycle.java:64) [jetty-util-8.1.11.v20130520.jar:8.1.11.v20130520] at org.eclipse.jetty.server.handler.HandlerCollection.doStart(HandlerCollection.java:229) [jetty-server-8.1.11.v20130520.jar:8.1.11.v20130520] at org.eclipse.jetty.util.component.AbstractLifeCycle.start(AbstractLifeCycle.java:64) [jetty-util-8.1.11.v20130520.jar:8.1.11.v20130520] at org.eclipse.jetty.server.handler.HandlerWrapper.doStart(HandlerWrapper.java:95) [jetty-server-8.1.11.v20130520.jar:8.1.11.v20130520] at org.eclipse.jetty.server.Server.doStart(Server.java:282) [jetty-server-8.1.11.v20130520.jar:8.1.11.v20130520] at org.mortbay.jetty.plugin.JettyServer.doStart(JettyServer.java:65) [jetty-maven-plugin-8.1.11.v20130520.jar:8.1.11.v20130520] at org.eclipse.jetty.util.component.AbstractLifeCycle.start(AbstractLifeCycle.java:64) [jetty-util-8.1.11.v20130520.jar:8.1.11.v20130520] at org.mortbay.jetty.plugin.AbstractJettyMojo.startJetty(AbstractJettyMojo.java:520) [jetty-maven-plugin-8.1.11.v20130520.jar:8.1.11.v20130520] at org.mortbay.jetty.plugin.AbstractJettyMojo.execute(AbstractJettyMojo.java:365) [jetty-maven-plugin-8.1.11.v20130520.jar:8.1.11.v20130520] at org.mortbay.jetty.plugin.JettyRunMojo.execute(JettyRunMojo.java:523) [jetty-maven-plugin-8.1.11.v20130520.jar:8.1.11.v20130520] at org.apache.maven.plugin.DefaultBuildPluginManager.executeMojo(DefaultBuildPluginManager.java:134) [maven-core-3.3.9.jar:3.3.9] at org.apache.maven.lifecycle.internal.MojoExecutor.execute(MojoExecutor.java:207) [maven-core-3.3.9.jar:3.3.9] at org.apache.maven.lifecycle.internal.MojoExecutor.execute(MojoExecutor.java:153) [maven-core-3.3.9.jar:3.3.9] at org.apache.maven.lifecycle.internal.MojoExecutor.execute(MojoExecutor.java:145) [maven-core-3.3.9.jar:3.3.9] at org.apache.maven.lifecycle.internal.LifecycleModuleBuilder.buildProject(LifecycleModuleBuilder.java:116) [maven-core-3.3.9.jar:3.3.9] at org.apache.maven.lifecycle.internal.LifecycleModuleBuilder.buildProject(LifecycleModuleBuilder.java:80) [maven-core-3.3.9.jar:3.3.9] at org.apache.maven.lifecycle.internal.builder.singlethreaded.SingleThreadedBuilder.build(SingleThreadedBuilder.java:51) [maven-core-3.3.9.jar:3.3.9] at org.apache.maven.lifecycle.internal.LifecycleStarter.execute(LifecycleStarter.java:128) [maven-core-3.3.9.jar:3.3.9] at org.apache.maven.DefaultMaven.doExecute(DefaultMaven.java:307) [maven-core-3.3.9.jar:3.3.9] at org.apache.maven.DefaultMaven.doExecute(DefaultMaven.java:193) [maven-core-3.3.9.jar:3.3.9] at org.apache.maven.DefaultMaven.execute(DefaultMaven.java:106) [maven-core-3.3.9.jar:3.3.9] at org.apache.maven.cli.MavenCli.execute(MavenCli.java:863) [maven-embedder-3.3.9.jar:3.3.9] at org.apache.maven.cli.MavenCli.doMain(MavenCli.java:288) [maven-embedder-3.3.9.jar:3.3.9] at org.apache.maven.cli.MavenCli.main(MavenCli.java:199) [maven-embedder-3.3.9.jar:3.3.9] at sun.reflect.NativeMethodAccessorImpl.invoke0(Native Method) ~[na:1.7.0_79] at sun.reflect.NativeMethodAccessorImpl.invoke(Unknown Source) ~[na:1.7.0_79] at sun.reflect.DelegatingMethodAccessorImpl.invoke(Unknown Source) ~[na:1.7.0_79] at java.lang.reflect.Method.invoke(Unknown Source) ~[na:1.7.0_79] at org.codehaus.plexus.classworlds.launcher.Launcher.launchEnhanced(Launcher.java:289) [plexus-classworlds-2.5.2.jar:na] at org.codehaus.plexus.classworlds.launcher.Launcher.launch(Launcher.java:229) [plexus-classworlds-2.5.2.jar:na] at org.codehaus.plexus.classworlds.launcher.Launcher.mainWithExitCode(Launcher.java:415) [plexus-classworlds-2.5.2.jar:na] at org.codehaus.plexus.classworlds.launcher.Launcher.main(Launcher.java:356) [plexus-classworlds-2.5.2.jar:na] Caused by: redis.clients.jedis.exceptions.JedisDataException: ERR This instance has cluster support disabled 请问这个如何解决?
启动tomcat,maven报错:[ERROR] [Help 1] http://cwiki.apache.org/confluence/display/MAVEN/PluginConfigurationException
``` [INFO] Scanning for projects... [INFO] [INFO] ------------------------------------------------------------------------ [INFO] Building taotao-manage-web 1.0.0-SNAPSHOT [INFO] ------------------------------------------------------------------------ [INFO] [INFO] >>> tomcat7-maven-plugin:2.2:run (default-cli) > process-classes @ taotao-manage-web >>> [WARNING] The artifact org.apache.commons:commons-io:jar:1.3.2 has been relocated to commons-io:commons-io:jar:1.3.2 [INFO] [INFO] --- maven-resources-plugin:2.7:resources (default-resources) @ taotao-manage-web --- [INFO] Using 'UTF-8' encoding to copy filtered resources. [INFO] Copying 7 resources [INFO] [INFO] --- maven-compiler-plugin:3.2:compile (default-compile) @ taotao-manage-web --- [INFO] Nothing to compile - all classes are up to date [INFO] [INFO] <<< tomcat7-maven-plugin:2.2:run (default-cli) < process-classes @ taotao-manage-web <<< [WARNING] The artifact org.apache.commons:commons-io:jar:1.3.2 has been relocated to commons-io:commons-io:jar:1.3.2 [INFO] [INFO] --- tomcat7-maven-plugin:2.2:run (default-cli) @ taotao-manage-web --- [INFO] ------------------------------------------------------------------------ [INFO] BUILD FAILURE [INFO] ------------------------------------------------------------------------ [INFO] Total time: 1.444 s [INFO] Finished at: 2019-09-18T09:51:46+08:00 [INFO] Final Memory: 12M/154M [INFO] ------------------------------------------------------------------------ [ERROR] Failed to execute goal org.apache.tomcat.maven:tomcat7-maven-plugin:2.2:run (default-cli) on project taotao-manage-web: Unable to parse configuration of mojo org.apache.tomcat.maven:tomcat7-maven-plugin:2.2:run for parameter project: Cannot find default setter in class org.apache.maven.project.MavenProject -> [Help 1] [ERROR] [ERROR] To see the full stack trace of the errors, re-run Maven with the -e switch. [ERROR] Re-run Maven using the -X switch to enable full debug logging. [ERROR] [ERROR] For more information about the errors and possible solutions, please read the following articles: [ERROR] [Help 1] http://cwiki.apache.org/confluence/display/MAVEN/PluginConfigurationException ``` 烦烦烦,几个这种Bug,刚刚弄完一个,现在又出现一个,repository换了一个新的,前面的几个这样的解决了,现在又冒出一个这个问题。求大佬帮忙!
myeclipse建立maven是pom.xml报错
用MyEclipse10建立maven web工程的时候,POM.XML总是报错,错误信息如下。还请大神们帮帮忙啊~~ 小弟感激涕零!! Multiple annotations found at this line: - No plugin found for prefix 'war' in the current project and in the plugin groups [] available from the repositories [local (C:\Users\Guan Yang\.m2\repository), central (http://repo1.maven.org/maven2)] - Failure to transfer org.apache.maven.plugins:maven-resources-plugin:pom:2.4.3 from http:// repo1.maven.org/maven2 was cached in the local repository, resolution will not be reattempted until the update interval of central has elapsed or updates are forced. Original error: Could not transfer artifact org.apache.maven.plugins:maven-resources-plugin:pom:2.4.3 from/to central (http://repo1.maven.org/maven2): null to http://repo1.maven.org/maven2/org/apache/maven/plugins/maven-resources-plugin/2.4.3/maven-resources- plugin-2.4.3.pom
新建Maven项目报错,提示连接不上中央存储库
CoreException: Could not calculate build plan: Plugin org.apache.maven.plugins:maven-compiler-plugin:2.3.2 or one of its dependencies could not be resolved: Failed to read artifact descriptor for org.apache.maven.plugins:maven-compiler-plugin:jar:2.3.2: ArtifactResolutionException: Failure to transfer org.apache.maven.plugins:maven-compiler-plugin:pom:2.3.2 from http://repo.maven.apache.org/maven2 was cached in the local repository, resolution will not be reattempted until the update interval of central has elapsed or updates are forced. Original error: Could not transfer artifact org.apache.maven.plugins:maven-compiler-plugin:pom:2.3.2 from/to central (http://repo.maven.apache.org/maven2): null to http://repo.maven.apache.org/maven2/org/apache/maven/plugins/maven-compiler-plugin/2.3.2/maven-compiler-plugin-2.3.2.pom
在在使用 6 maven build...去运行项目的结果出现报错
具体报错如下 SLF4J: Failed to load class "org.slf4j.impl.StaticLoggerBinder". SLF4J: Defaulting to no-operation (NOP) logger implementation SLF4J: See http://www.slf4j.org/codes.html#StaticLoggerBinder for further details. [WARNING] [WARNING] Some problems were encountered while building the effective settings [WARNING] Unrecognised tag: 'server' (position: START_TAG seen ...</proxy-->\n\t<server>... @264:10) @ C:\Users\Administrator\.m2\settings.xml, line 264, column 10 [WARNING] [INFO] Scanning for projects... [INFO] [INFO] ------------------------------------------------------------------------ [INFO] Building babasprot Maven Webapp 0.0.1-SNAPSHOT [INFO] ------------------------------------------------------------------------ [INFO] [INFO] >>> tomcat7-maven-plugin:2.2:deploy (default-cli) @ babasprot >>> [INFO] [INFO] --- maven-resources-plugin:2.5:resources (default-resources) @ babasprot --- [debug] execute contextualize [WARNING] Using platform encoding (GBK actually) to copy filtered resources, i.e. build is platform dependent! [INFO] Copying 0 resource [INFO] [INFO] --- maven-compiler-plugin:2.3.2:compile (default-compile) @ babasprot --- [INFO] Nothing to compile - all classes are up to date [INFO] [INFO] --- maven-resources-plugin:2.5:testResources (default-testResources) @ babasprot --- [debug] execute contextualize [WARNING] Using platform encoding (GBK actually) to copy filtered resources, i.e. build is platform dependent! [INFO] Copying 0 resource [INFO] [INFO] --- maven-compiler-plugin:2.3.2:testCompile (default-testCompile) @ babasprot --- [INFO] Not compiling test sources [INFO] [INFO] --- maven-surefire-plugin:2.10:test (default-test) @ babasprot --- [INFO] Tests are skipped. [INFO] [INFO] --- maven-war-plugin:2.1.1:war (default-war) @ babasprot --- [INFO] Packaging webapp [INFO] Assembling webapp [babasprot] in [D:\java\babasprot\target\babasprot] [INFO] Processing war project [INFO] Copying webapp resources [D:\java\babasprot\src\main\webapp] [INFO] Webapp assembled in [40 msecs] [INFO] Building war: D:\java\babasprot\target\babasprot.war [WARNING] Warning: selected war files include a WEB-INF/web.xml which will be ignored (webxml attribute is missing from war task, or ignoreWebxml attribute is specified as 'true') [INFO] [INFO] <<< tomcat7-maven-plugin:2.2:deploy (default-cli) @ babasprot <<< [INFO] [INFO] --- tomcat7-maven-plugin:2.2:deploy (default-cli) @ babasprot --- [INFO] Deploying war to http://localhost:8080/ SLF4J: Failed to load class "org.slf4j.impl.StaticLoggerBinder". SLF4J: Defaulting to no-operation (NOP) logger implementation SLF4J: See http://www.slf4j.org/codes.html#StaticLoggerBinder for further details. Uploading: http://localhost:8080/manager/text/deploy?path=%2F Uploaded: http://localhost:8080/manager/text/deploy?path=%2F (3 KB) [ERROR] Tomcat return http status error: 401, Reason Phrase: Unauthorized [INFO] ------------------------------------------------------------------------ [INFO] BUILD FAILURE [INFO] ------------------------------------------------------------------------ [INFO] Total time: 2.704s [INFO] Finished at: Fri Jun 10 15:43:40 CST 2016 [INFO] Final Memory: 9M/22M [INFO] ------------------------------------------------------------------------ [ERROR] Failed to execute goal org.apache.tomcat.maven:tomcat7-maven-plugin:2.2:deploy (default-cli) on project babasprot: Tomcat return http status error: 401, Reason Phrase: Unauthorized: [ERROR] <!DOCTYPE html PUBLIC "-//W3C//DTD HTML 4.01//EN" "http://www.w3.org/TR/html4/strict.dtd"> [ERROR] <html> [ERROR] <head> [ERROR] <title>401 Unauthorized</title> [ERROR] <style type="text/css"> [ERROR] <!-- [ERROR] BODY {font-family:Tahoma,Arial,sans-serif;color:black;background-color:white;font-size:12px;} [ERROR] H1 {font-family:Tahoma,Arial,sans-serif;color:white;background-color:#525D76;font-size:22px;} [ERROR] PRE, TT {border: 1px dotted #525D76} [ERROR] A {color : black;}A.name {color : black;} [ERROR] --> [ERROR] </style> [ERROR] </head> [ERROR] <body> [ERROR] <h1>401 Unauthorized</h1> [ERROR] <p> [ERROR] You are not authorized to view this page. If you have not changed [ERROR] any configuration files, please examine the file [ERROR] <tt>conf/tomcat-users.xml</tt> in your installation. That [ERROR] file must contain the credentials to let you use this webapp. [ERROR] </p> [ERROR] <p> [ERROR] For example, to add the <tt>manager-gui</tt> role to a user named [ERROR] <tt>tomcat</tt> with a password of <tt>s3cret</tt>, add the following to the [ERROR] config file listed above. [ERROR] </p> [ERROR] <pre> [ERROR] &lt;role rolename="manager-gui"/&gt; [ERROR] &lt;user username="tomcat" password="s3cret" roles="manager-gui"/&gt; [ERROR] </pre> [ERROR] <p> [ERROR] Note that for Tomcat 7 onwards, the roles required to use the manager [ERROR] application were changed from the single <tt>manager</tt> role to the [ERROR] following four roles. You will need to assign the role(s) required for [ERROR] the functionality you wish to access. [ERROR] </p> [ERROR] <ul> [ERROR] <li><tt>manager-gui</tt> - allows access to the HTML GUI and the status [ERROR] pages</li> [ERROR] <li><tt>manager-script</tt> - allows access to the text interface and the [ERROR] status pages</li> [ERROR] <li><tt>manager-jmx</tt> - allows access to the JMX proxy and the status [ERROR] pages</li> [ERROR] <li><tt>manager-status</tt> - allows access to the status pages only</li> [ERROR] </ul> [ERROR] <p> [ERROR] The HTML interface is protected against CSRF but the text and JMX interfaces [ERROR] are not. To maintain the CSRF protection: [ERROR] </p> [ERROR] <ul> [ERROR] <li>Users with the <tt>manager-gui</tt> role should not be granted either [ERROR] the <tt>manager-script</tt> or <tt>manager-jmx</tt> roles.</li> [ERROR] <li>If the text or jmx interfaces are accessed through a browser (e.g. for [ERROR] testing since these interfaces are intended for tools not humans) then [ERROR] the browser must be closed afterwards to terminate the session.</li> [ERROR] </ul> [ERROR] <p> [ERROR] For more information - please see the [ERROR] <a href="/docs/manager-howto.html">Manager App HOW-TO</a>. [ERROR] </p> [ERROR] </body> [ERROR] [ERROR] </html> [ERROR] -> [Help 1] [ERROR] [ERROR] To see the full stack trace of the errors, re-run Maven with the -e switch. [ERROR] Re-run Maven using the -X switch to enable full debug logging. [ERROR] [ERROR] For more information about the errors and possible solutions, please read the following articles: [ERROR] [Help 1] http://cwiki.apache.org/confluence/display/MAVEN/MojoExecutionException
maven项目mybatis generator运行报错 求帮忙!!
第一次创建maven!!都跟着教程走了!!!这个弹出的错误没搜到!!!求帮忙!!!!! 错误如下: [INFO] ------------------------------------------------------------------------ [INFO] BUILD FAILURE [INFO] ------------------------------------------------------------------------ [INFO] Total time: 0.392 s [INFO] Finished at: 2018-07-30T09:24:58+08:00 [INFO] Final Memory: 7M/245M [INFO] ------------------------------------------------------------------------ [ERROR] Failed to execute goal org.mybatis.generator:mybatis-generator-maven-plugin:1.3.5:generate (default-cli) on project mavenone: Execution default-cli of goal org.mybatis.generator:mybatis-generator-maven-plugin:1.3.5:generate failed: A required class was missing while executing org.mybatis.generator:mybatis-generator-maven-plugin:1.3.5:generate: org/mybatis/generator/exception/XMLParserException [ERROR] ----------------------------------------------------- [ERROR] realm = plugin>org.mybatis.generator:mybatis-generator-maven-plugin:1.3.5 [ERROR] strategy = org.codehaus.plexus.classworlds.strategy.SelfFirstStrategy [ERROR] urls[0] = file:/C:/Users/45392/.m2/repository/org/mybatis/generator/mybatis-generator-maven-plugin/1.3.5/mybatis-generator-maven-plugin-1.3.5.jar [ERROR] urls[1] = file:/C:/Users/45392/.m2/repository/org/codehaus/plexus/plexus-utils/3.0.22/plexus-utils-3.0.22.jar [ERROR] urls[2] = file:/C:/Users/45392/.m2/repository/org/apache/commons/commons-lang3/3.4/commons-lang3-3.4.jar [ERROR] urls[3] = file:/C:/Users/45392/.m2/repository/javax/enterprise/cdi-api/1.0/cdi-api-1.0.jar [ERROR] urls[4] = file:/C:/Users/45392/.m2/repository/javax/annotation/jsr250-api/1.0/jsr250-api-1.0.jar [ERROR] urls[5] = file:/C:/Users/45392/.m2/repository/org/eclipse/sisu/org.eclipse.sisu.inject/0.3.2/org.eclipse.sisu.inject-0.3.2.jar [ERROR] urls[6] = file:/C:/Users/45392/.m2/repository/org/codehaus/plexus/plexus-component-annotations/1.5.5/plexus-component-annotations-1.5.5.jar [ERROR] urls[7] = file:/C:/Users/45392/.m2/repository/org/mybatis/generator/mybatis-generator-core/1.3.5/mybatis-generator-core-1.3.5.jar [ERROR] Number of foreign imports: 1 [ERROR] import: Entry[import from realm ClassRealm[maven.api, parent: null]] [ERROR] [ERROR] -----------------------------------------------------: org.mybatis.generator.exception.XMLParserException
终于明白阿里百度这样的大公司,为什么面试经常拿ThreadLocal考验求职者了
点击上面↑「爱开发」关注我们每晚10点,捕获技术思考和创业资源洞察什么是ThreadLocalThreadLocal是一个本地线程副本变量工具类,各个线程都拥有一份线程私...
Java学习的正确打开方式
在博主认为,对于入门级学习java的最佳学习方法莫过于视频+博客+书籍+总结,前三者博主将淋漓尽致地挥毫于这篇博客文章中,至于总结在于个人,实际上越到后面你会发现学习的最好方式就是阅读参考官方文档其次就是国内的书籍,博客次之,这又是一个层次了,这里暂时不提后面再谈。博主将为各位入门java保驾护航,各位只管冲鸭!!!上天是公平的,只要不辜负时间,时间自然不会辜负你。 何谓学习?博主所理解的学习,它是一个过程,是一个不断累积、不断沉淀、不断总结、善于传达自己的个人见解以及乐于分享的过程。
程序员必须掌握的核心算法有哪些?
由于我之前一直强调数据结构以及算法学习的重要性,所以就有一些读者经常问我,数据结构与算法应该要学习到哪个程度呢?,说实话,这个问题我不知道要怎么回答你,主要取决于你想学习到哪些程度,不过针对这个问题,我稍微总结一下我学过的算法知识点,以及我觉得值得学习的算法。这些算法与数据结构的学习大多数是零散的,并没有一本把他们全部覆盖的书籍。下面是我觉得值得学习的一些算法以及数据结构,当然,我也会整理一些看过
大学四年自学走来,这些私藏的实用工具/学习网站我贡献出来了
大学四年,看课本是不可能一直看课本的了,对于学习,特别是自学,善于搜索网上的一些资源来辅助,还是非常有必要的,下面我就把这几年私藏的各种资源,网站贡献出来给你们。主要有:电子书搜索、实用工具、在线视频学习网站、非视频学习网站、软件下载、面试/求职必备网站。 注意:文中提到的所有资源,文末我都给你整理好了,你们只管拿去,如果觉得不错,转发、分享就是最大的支持了。 一、电子书搜索 对于大部分程序员...
《奇巧淫技》系列-python!!每天早上八点自动发送天气预报邮件到QQ邮箱
将代码部署服务器,每日早上定时获取到天气数据,并发送到邮箱。 也可以说是一个小人工智障。 思路可以运用在不同地方,主要介绍的是思路。
Python 植物大战僵尸代码实现(2):植物卡片选择和种植
这篇文章要介绍的是: - 上方植物卡片栏的实现。 - 点击植物卡片,鼠标切换为植物图片。 - 鼠标移动时,判断当前在哪个方格中,并显示半透明的植物作为提示。
死磕YOLO系列,YOLOv1 的大脑、躯干和手脚
YOLO 是我非常喜欢的目标检测算法,堪称工业级的目标检测,能够达到实时的要求,它帮我解决了许多实际问题。 这就是 YOLO 的目标检测效果。它定位了图像中物体的位置,当然,也能预测物体的类别。 之前我有写博文介绍过它,但是每次重新读它的论文,我都有新的收获,为此我准备写一个系列的文章来详尽分析它。这是第一篇,从它的起始 YOLOv1 讲起。 YOLOv1 的论文地址:https://www.c
知乎高赞:中国有什么拿得出手的开源软件产品?(整理自本人原创回答)
知乎高赞:中国有什么拿得出手的开源软件产品? 在知乎上,有个问题问“中国有什么拿得出手的开源软件产品(在 GitHub 等社区受欢迎度较好的)?” 事实上,还不少呢~ 本人于2019.7.6进行了较为全面的 回答 - Bravo Yeung,获得该问题下回答中得最高赞(236赞和1枚专业勋章),对这些受欢迎的 Github 开源项目分类整理如下: 分布式计算、云平台相关工具类 1.SkyWalk
记一次腾讯面试:进程之间究竟有哪些通信方式?如何通信? ---- 告别死记硬背
有一次面试的时候,被问到进程之间有哪些通信方式,不过由于之前没深入思考且整理过,说的并不好。想必大家也都知道进程有哪些通信方式,可是我猜很多人都是靠着”背“来记忆的,所以今天的这篇文章,讲给大家详细着讲解他们是如何通信的,让大家尽量能够理解他们之间的区别、优缺点等,这样的话,以后面试官让你举例子,你也能够顺手拈来。 1、管道 我们来看一条 Linux 的语句 netstat -tulnp | gr...
20行Python代码爬取王者荣耀全英雄皮肤
引言 王者荣耀大家都玩过吧,没玩过的也应该听说过,作为时下最火的手机MOBA游戏,咳咳,好像跑题了。我们今天的重点是爬取王者荣耀所有英雄的所有皮肤,而且仅仅使用20行Python代码即可完成。 准备工作 爬取皮肤本身并不难,难点在于分析,我们首先得得到皮肤图片的url地址,话不多说,我们马上来到王者荣耀的官网: 我们点击英雄资料,然后随意地选择一位英雄,接着F12打开调试台,找到英雄原皮肤的图片
网络(8)-HTTP、Socket、TCP、UDP的区别和联系
TCP/IP协议是传输层协议,主要解决数据如何在网络中传输,而HTTP是应用层协议,主要解决如何包装数据。 一、TCP与UDP的不同 1. 是否需要建立连接。 UDP在传送数据之前不需要先建立连接;TCP则提供面向连接的服务; 2. 是否需要给出确认 对方的传输层在收到UDP报文后,不需要给出任何确认,而 TCP需要给出确认报文,要提供可靠的、面向连接的传输服务。 3.虽然UDP不提供可靠交...
简明易理解的@SpringBootApplication注解源码解析(包含面试提问)
欢迎关注文章系列 ,关注我 《提升能力,涨薪可待》 《面试知识,工作可待》 《实战演练,拒绝996》 欢迎关注我博客,原创技术文章第一时间推出 也欢迎关注公 众 号【Ccww笔记】,同时推出 如果此文对你有帮助、喜欢的话,那就点个赞呗,点个关注呗! 《提升能力,涨薪可待篇》- @SpringBootApplication注解源码解析 一、@SpringBootApplication 的作用是什
防劝退!数据结构和算法难理解?可视化动画带你轻松透彻理解!
大家好,我是 Rocky0429,一个连数据结构和算法都不会的蒟蒻… 学过数据结构和算法的都知道这玩意儿不好学,没学过的经常听到这样的说法还没学就觉得难,其实难吗?真难! 难在哪呢?当年我还是个小蒟蒻,初学数据结构和算法的时候,在忍着枯燥看完定义原理,之后想实现的时候,觉得它们的过程真的是七拐八绕,及其难受。 在简单的链表、栈和队列这些我还能靠着在草稿上写写画画理解过程,但是到了数论、图...
西游记团队中如果需要裁掉一个人,会先裁掉谁?
2019年互联网寒冬,大批企业开始裁员,下图是网上流传的一张截图: 裁员不可避免,那如何才能做到不管大环境如何变化,自身不受影响呢? 我们先来看一个有意思的故事,如果西游记取经团队需要裁员一名,会裁掉谁呢,为什么? 西游记团队组成: 1.唐僧 作为团队teamleader,有很坚韧的品性和极高的原则性,不达目的不罢休,遇到任何问题,都没有退缩过,又很得上司支持和赏识(直接得到唐太宗的任命,既给
开挂的人生!那些当选院士,又是ACM/IEEE 双料Fellow的华人学者们
昨日,2019年两院院士正式官宣,一时间抢占了各大媒体头条。 朋友圈也是一片沸腾,奔走相告,赶脚比自己中了大奖还嗨皮! 谁叫咱家导师就是这么厉害呢!!! 而就在最近,新一年度的IEEE/ACM Fellow也将正式公布。 作为学术届的顶级荣誉,不自然地就会将院士与Fellow作比较,到底哪个含金量更高呢? 学术君认为,同样是专业机构对学者的认可,考量标准不一,自然不能一概而论。 但...
聊聊C语言和指针的本质
坐着绿皮车上海到杭州,24块钱,很宽敞,在火车上非正式地聊几句。 很多编程语言都以 “没有指针” 作为自己的优势来宣传,然而,对于C语言,指针却是与生俱来的。 那么,什么是指针,为什么大家都想避开指针。 很简单, 指针就是地址,当一个地址作为一个变量存在时,它就被叫做指针,该变量的类型,自然就是指针类型。 指针的作用就是,给出一个指针,取出该指针指向地址处的值。为了理解本质,我们从计算机模型说起...
Python语言高频重点汇总
Python语言高频重点汇总 GitHub面试宝典仓库——点这里跳转 文章目录Python语言高频重点汇总**GitHub面试宝典仓库——点这里跳转**1. 函数-传参2. 元类3. @staticmethod和@classmethod两个装饰器4. 类属性和实例属性5. Python的自省6. 列表、集合、字典推导式7. Python中单下划线和双下划线8. 格式化字符串中的%和format9.
究竟你适不适合买Mac?
我清晰的记得,刚买的macbook pro回到家,开机后第一件事情,就是上了淘宝网,花了500元钱,找了一个上门维修电脑的师傅,上门给我装了一个windows系统。。。。。。 表砍我。。。 当时买mac的初衷,只是想要个固态硬盘的笔记本,用来运行一些复杂的扑克软件。而看了当时所有的SSD笔记本后,最终决定,还是买个好(xiong)看(da)的。 已经有好几个朋友问我mba怎么样了,所以今天尽量客观...
代码详解:如何用Python快速制作美观、炫酷且有深度的图表
全文共12231字,预计学习时长35分钟生活阶梯(幸福指数)与人均GDP(金钱)正相关的正则图本文将探讨三种用Python可视化数据的不同方法。以可视化《2019年世界幸福报告》的数据为例,本文用Gapminder和Wikipedia的信息丰富了《世界幸福报告》数据,以探索新的数据关系和可视化方法。《世界幸福报告》试图回答世界范围内影响幸福的因素。报告根据对“坎特里尔阶梯问题”的回答来确定幸...
程序员一般通过什么途径接私活?
二哥,你好,我想知道一般程序猿都如何接私活,我也想接,能告诉我一些方法吗? 上面是一个读者“烦不烦”问我的一个问题。其实不止是“烦不烦”,还有很多读者问过我类似这样的问题。 我接的私活不算多,挣到的钱也没有多少,加起来不到 20W。说实话,这个数目说出来我是有点心虚的,毕竟太少了,大家轻喷。但我想,恰好配得上“一般程序员”这个称号啊。毕竟苍蝇再小也是肉,我也算是有经验的人了。 唾弃接私活、做外...
(经验分享)作为一名普通本科计算机专业学生,我大学四年到底走了多少弯路
今年正式步入了大四,离毕业也只剩半年多的时间,回想一下大学四年,感觉自己走了不少弯路,今天就来分享一下自己大学的学习经历,也希望其他人能不要走我走错的路。 (一)初进校园 刚进入大学的时候自己完全就相信了高中老师的话:“进入大学你们就轻松了”。因此在大一的时候自己学习的激情早就被抛地一干二净,每天不是在寝室里玩游戏就是出门游玩,不过好在自己大学时买的第一台笔记本性能并不是很好,也没让我彻底沉...
如何写一篇技术博客,谈谈我的看法
前言 只有光头才能变强。 文本已收录至我的GitHub精选文章,欢迎Star:https://github.com/ZhongFuCheng3y/3y 我一直推崇学技术可以写技术博客去沉淀自己的知识,因为知识点实在是太多太多了,通过自己的博客可以帮助自己快速回顾自己学过的东西。 我最开始的时候也是只记笔记,认为自己能看得懂就好。但如果想验证自己是不是懂了,可以写成技术博客。在写技术博客的...
字节跳动面试官这样问消息队列:分布式事务、重复消费、顺序消费,我整理了一下
你知道的越多,你不知道的越多 点赞再看,养成习惯 GitHub上已经开源 https://github.com/JavaFamily 有一线大厂面试点脑图、个人联系方式和人才交流群,欢迎Star和完善 前言 消息队列在互联网技术存储方面使用如此广泛,几乎所有的后端技术面试官都要在消息队列的使用和原理方面对小伙伴们进行360°的刁难。 作为一个在互联网公司面一次拿一次Offer的面霸...
面试还搞不懂redis,快看看这40道面试题(含答案和思维导图)
Redis 面试题 1、什么是 Redis?. 2、Redis 的数据类型? 3、使用 Redis 有哪些好处? 4、Redis 相比 Memcached 有哪些优势? 5、Memcache 与 Redis 的区别都有哪些? 6、Redis 是单进程单线程的? 7、一个字符串类型的值能存储最大容量是多少? 8、Redis 的持久化机制是什么?各自的优缺点? 9、Redis 常见性...
大学四年自学走来,这些珍藏的「实用工具/学习网站」我全贡献出来了
知乎高赞:文中列举了互联网一线大厂程序员都在用的工具集合,涉及面非常广,小白和老手都可以进来看看,或许有新收获。
互联网公司的裁员,能玩出多少种花样?
裁员,也是一门学问,可谓博大精深!以下,是互联网公司的裁员的多种方法:-正文开始-135岁+不予续签的理由:千禧一代网感更强。95后不予通过试用期的理由:已婚已育员工更有责任心。2通知接下来要过苦日子,让一部分不肯同甘共苦的员工自己走人,以“兄弟”和“非兄弟”来区别员工。3强制996。员工如果平衡不了工作和家庭,可在离婚或离职里二选一。4不布置任何工作,但下班前必须提交千字工作日报。5不给活干+...
【设计模式】单例模式的八种写法分析
网上泛滥流传单例模式的写法种类,有说7种的,也有说6种的,当然也不排除说5种的,他们说的有错吗?其实没有对与错,刨根问底,写法终究是写法,其本质精髓大体一致!因此完全没必要去追究写法的多少,有这个时间还不如跟着宜春去网吧偷耳机、去田里抓青蛙得了,一天天的....
《面试宝典》:检验是否为合格的初中级程序员的面试知识点,你都知道了吗?查漏补缺
欢迎关注文章系列,一起学习 《提升能力,涨薪可待篇》 《面试知识,工作可待篇》 《实战演练,拒绝996篇》 也欢迎关注公 众 号【Ccww笔记】,原创技术文章第一时间推出 如果此文对你有帮助、喜欢的话,那就点个赞呗,点个关注呗! 《面试知识,工作可待篇》-Java笔试面试基础知识大全 前言 是不是感觉找工作面试是那么难呢? 在找工作面试应在学习的基础进行总结面试知识点,工作也指日可待,欢...
关于研发效能提升的思考
研发效能提升是最近比较热门的一个话题,本人根据这几年的工作心得,做了一些思考总结,由于个人深度有限,暂且抛转引入。 三要素 任何生产力的提升都离不开这三个因素:人、流程和工具,少了其中任何一个因素都无法实现。 人,即思想,也就是古人说的“道”,道不同不相为谋,是制高点,也是高层建筑的基石。 流程,即方法,也是古人说的“法”。研发效能的提升,也就是要提高投入产出比,既要增加产出,也要减...
微博推荐算法简述
在介绍微博推荐算法之前,我们先聊一聊推荐系统和推荐算法。有这样一些问题:推荐系统适用哪些场景?用来解决什么问题、具有怎样的价值?效果如何衡量? 推荐系统诞生很早,但真正被大家所重视,缘起于以”facebook”为代表的社会化网络的兴起和以“淘宝“为代表的电商的繁荣,”选择“的时代已经来临,信息和物品的极大丰富,让用户如浩瀚宇宙中的小点,无所适从。推荐系统迎来爆发的机会,变得离用户更近: 快...
相关热词 c#判断数字不得为负数 c#帧和帧协议 c#算偏移值 c# 在枚举中 c#6 字符串 插值 c#程序中的占位符标签 c#监听数组变化 c# vlc c#索引实现 c# 局域网广播通信
立即提问