langzi_sdd
亲爱的西西哥
2015-02-12 07:55

Ubuntu 12.04 Tse make 出错

1
  • 搜索引擎

flex 安装了。
错误信息为:
for n in uri hlink stack lib; do make -C $n || exit 1; done
make[1]: Entering directory `/home/jshan/Downloads/Tse/tse.code/tse/uri'
gcc -c -O2 -I/home/jshan/Downloads/Tse/tse.code/tse/include lex.uri.c
uri.l: In function ‘urilex’:
uri.l:494: error: invalid lvalue in increment
uri.l:494: error: invalid lvalue in increment
uri.l:494: error: invalid lvalue in increment
uri.l:500: error: invalid lvalue in increment
uri.l:500: error: invalid lvalue in increment
uri.l:500: error: invalid lvalue in increment
uri.l:506: error: invalid lvalue in increment
uri.l:506: error: invalid lvalue in increment
uri.l:506: error: invalid lvalue in increment
uri.l:511: error: invalid lvalue in increment
uri.l:511: error: invalid lvalue in increment
uri.l:511: error: invalid lvalue in increment
uri.l: In function ‘__path_merge’:
uri.l:842: error: invalid lvalue in decrement
uri.l:843: error: invalid lvalue in decrement
uri.l:849: error: invalid lvalue in increment
uri.l:850: error: invalid lvalue in increment
uri.l:873: error: invalid lvalue in decrement
uri.l:874: error: invalid lvalue in decrement
uri.l:880: error: invalid lvalue in increment
uri.l:881: error: invalid lvalue in increment
uri.l:938: error: invalid lvalue in decrement
uri.l:940: error: invalid lvalue in decrement
uri.l: In function ‘uri_combine’:
uri.l:1073: error: invalid lvalue in increment
uri.l:1073: error: invalid lvalue in increment
uri.l:1073: error: invalid lvalue in increment
uri.l:1097: error: invalid lvalue in increment
uri.l:1097: error: invalid lvalue in increment
uri.l:1097: error: invalid lvalue in increment
uri.l:1108: error: invalid lvalue in increment
uri.l:1108: error: invalid lvalue in increment
uri.l:1108: error: invalid lvalue in increment
uri.l:1119: error: invalid lvalue in increment
uri.l:1119: error: invalid lvalue in increment
uri.l:1119: error: invalid lvalue in increment
uri.l:1129: error: invalid lvalue in increment
uri.l:1129: error: invalid lvalue in increment
uri.l:1129: error: invalid lvalue in increment
uri.l:1139: error: invalid lvalue in increment
uri.l:1139: error: invalid lvalue in increment
uri.l:1139: error: invalid lvalue in increment
uri.l:1150: error: invalid lvalue in increment
uri.l:1150: error: invalid lvalue in increment
uri.l:1150: error: invalid lvalue in increment
uri.l:1162: error: invalid lvalue in increment
uri.l:1162: error: invalid lvalue in increment
uri.l:1162: error: invalid lvalue in increment
make[1]: *** [lex.uri.o] Error 1

  • 点赞
  • 回答
  • 收藏
  • 复制链接分享

6条回答

为你推荐

换一换