mybatis maven 项目编译问题

我在github上下载mybatis项目 导入eclipse中 pom.xml文件中的:

org.mybatis
mybatis-parent
25-SNAPSHOT

​提示错误:
Description Resource Path Location Type
Project build error: Non-resolvable parent POM for org.mybatis:mybatis:3.3.1-SNAPSHOT: Could not find artifact org.mybatis:mybatis-parent:pom:25-SNAPSHOT and 'parent.relativePath' points at wrong local POM pom.xml /mybatis line 20 Maven pom Loading Problem
请问需要怎么解决这样的问题。

2个回答

没看懂,不知道怎么配置快照版本 ,我试着换了低点的版本还是不行。


org.mybatis
mybatis-parent
21-SNAPSHOT

不知道应该怎么配置,能给我例子么

Csdn user default icon
上传中...
上传图片
插入图片
抄袭、复制答案,以达到刷声望分或其他目的的行为,在CSDN问答是严格禁止的,一经发现立刻封号。是时候展现真正的技术了!
其他相关推荐
maven编译git项目
首先下载git项目从gitlab 下载配置maven 命令行定位到项目地址 输入mvn install 直至命令行显示success 工程目录下有个target文件夹,里面有war包。拷到Tomcat,webapp下,即可运行 对项目的插件进行编译http://192.168.177.251:8000/wizdom-urban/wizdom-urban-v14/blob/master/...
idea 编译 maven 项目
插件安装参考: https://blog.csdn.net/qq_35246620/article/details/78289074
idea maven 项目编译
在 idea 中构建maven项目时,resources 文件夹的 文件会遇到编译不成功的项目,即只能编译class。这里需要手动点击一下 maven 的 Generate Sources and update folders即可将resources 文件夹下的文件编译过去...
maven编译项目命令
新安装了IntelliJ IDEA开发环境,导入了maven项目,配置好环境后,使用maven编译项目。 命令:mvn clean install -Dmaven.test.skip=true 注:编译时跳过测试内容
Maven 开发mybatis项目demo
Maven 开发mybatis项目demo,可用资源 请放心下载
maven spring mybatis项目整合
这是用maven,spring,mybatis整合的一个项目,只是在下边spring,mybatis项目整合的基础上加入了maven,如果你有需要可以下下来看看,在我百度空间里有关于这个的介绍 地址:http://hi.baidu.com/blue1255/item/d19bba88d1b21ac8ef083db6
MAVEN搭建SpringMVC项目+Mybatis
NULL 博文链接:https://aa89159107.iteye.com/blog/2114509
Maven使用MyBatis构建项目
整体项目使用pom.xml导入jar包<project xmlns="http://maven.apache.org/POM/4.0.0" xmlns:xsi="http://www.w3.org/2001/XMLSchema-instance" xsi:schemaLocation="http://maven.apache.org/POM/4.0.0 http://maven.apac...
Maven编译多子项目依赖
早在某公司实习的时候就听闻过Maven,只是听大神简单的介绍过,自己没有实习做过。之前做Android 的时候主要是用gradle(不过真心不熟),大概有点知道Maven的作用,这次来深圳某公司实习,老板叫用Maven 编译C++,虽然事实证明老板的想法有点错误,不过也基于这个,还是稍微正规的学了一发Maven(当然是自学了,除了C++其他都是自学的)。 Maven简介 Maven其实主要就是
mondrian war项目maven编译
mondrian默认采用ant build,这里的war项目采用maven编译,可以直接在eclipse里运行
idea 项目 maven编译不通过
  1、查找半天 重新配置maven  或者删除jar包,配置集成的maven  都不管用,   最后 排查原因, maven 下载地址 在这重新配置一下成 自己项目的私服,reimport一下   再编译就通过了!   ...
Maven 编译项目找不到符号。
各种百度,bing搜索。没有找到解决的方案。 <project xmlns="http://maven.apache.org/POM/4.0.0" xmlns:xsi="http://www.w3.org/2001/XMLSchema-instance" xsi:schemaLocation="http://maven.apache.org/POM/4.0.0 http://maven...
maven 编译flex 4.6和3.2的项目问题
高手们好,rnrn 现在我有一个项目用到maven和flex, 如果在项目的pom.xml文件里配置用flex 3.2, 但是没有添加下面的dependencyrnrncom.adobe.flexrnlicensern3.2.0.3958rnrn以及rnrn rn rn编译出来的项目里面就会有flex data visualization trial水印,rn但是如果改成flex4.6, 即使里面没有license的dependency 也没有配置flex4的license,编译出来的就没有水印,这是为什么? 谢谢大家帮我解答了
maven编译项目,当项目不起作用时
maven编译引用的子项目。编译完成后。主项目没有起作用
maven和MyBatis
maven和MyBatis的JAVA相关代码,主要介绍的是写的项目,从而可以清楚的看到他的配置,便于我们从中得到学习。
Maven 打包 MyBatis 项目 war包运行失败
用Maven打包java项目,war包在tomcat中启动失败。 原因是打包时mapping中xml文件被忽略掉,导致因为缺少配置而运行失败。 解决办法:     在pom.xml中添加 <build> <resources> <resource> <directory>src/main/resourc...
Spring mybatis maven的项目环境运行流程
框架: spring mybatis 管理工具:maven 架构模式:spring mvc创建的包 1.controller(控制器) 2.dao(数据访问层) 3.entity(实体类) 4.service(业务逻辑) 4.1service (接口) 4.2impl(实现方法) 5.util(工具包 )
基于IDEA 的maven 项目 的 MyBatis配置
MyBatis 环境搭建(基于IDEA 的Maven)的入门级参考。详细请参考博客:https://www.jianshu.com/p/ef839aa9b309
Spring MVC mybatis + maven 项目配置文件报错
[img=https://img-bbs.csdn.net/upload/201312/24/1387867430_621318.png][/img][img=https://img-bbs.csdn.net/upload/201312/24/1387867421_315198.png][/img]小弟小白, 看着网上的教程一步一步建完了项目结果配置文件报错了。。。求教啊。rnjunit测试也不通过。 教程上面都OK 我一步也没漏怎么就不行了馁。。。rn
maven 编译问题
maven在编译的时候报如下错误:rnrn[ERROR] COMPILATION ERROR : rn[INFO] -------------------------------------------------------------rn[ERROR] xxx\src\main\java\cn\xxx.java:[28,32] 无法确定 E 的类型参数;对于上限为 E,java.lang.Object 的类型变量 E,不存在唯一最大实例rn[INFO] 1 errorrnrn但有时却可以编译通过。rn比如把项目删除重新checkout以后,rn首次可以编译通过,再次编译以后将会报错。rn请各位帮分析一下!
maven 编译问题?
maven在编译的时候报如下错误: rnrn[ERROR] COMPILATION ERROR : rn[INFO] ------------------------------------------------------------- rn[ERROR] xxx\src\main\java\cn\xxx.java:[28,32] 无法确定 E 的类型参数;对于上限为 E,java.lang.Object 的类型变量 E,不存在唯一最大实例 rn[INFO] 1 error rnrn但有时却可以编译通过。 rn比如把项目删除重新checkout以后, rn首次可以编译通过,再次编译以后将会报错。 rn请各位帮分析一下!rnrn问题补充:checkout只是.java源文件,POM文件是没有改变。 rnsource和target是没有问题的,否则会提示 rn"请使用 -source 5 或更高版本以启用泛型" rn最大的疑惑时“但有时却可以编译通过。 ”
Maven 编译 乱码 问题
maven 乱码 实在恶心,window 系统下没问题,linux 就不行rn rn 添加Maven运行环境变量rn 具体方法:[我的电脑]->右键,[属性]->[高级]->[环境变量]==> 添加一个环境变量: 变量名: MAVEN_OPTS ,变量值: -Xms256m -Xmx512m -Dfile.encoding=UTF-8 rn rn linux 系统到 /etc/profile  修改 MAVEN_OPTS =-Xms256m -Xmx512m -Dfile.encoding=UTF-8 问题补充 sw1982 写道 linux本身对中文支持就不行,svn在linux上面也是问题很大。r r 楼上那个配置可以解决根本问题???r 只是针对 maven 编译乱码 r linux 默认utf-8 编码
maven 编译的问题
最近一个项目需要用到maven构建~!rnrn但发现我的maven在编译的时候不认识 Integer i = 0;这样的写法rnrn也就是Integer 和 int 型直接赋值编译不通过。rnrn我的jdk 是 1.5版本的,直接jdk编译没问题rnrnmaven用的是2.0.4 最新版本,有人知道是怎么回事吗?rnrn还有一个问题maven 和 eclipse 集成的时候 M2_EPRO 这个变量怎么设置?
aspectj和maven编译问题
环境 eclipse、 jdk1.6、 aspectj(没有spring)、tomcat(jetty)rn情况是这样的:rn我在eclipse中新建maven的web项目,正常运行没有问题rn我在eclipse中新建aspect项目,正常运行也没有问题rn问题:rn我想在maven的web项目中使用aspect功能,并用junit测试,但是没有aop切入。rnrn我想请教大家在这样的项目中大家是怎么处理 aspect切入时用aop编译的问题的,难道非要把项目变为maven的web项目在同时变成aspect项目嘛?rnrn我使用maven的所谓“aspectj-maven”插件,没有效果。rn我看网上是这样用的,我照做没用:rnrn org.codehaus.mojorn aspectj-maven-pluginrn 1.4rn rn rn rn compilern test-compilern rn rn rn rn 1.6rn 1.6rn rn rnrn
关于maven编译的问题
我在执行maven compile的时候发生了一个很奇怪的问题,在src\main\java下的源代码中 写的spring的配置文件和ibatis的map文件都没有拷贝到target/classes 目录里去很不知道为什么。有哪位高手遇见过这样问题?
maven离线编译问题
今天拿到开发同事给的maven项目,fortify需要编译,但是发现没有网,于是让开发的同事跑了一个maven仓库,结果发现离线编译还是去互联网下载依赖,很纳闷,最后发现问题在这里: 表示此jar包是从LaniCorp这个私服上下载的,而此时我是连不上私服的(这些依赖是别人拷贝给我的)。所以会使用我配置的aliyun的maven镜像,遇到下载不了的jar包就报错了。 解决办法就是把这个...
maven打包编译问题
这段在公司实习期间,使用到maven打包编译java工程的场景使用。于是填了很多之间不懂的坑。首先在命令行中进入工程中pom.xml的目录中:然后进行下面的命令来操作 maven打包功能:mvn clean install dependency:copy-dependencies -DincludeScope=runtime -DoutputDirectory=target/lib这个命令会打包...
mybatis学习心得之编译问题
今天学习这个mybatis,几乎一直在碰到问题,寻找答案,对与新手而且自学的我来说,确实进展缓慢。说说具体问题吧,我是在项目中更换了jar包,接着出现了一大把莫名的问题,无法找到class文件,无法加载主类等等,头都大了,为此我还特意重新配置了JDK编译环境,都没有用,最后尝试着把编译配置中的多余jar包去掉,项目就运行正常了,注意不是在A图中操作jar包,要在B图位置删改jar包,比较不容易发现...
Maven编译中Mybatis变量引起的问题及处理
Mybatis的动态SQL无疑给Java开发者带来极大方便,其中用户读取变量值的符号有“#”和“”。而Maven配置文件(pom.xml)和Spring的配置文件中也是采用“”。 而Maven配置文件(pom.xml)和Spring的配置文件中也是采用“”读取变量值。我们在项目开发中,要是一个不小心,项目配置文件中的变量名称和pom.xml中的变量名重名了,那么在编译的过程中,则会对其进行替换,
Maven与Mybatis集成时的问题
Maven这东西,好是好,但是它有几个特性大家一定要注意,首先就是默认不会把java目录下的properties文件或者xml文件打包进去。这些东西只能放在resources里。 对一般的项目而言,只要注意一下就可以了。但是对于Mybatis而言,就有点麻烦。因为Mybatis的mapper是xml文件。提供两种解决方法。 第一种:在pom.xml的里加上下面的内容:
maven mybatis的插件generator问题
"C:\Program Files\Java\jdk1.7.0_80\bin\java" -Dmaven.multiModuleProjectDirectory=E:\IDEAPro\mmall -Dmaven.home=E:\jar\apache-maven-3.3.9 -Dclassworlds.conf=E:\jar\apache-maven-3.3.9\bin\m2.conf -Didea.launcher.port=7533 "-Didea.launcher.bin.path=D:\JetBrains\IntelliJ IDEA 15.0.6\bin" -Dfile.encoding=UTF-8 -classpath "E:\jar\apache-maven-3.3.9\boot\plexus-classworlds-2.5.2.jar;D:\JetBrains\IntelliJ IDEA 15.0.6\lib\idea_rt.jar" com.intellij.rt.execution.application.AppMain org.codehaus.classworlds.Launcher -Didea.version=15.0.6 org.mybatis.generator:mybatis-generator-maven-plugin:1.3.2:generatern[INFO] Scanning for projects...rn[WARNING] rn[WARNING] Some problems were encountered while building the effective model for com:mmall:war:1.0-SNAPSHOTrn[WARNING] 'build.plugins.plugin.version' for org.apache.maven.plugins:maven-compiler-plugin is missing. @ line 264, column 15rn[WARNING] rn[WARNING] It is highly recommended to fix these problems because they threaten the stability of your build.rn[WARNING] rn[WARNING] For this reason, future Maven versions might no longer support building such malformed projects.rn[WARNING] rn[INFO] rn[INFO] ------------------------------------------------------------------------rn[INFO] Building mmall Maven Webapp 1.0-SNAPSHOTrn[INFO] ------------------------------------------------------------------------rn[INFO] rn[INFO] --- mybatis-generator-maven-plugin:1.3.2:generate (default-cli) @ mmall ---rn[INFO] ------------------------------------------------------------------------rn[INFO] BUILD FAILURErn[INFO] ------------------------------------------------------------------------rn[INFO] Total time: 2.772 srn[INFO] Finished at: 2017-07-31T11:31:39+08:00rn[INFO] Final Memory: 7M/134Mrn[INFO] ------------------------------------------------------------------------rn[ERROR] Failed to execute goal org.mybatis.generator:mybatis-generator-maven-plugin:1.3.2:generate (default-cli) on project mmall: Execution default-cli of goal org.mybatis.generator:mybatis-generator-maven-plugin:1.3.2:generate failed: Cannot resolve classpath entry: /Users/mysql-connector-java-5.1.6.jar -> [Help 1]rn[ERROR] rn[ERROR] To see the full stack trace of the errors, re-run Maven with the -e switch.rn[ERROR] Re-run Maven using the -X switch to enable full debug logging.rn[ERROR] rn[ERROR] For more information about the errors and possible solutions, please read the following articles:rn[ERROR] [Help 1] http://cwiki.apache.org/confluence/display/MAVEN/PluginExecutionExceptionrnrnProcess finished with exit code 1rn[color=#FF0000]在运行插件的时候报这个错[/color]新手学习mybaits请大神帮帮忙rn[img=https://img-bbs.csdn.net/upload/201707/31/1501472279_967448.jpg][/img]
maven 建项目问题
这个是我建的maven项目rn[img=https://img-bbs.csdn.net/upload/201608/25/1472088522_914034.png][/img]rnrn这个是jedis的rn[img=https://img-bbs.csdn.net/upload/201608/25/1472088608_624712.png][/img]rnrn我建的里边少了一个mavne Dependencies ,这个要怎么才能显示?rnrn项目里边好像已经有了,就是没有显示rn[img=https://img-bbs.csdn.net/upload/201608/25/1472088701_935510.jpg][/img]
项目启动报错 maven问题
今天启动项目的时候,莫名其妙报了一个错误,明明昨天项目还是可以正常启动的,问题如下 问题比较明显,不能启动maven,maven最近还没有改变,配置是 maven配置的信息是一直这样的,那问题就是我d盘的maven文件的问题了,去看一下,发现它不见了,好吧,怪不得启动失败,在回收站找到了,不知道什么时候被我不小心删掉了,还原回来重新启动就成功了 提醒,回收站真的不要随便清,这样就...
maven 项目导入的问题
在导入 maven 项目时 pom.xml --> run as --> maven installrnrn出现下面问题!对maven 不太了解,是个新手rnrn[code="java"]rn[INFO] Scanning for projects...rn[INFO] ------------------------------------------------------------------------rn[INFO] Building Herbalife Maven Webapprn[INFO] rn[INFO] Id: com.herbalife.webapp:herbalife:war:1.0-SNAPSHOTrn[INFO] task-segment: [install]rn[INFO] ------------------------------------------------------------------------rn[INFO] [resources:resources]rn[INFO] Using default encoding to copy filtered resources.rnurl = http://repo1.maven.org/maven2rnDownloading: http://repo1.maven.org/maven2/opensymphony/xwork/2.0.4/xwork-2.0.4.pomrnurl = http://repo1.maven.org/maven2rnDownloading: http://repo1.maven.org/maven2/dojo/dojo/0.0/dojo-0.0.pomrnurl = http://repo1.maven.org/maven2rnDownloading: http://repo1.maven.org/maven2/fckeditor/fckeditor/2.3/fckeditor-2.3.pomrnurl = http://repo1.maven.org/maven2rnDownloading: http://repo1.maven.org/maven2/sqlserver/msbase/1.0/msbase-1.0.pomrnurl = http://repo1.maven.org/maven2rnDownloading: http://repo1.maven.org/maven2/sqlserver/mssqlserver/1.0/mssqlserver-1.0.pomrnurl = http://repo1.maven.org/maven2rnDownloading: http://repo1.maven.org/maven2/sqlserver/msutil/1.0/msutil-1.0.pomrnurl = http://repo1.maven.org/maven2rnDownloading: http://repo1.maven.org/maven2/opensymphony/jsonplugin/0[1].16-1.5/jsonplugin-0[1].16-1.5.pomrnurl = http://repo1.maven.org/maven2rnDownloading: http://repo1.maven.org/maven2/unitils/unitils/1.0-rc-1/unitils-1.0-rc-1.pomrnurl = http://repo1.maven.org/maven2rnDownloading: http://repo1.maven.org/maven2/opensymphony/xwork/2.0.4/xwork-2.0.4.jarrnurl = http://repo1.maven.org/maven2rnDownloading: http://repo1.maven.org/maven2/dojo/dojo/0.0/dojo-0.0.jarrnurl = http://repo1.maven.org/maven2rnDownloading: http://repo1.maven.org/maven2/fckeditor/fckeditor/2.3/fckeditor-2.3.jarrnurl = http://repo1.maven.org/maven2rnDownloading: http://repo1.maven.org/maven2/sqlserver/msbase/1.0/msbase-1.0.jarrnurl = http://repo1.maven.org/maven2rnDownloading: http://repo1.maven.org/maven2/sqlserver/mssqlserver/1.0/mssqlserver-1.0.jarrnurl = http://repo1.maven.org/maven2rnDownloading: http://repo1.maven.org/maven2/sqlserver/msutil/1.0/msutil-1.0.jarrnurl = http://repo1.maven.org/maven2rnDownloading: http://repo1.maven.org/maven2/opensymphony/jsonplugin/0[1].16-1.5/jsonplugin-0[1].16-1.5.jarrn[ERROR] rnrnTransitive dependency resolution for scope: compile has failed for your project.rnrnrnrnError message: Missing:rn----------rn1) opensymphony:xwork:jar:2.0.4rnrn Try downloading the file manually from the project website.rnrn Then, install it using the command: rn mvn install:install-file -DgroupId=opensymphony -DartifactId=xwork -Dversion=2.0.4 -Dpackaging=jar -Dfile=/path/to/filernrn Alternatively, if you host your own repository you can deploy the file there: rn mvn deploy:deploy-file -DgroupId=opensymphony -DartifactId=xwork -Dversion=2.0.4 -Dpackaging=jar -Dfile=/path/to/file -Durl=[url] -DrepositoryId=[id]rnrn Path to dependency: rn 1) com.herbalife.webapp:herbalife:war:1.0-SNAPSHOTrn 2) opensymphony:xwork:jar:2.0.4rnrn2) dojo:dojo:jar:0.0rnrn Try downloading the file manually from the project website.rnrn Then, install it using the command: rn mvn install:install-file -DgroupId=dojo -DartifactId=dojo -Dversion=0.0 -Dpackaging=jar -Dfile=/path/to/filernrn Alternatively, if you host your own repository you can deploy the file there: rn mvn deploy:deploy-file -DgroupId=dojo -DartifactId=dojo -Dversion=0.0 -Dpackaging=jar -Dfile=/path/to/file -Durl=[url] -DrepositoryId=[id]rnrn Path to dependency: rn 1) com.herbalife.webapp:herbalife:war:1.0-SNAPSHOTrn 2) dojo:dojo:jar:0.0rnrn3) fckeditor:fckeditor:jar:2.3rnrn Try downloading the file manually from the project website.rnrn Then, install it using the command: rn mvn install:install-file -DgroupId=fckeditor -DartifactId=fckeditor -Dversion=2.3 -Dpackaging=jar -Dfile=/path/to/filernrn Alternatively, if you host your own repository you can deploy the file there: rn mvn deploy:deploy-file -DgroupId=fckeditor -DartifactId=fckeditor -Dversion=2.3 -Dpackaging=jar -Dfile=/path/to/file -Durl=[url] -DrepositoryId=[id]rnrn Path to dependency: rn 1) com.herbalife.webapp:herbalife:war:1.0-SNAPSHOTrn 2) fckeditor:fckeditor:jar:2.3rnrn4) sqlserver:msbase:jar:1.0rnrn Try downloading the file manually from the project website.rnrn Then, install it using the command: rn mvn install:install-file -DgroupId=sqlserver -DartifactId=msbase -Dversion=1.0 -Dpackaging=jar -Dfile=/path/to/filernrn Alternatively, if you host your own repository you can deploy the file there: rn mvn deploy:deploy-file -DgroupId=sqlserver -DartifactId=msbase -Dversion=1.0 -Dpackaging=jar -Dfile=/path/to/file -Durl=[url] -DrepositoryId=[id]rnrn Path to dependency: rn 1) com.herbalife.webapp:herbalife:war:1.0-SNAPSHOTrn 2) sqlserver:msbase:jar:1.0rnrn5) sqlserver:mssqlserver:jar:1.0rnrn Try downloading the file manually from the project website.rnrn Then, install it using the command: rn mvn install:install-file -DgroupId=sqlserver -DartifactId=mssqlserver -Dversion=1.0 -Dpackaging=jar -Dfile=/path/to/filernrn Alternatively, if you host your own repository you can deploy the file there: rn mvn deploy:deploy-file -DgroupId=sqlserver -DartifactId=mssqlserver -Dversion=1.0 -Dpackaging=jar -Dfile=/path/to/file -Durl=[url] -DrepositoryId=[id]rnrn Path to dependency: rn 1) com.herbalife.webapp:herbalife:war:1.0-SNAPSHOTrn 2) sqlserver:mssqlserver:jar:1.0rnrn6) sqlserver:msutil:jar:1.0rnrn Try downloading the file manually from the project website.rnrn Then, install it using the command: rn mvn install:install-file -DgroupId=sqlserver -DartifactId=msutil -Dversion=1.0 -Dpackaging=jar -Dfile=/path/to/filernrn Alternatively, if you host your own repository you can deploy the file there: rn mvn deploy:deploy-file -DgroupId=sqlserver -DartifactId=msutil -Dversion=1.0 -Dpackaging=jar -Dfile=/path/to/file -Durl=[url] -DrepositoryId=[id]rnrn Path to dependency: rn 1) com.herbalife.webapp:herbalife:war:1.0-SNAPSHOTrn 2) sqlserver:msutil:jar:1.0rnrn7) opensymphony:jsonplugin:jar:0[1].16-1.5rnrn Try downloading the file manually from the project website.rnrn Then, install it using the command: rn mvn install:install-file -DgroupId=opensymphony -DartifactId=jsonplugin -Dversion=0[1].16-1.5 -Dpackaging=jar -Dfile=/path/to/filernrn Alternatively, if you host your own repository you can deploy the file there: rn mvn deploy:deploy-file -DgroupId=opensymphony -DartifactId=jsonplugin -Dversion=0[1].16-1.5 -Dpackaging=jar -Dfile=/path/to/file -Durl=[url] -DrepositoryId=[id]rnrn Path to dependency: rn 1) com.herbalife.webapp:herbalife:war:1.0-SNAPSHOTrn 2) opensymphony:jsonplugin:jar:0[1].16-1.5rnrn----------rn7 required artifacts are missing.rnrnfor artifact: rn com.herbalife.webapp:herbalife:war:1.0-SNAPSHOTrnrnfrom the specified remote repositories:rn central (http://repo1.maven.org/maven2)rnrnGroup-Id: com.herbalife.webapprnArtifact-Id: herbalifernVersion: 1.0-SNAPSHOTrnFrom file: D:\workspace\herbal-report\pom.xmlrnrnrnrnrn[INFO] ------------------------------------------------------------------------rn[INFO] For more information, run with the -e flagrn[INFO] ------------------------------------------------------------------------rn[INFO] BUILD FAILEDrn[INFO] ------------------------------------------------------------------------rn[INFO] Total time: 13 secondsrn[INFO] Finished at: Fri Nov 20 13:49:19 CST 2009rn[INFO] Final Memory: 2M/11Mrn[INFO] ------------------------------------------------------------------------rn[/code]rnrnn[b]问题补充:[/b]nD:\Downloads\xwork-2.0.4.jarrnrnrn默认下载到什么地方了!这么多jar 包要一个一个导吗?rnrnrn谢谢n[b]问题补充:[/b]n只剩下3 分了! :oops: rnrn没有人知道吗???n[b]问题补充:[/b]n请问? cwx714rnrn私服怎么建??rn我机子上的 repository 库算什么?rn有没有参照的例子?rn感激不尽!rn[img]http://dl.iteye.com/upload/attachment/171204/5b564360-105f-3cb7-96cb-4512a932b7e4.jpg[/img]rnn[b]问题补充:[/b]n建私服太麻烦了,用 mvn 命令创建项目时为什么能自动下载对应jar 包,而导入项目时为什么就下载出错?
Maven编译项目时跳过测试用例
有时候maven项目会出现测试用例编译时出现问题,但是我们又不想编译测试用例。一共有以下几种方法: 1. maven命令方式 -DskipTests,不执行测试用例,但编译测试用例类生成相应的class文件至target/test-classes下。 -Dmaven.test.skip=true,不执行测试用例,也不编译测试用例类。 2. idea插件命令 3.po...
maven编译项目时出错(1)
错误出处:Access restriction: The type 'FtpClient' is not API (restriction on required library 'C:\Program Files\Java\jdk1.8.0_101\jre\lib\rt.jar') 如图所示: 解决办法: (1)、确定 Java TM 是版本6 而不是版本7 (因为现在从官网在线安装java时
在Linux下安装Maven,编译Apache Eagle项目
编译调试过程花了好几天,要做好心理准备,编译一次可能要花几个小时,特别是加上-X参数输出debug会更慢,不带还快点,每次编译出问题,调完后都得再从头开始编译,不然可能也出其他与全部编译不同的错误。带-e参数也行,可以输出完整的错误信息,编译时长会短点。后面会快一些,但至少也得半个小时起步。 另外编译过程由于要下载很多文件,所以经常会卡在一个文件下载那,我是一般卡在一个文件下载的地方时,超过10...
Maven设置项目java默认编译版本
eclipse加载java项目时,默认会用1.5的版本去编译或者引进jdk版本,修改pom文件设置所需的版本。
怎么样在命令行中用maven编译自己的项目
我这里自己建了个maven 项目 下面是pom文件 4.0.0 com.imooc.webdemo webdemo war 0.0.1-SNAPSHOT webdemo Maven Webapp http://maven.apache.org junit junit 3.8.1 test javax.servlet javax.servlet-api 3.1.0 provided ...
Maven编译项目时报文件拒绝访问
打开相应文件的目录,右键打开文件属性,修改文件 勾选完成控制,保险点勾选所有权限 点确定,确定保存修改,再次编译,成功! 这个windows的权限坑真的很恶心。。。 ...
相关热词 c++和c#哪个就业率高 c# 批量动态创建控件 c# 模块和程序集的区别 c# gmap 截图 c# 验证码图片生成类 c# 再次尝试 连接失败 c#开发编写规范 c# 压缩图片好麻烦 c#计算数组中的平均值 c#获取路由参数