ubuntu 12.04 apt-get 安装报错

Ubuntu 12.04版 使用apt-get安装memcached的时候后面会报这样的错误

insserv: warning: script 'atd' missing LSB tags and overrides
insserv: Default-Start undefined, assuming empty start runlevel(s) for script atd'
insserv: Default-Stop undefined, assuming empty stop runlevel(s) for script
atd'
insserv: warning: script 'rsyslog' missing LSB tags and overrides
insserv: Default-Start undefined, assuming empty start runlevel(s) for script rsyslog'
insserv: Default-Stop undefined, assuming empty stop runlevel(s) for script
rsyslog'
insserv: warning: script 'ufw' missing LSB tags and overrides
insserv: Default-Start undefined, assuming empty start runlevel(s) for script ufw'
insserv: Default-Stop undefined, assuming empty stop runlevel(s) for script
ufw'
insserv: warning: script 'udevmonitor' missing LSB tags and overrides
insserv: Default-Start undefined, assuming empty start runlevel(s) for script udevmonitor'
insserv: Default-Stop undefined, assuming empty stop runlevel(s) for script
udevmonitor'
insserv: warning: script 'network-interface-container' missing LSB tags and overrides
insserv: Default-Start undefined, assuming empty start runlevel(s) for script network-interface-container'
insserv: Default-Stop undefined, assuming empty stop runlevel(s) for script
network-interface-container'
insserv: warning: script 'dmesg' missing LSB tags and overrides
insserv: Default-Start undefined, assuming empty start runlevel(s) for script dmesg'
insserv: Default-Stop undefined, assuming empty stop runlevel(s) for script
dmesg'
insserv: warning: script 'dbus' missing LSB tags and overrides
insserv: Default-Start undefined, assuming empty start runlevel(s) for script dbus'
insserv: Default-Stop undefined, assuming empty stop runlevel(s) for script
dbus'
insserv: warning: script 'resolvconf' missing LSB tags and overrides
insserv: Default-Start undefined, assuming empty start runlevel(s) for script resolvconf'
insserv: Default-Stop undefined, assuming empty stop runlevel(s) for script
resolvconf'
insserv: warning: script 'udev' missing LSB tags and overrides
insserv: Default-Start undefined, assuming empty start runlevel(s) for script udev'
insserv: Default-Stop undefined, assuming empty stop runlevel(s) for script
udev'
insserv: warning: script 'passwd' missing LSB tags and overrides
insserv: Default-Start undefined, assuming empty start runlevel(s) for script passwd'
insserv: Default-Stop undefined, assuming empty stop runlevel(s) for script
passwd'
insserv: warning: script 'udev-finish' missing LSB tags and overrides
insserv: Default-Start undefined, assuming empty start runlevel(s) for script udev-finish'
insserv: Default-Stop undefined, assuming empty stop runlevel(s) for script
udev-finish'
insserv: warning: script 'network-interface-security' missing LSB tags and overrides
insserv: Default-Start undefined, assuming empty start runlevel(s) for script network-interface-security'
insserv: Default-Stop undefined, assuming empty stop runlevel(s) for script
network-interface-security'
insserv: warning: script 'hostname' missing LSB tags and overrides
insserv: Default-Start undefined, assuming empty start runlevel(s) for script hostname'
insserv: Default-Stop undefined, assuming empty stop runlevel(s) for script
hostname'
insserv: warning: script 'module-init-tools' missing LSB tags and overrides
insserv: Default-Start undefined, assuming empty start runlevel(s) for script module-init-tools'
insserv: Default-Stop undefined, assuming empty stop runlevel(s) for script
module-init-tools'
insserv: warning: script 'cron' missing LSB tags and overrides
insserv: Default-Start undefined, assuming empty start runlevel(s) for script cron'
insserv: Default-Stop undefined, assuming empty stop runlevel(s) for script
cron'
insserv: warning: script 'setvtrgb' missing LSB tags and overrides
insserv: Default-Start undefined, assuming empty start runlevel(s) for script setvtrgb'
insserv: Default-Stop undefined, assuming empty stop runlevel(s) for script
setvtrgb'
insserv: warning: script 'udevtrigger' missing LSB tags and overrides
insserv: Default-Start undefined, assuming empty start runlevel(s) for script udevtrigger'
insserv: Default-Stop undefined, assuming empty stop runlevel(s) for script
udevtrigger'
insserv: warning: script 'procps' missing LSB tags and overrides
insserv: Default-Start undefined, assuming empty start runlevel(s) for script procps'
insserv: Default-Stop undefined, assuming empty stop runlevel(s) for script
procps'
insserv: warning: script 'irqbalance' missing LSB tags and overrides
insserv: Default-Start undefined, assuming empty start runlevel(s) for script irqbalance'
insserv: Default-Stop undefined, assuming empty stop runlevel(s) for script
irqbalance'
insserv: warning: script 'friendly-recovery' missing LSB tags and overrides
insserv: Default-Start undefined, assuming empty start runlevel(s) for script friendly-recovery'
insserv: Default-Stop undefined, assuming empty stop runlevel(s) for script
friendly-recovery'
insserv: warning: script 'network-interface' missing LSB tags and overrides
insserv: Default-Start undefined, assuming empty start runlevel(s) for script network-interface'
insserv: Default-Stop undefined, assuming empty stop runlevel(s) for script
network-interface'
insserv: warning: script 'hwclock-save' missing LSB tags and overrides
insserv: Default-Start undefined, assuming empty start runlevel(s) for script hwclock-save'
insserv: Default-Stop undefined, assuming empty stop runlevel(s) for script
hwclock-save'
insserv: warning: script 'hwclock' missing LSB tags and overrides
insserv: Default-Start undefined, assuming empty start runlevel(s) for script hwclock'
insserv: Default-Stop undefined, assuming empty stop runlevel(s) for script
hwclock'
insserv: warning: script 'console-setup' missing LSB tags and overrides
insserv: Default-Start undefined, assuming empty start runlevel(s) for script console-setup'
insserv: Default-Stop undefined, assuming empty stop runlevel(s) for script
console-setup'
insserv: warning: script 'udev-fallback-graphics' missing LSB tags and overrides
insserv: Default-Start undefined, assuming empty start runlevel(s) for script udev-fallback-graphics'
insserv: Default-Stop undefined, assuming empty stop runlevel(s) for script
udev-fallback-graphics'

请牛人解答

1个回答

Csdn user default icon
上传中...
上传图片
插入图片
抄袭、复制答案,以达到刷声望分或其他目的的行为,在CSDN问答是严格禁止的,一经发现立刻封号。是时候展现真正的技术了!
其他相关推荐
在win10子系统ubuntu18.04下安装mysql5.7尝试重新启动的时候出现以下报错
在win10子系统ubuntu18.04下安装mysql5.7尝试重新启动的时候出现以下报错 1.安装mysql-server ``` root@PC-5200:/home/tom# apt-get -y install mysql-server ``` ``` Reading package lists... Done Building dependency tree Reading state information... Done The following package was automatically installed and is no longer required: libfreetype6 Use 'apt autoremove' to remove it. The following additional packages will be installed: libaio1 libcgi-fast-perl libcgi-pm-perl libencode-locale-perl libevent-core-2.1-6 libfcgi-perl libhtml-parser-perl libhtml-tagset-perl libhtml-template-perl libhttp-date-perl libhttp-message-perl libio-html-perl liblwp-mediatypes-perl libssl1.1 libtimedate-perl liburi-perl mysql-client-5.7 mysql-client-core-5.7 mysql-common mysql-server-5.7 mysql-server-core-5.7 Suggested packages: libdata-dump-perl libipc-sharedcache-perl libwww-perl mailx tinyca The following NEW packages will be installed: libaio1 libcgi-fast-perl libcgi-pm-perl libencode-locale-perl libevent-core-2.1-6 libfcgi-perl libhtml-parser-perl libhtml-tagset-perl libhtml-template-perl libhttp-date-perl libhttp-message-perl libio-html-perl liblwp-mediatypes-perl libtimedate-perl liburi-perl mysql-client-5.7 mysql-client-core-5.7 mysql-common mysql-server mysql-server-5.7 mysql-server-core-5.7 The following packages will be upgraded: libssl1.1 1 upgraded, 21 newly installed, 0 to remove and 136 not upgraded. Need to get 21.0 MB of archives. After this operation, 157 MB of additional disk space will be used. Get:1 http://mirrors.aliyun.com/ubuntu bionic/main amd64 mysql-common all 5.8+1.0.4 [7308 B] Get:2 http://mirrors.aliyun.com/ubuntu bionic-updates/main amd64 libaio1 amd64 0.3.110-5ubuntu0.1 [6476 B] Get:3 http://mirrors.aliyun.com/ubuntu bionic-security/main amd64 libssl1.1 amd64 1.1.1-1ubuntu2.1~18.04.5 [1300 kB] Get:4 http://mirrors.aliyun.com/ubuntu bionic-security/main amd64 mysql-client-core-5.7 amd64 5.7.28-0ubuntu0.18.04.4 [6644 kB] Get:5 http://mirrors.aliyun.com/ubuntu bionic-security/main amd64 mysql-client-5.7 amd64 5.7.28-0ubuntu0.18.04.4 [1943 kB] Get:6 http://mirrors.aliyun.com/ubuntu bionic-security/main amd64 mysql-server-core-5.7 amd64 5.7.28-0ubuntu0.18.04.4 [7432 kB] Get:7 http://mirrors.aliyun.com/ubuntu bionic/main amd64 libevent-core-2.1-6 amd64 2.1.8-stable-4build1 [85.9 kB] Get:8 http://mirrors.aliyun.com/ubuntu bionic-security/main amd64 mysql-server-5.7 amd64 5.7.28-0ubuntu0.18.04.4 [2932 kB] Get:9 http://mirrors.aliyun.com/ubuntu bionic/main amd64 libhtml-tagset-perl all 3.20-3 [12.1 kB] Get:10 http://mirrors.aliyun.com/ubuntu bionic/main amd64 liburi-perl all 1.73-1 [77.2 kB] Get:11 http://mirrors.aliyun.com/ubuntu bionic/main amd64 libhtml-parser-perl amd64 3.72-3build1 [85.9 kB] Get:12 http://mirrors.aliyun.com/ubuntu bionic/main amd64 libcgi-pm-perl all 4.38-1 [185 kB] Get:13 http://mirrors.aliyun.com/ubuntu bionic/main amd64 libfcgi-perl amd64 0.78-2build1 [32.8 kB] Get:14 http://mirrors.aliyun.com/ubuntu bionic/main amd64 libcgi-fast-perl all 1:2.13-1 [9940 B] Get:15 http://mirrors.aliyun.com/ubuntu bionic/main amd64 libencode-locale-perl all 1.05-1 [12.3 kB] Get:16 http://mirrors.aliyun.com/ubuntu bionic/main amd64 libhtml-template-perl all 2.97-1 [59.0 kB] Get:17 http://mirrors.aliyun.com/ubuntu bionic/main amd64 libtimedate-perl all 2.3000-2 [37.5 kB] Get:18 http://mirrors.aliyun.com/ubuntu bionic/main amd64 libhttp-date-perl all 6.02-1 [10.4 kB] Get:19 http://mirrors.aliyun.com/ubuntu bionic/main amd64 libio-html-perl all 1.001-1 [14.9 kB] Get:20 http://mirrors.aliyun.com/ubuntu bionic/main amd64 liblwp-mediatypes-perl all 6.02-1 [21.7 kB] Get:21 http://mirrors.aliyun.com/ubuntu bionic/main amd64 libhttp-message-perl all 6.14-1 [72.1 kB] Get:22 http://mirrors.aliyun.com/ubuntu bionic-security/main amd64 mysql-server all 5.7.28-0ubuntu0.18.04.4 [9940 B] Fetched 21.0 MB in 9s (2376 kB/s) Preconfiguring packages ... Selecting previously unselected package mysql-common. (Reading database ... 28663 files and directories currently installed.) Preparing to unpack .../0-mysql-common_5.8+1.0.4_all.deb ... Unpacking mysql-common (5.8+1.0.4) ... Selecting previously unselected package libaio1:amd64. Preparing to unpack .../1-libaio1_0.3.110-5ubuntu0.1_amd64.deb ... Unpacking libaio1:amd64 (0.3.110-5ubuntu0.1) ... Preparing to unpack .../2-libssl1.1_1.1.1-1ubuntu2.1~18.04.5_amd64.deb ... Unpacking libssl1.1:amd64 (1.1.1-1ubuntu2.1~18.04.5) over (1.1.0g-2ubuntu4.3) ... Selecting previously unselected package mysql-client-core-5.7. Preparing to unpack .../3-mysql-client-core-5.7_5.7.28-0ubuntu0.18.04.4_amd64.deb ... Unpacking mysql-client-core-5.7 (5.7.28-0ubuntu0.18.04.4) ... Selecting previously unselected package mysql-client-5.7. Preparing to unpack .../4-mysql-client-5.7_5.7.28-0ubuntu0.18.04.4_amd64.deb ... Unpacking mysql-client-5.7 (5.7.28-0ubuntu0.18.04.4) ... Selecting previously unselected package mysql-server-core-5.7. Preparing to unpack .../5-mysql-server-core-5.7_5.7.28-0ubuntu0.18.04.4_amd64.deb ... Unpacking mysql-server-core-5.7 (5.7.28-0ubuntu0.18.04.4) ... Selecting previously unselected package libevent-core-2.1-6:amd64. Preparing to unpack .../6-libevent-core-2.1-6_2.1.8-stable-4build1_amd64.deb ... Unpacking libevent-core-2.1-6:amd64 (2.1.8-stable-4build1) ... Setting up mysql-common (5.8+1.0.4) ... update-alternatives: using /etc/mysql/my.cnf.fallback to provide /etc/mysql/my.cnf (my.cnf) in auto mode Selecting previously unselected package mysql-server-5.7. (Reading database ... 28832 files and directories currently installed.) Preparing to unpack .../00-mysql-server-5.7_5.7.28-0ubuntu0.18.04.4_amd64.deb ... Unpacking mysql-server-5.7 (5.7.28-0ubuntu0.18.04.4) ... Selecting previously unselected package libhtml-tagset-perl. Preparing to unpack .../01-libhtml-tagset-perl_3.20-3_all.deb ... Unpacking libhtml-tagset-perl (3.20-3) ... Selecting previously unselected package liburi-perl. Preparing to unpack .../02-liburi-perl_1.73-1_all.deb ... Unpacking liburi-perl (1.73-1) ... Selecting previously unselected package libhtml-parser-perl. Preparing to unpack .../03-libhtml-parser-perl_3.72-3build1_amd64.deb ... Unpacking libhtml-parser-perl (3.72-3build1) ... Selecting previously unselected package libcgi-pm-perl. Preparing to unpack .../04-libcgi-pm-perl_4.38-1_all.deb ... Unpacking libcgi-pm-perl (4.38-1) ... Selecting previously unselected package libfcgi-perl. Preparing to unpack .../05-libfcgi-perl_0.78-2build1_amd64.deb ... Unpacking libfcgi-perl (0.78-2build1) ... Selecting previously unselected package libcgi-fast-perl. Preparing to unpack .../06-libcgi-fast-perl_1%3a2.13-1_all.deb ... Unpacking libcgi-fast-perl (1:2.13-1) ... Selecting previously unselected package libencode-locale-perl. Preparing to unpack .../07-libencode-locale-perl_1.05-1_all.deb ... Unpacking libencode-locale-perl (1.05-1) ... Selecting previously unselected package libhtml-template-perl. Preparing to unpack .../08-libhtml-template-perl_2.97-1_all.deb ... Unpacking libhtml-template-perl (2.97-1) ... Selecting previously unselected package libtimedate-perl. Preparing to unpack .../09-libtimedate-perl_2.3000-2_all.deb ... Unpacking libtimedate-perl (2.3000-2) ... Selecting previously unselected package libhttp-date-perl. Preparing to unpack .../10-libhttp-date-perl_6.02-1_all.deb ... Unpacking libhttp-date-perl (6.02-1) ... Selecting previously unselected package libio-html-perl. Preparing to unpack .../11-libio-html-perl_1.001-1_all.deb ... Unpacking libio-html-perl (1.001-1) ... Selecting previously unselected package liblwp-mediatypes-perl. Preparing to unpack .../12-liblwp-mediatypes-perl_6.02-1_all.deb ... Unpacking liblwp-mediatypes-perl (6.02-1) ... Selecting previously unselected package libhttp-message-perl. Preparing to unpack .../13-libhttp-message-perl_6.14-1_all.deb ... Unpacking libhttp-message-perl (6.14-1) ... Selecting previously unselected package mysql-server. Preparing to unpack .../14-mysql-server_5.7.28-0ubuntu0.18.04.4_all.deb ... Unpacking mysql-server (5.7.28-0ubuntu0.18.04.4) ... Setting up libhtml-tagset-perl (3.20-3) ... Setting up libevent-core-2.1-6:amd64 (2.1.8-stable-4build1) ... Processing triggers for ureadahead (0.100.0-21) ... Setting up libencode-locale-perl (1.05-1) ... Setting up libtimedate-perl (2.3000-2) ... Setting up libio-html-perl (1.001-1) ... Setting up liblwp-mediatypes-perl (6.02-1) ... Processing triggers for libc-bin (2.27-3ubuntu1) ... Setting up libaio1:amd64 (0.3.110-5ubuntu0.1) ... Setting up liburi-perl (1.73-1) ... Setting up libssl1.1:amd64 (1.1.1-1ubuntu2.1~18.04.5) ... Checking for services that may need to be restarted...done. Checking for services that may need to be restarted...done. Checking init scripts... Restarting services possibly affected by the upgrade: invoke-rc.d: could not determine current runlevel Services restarted successfully. Processing triggers for systemd (237-3ubuntu10.21) ... Setting up libhtml-parser-perl (3.72-3build1) ... Setting up libcgi-pm-perl (4.38-1) ... Processing triggers for man-db (2.8.3-2ubuntu0.1) ... Setting up mysql-client-core-5.7 (5.7.28-0ubuntu0.18.04.4) ... Setting up libfcgi-perl (0.78-2build1) ... Setting up libhttp-date-perl (6.02-1) ... Setting up libhtml-template-perl (2.97-1) ... Setting up mysql-server-core-5.7 (5.7.28-0ubuntu0.18.04.4) ... Setting up libcgi-fast-perl (1:2.13-1) ... Setting up libhttp-message-perl (6.14-1) ... Setting up mysql-client-5.7 (5.7.28-0ubuntu0.18.04.4) ... Setting up mysql-server-5.7 (5.7.28-0ubuntu0.18.04.4) ... invoke-rc.d: could not determine current runlevel * Stopping MySQL database server mysqld [ OK ] update-alternatives: using /etc/mysql/mysql.cnf to provide /etc/mysql/my.cnf (my.cnf) in auto mode Renaming removed key_buffer and myisam-recover options (if present) Cannot open /proc/net/unix: No such file or directory Cannot stat file /proc/1/fd/5: Operation not permitted Cannot stat file /proc/1/fd/10: Operation not permitted Cannot stat file /proc/1/fd/6: Operation not permitted Cannot stat file /proc/7/fd/7: Operation not permitted Cannot stat file /proc/7/fd/10: Operation not permitted Cannot stat file /proc/7/fd/5: Operation not permitted Created symlink /etc/systemd/system/multi-user.target.wants/mysql.service → /lib/systemd/system/mysql.service. invoke-rc.d: could not determine current runlevel Setting up mysql-server (5.7.28-0ubuntu0.18.04.4) ... Processing triggers for libc-bin (2.27-3ubuntu1) ... Processing triggers for ureadahead (0.100.0-21) ... Processing triggers for systemd (237-3ubuntu10.21) ... ``` 2.启动mysql服务 ``` root@PC-5200:/home/tom# systemctl start mysql.service ``` 3.出现如下报错 ``` System has not been booted with systemd as init system (PID 1). Can't operate. ```
Ubuntu12.04上安装MySQL Server提示mysql-server : Depends:
``` yyyyzh@yzh:~$ sudo apt-get install mysql-server Reading package lists... Done Building dependency tree Reading state information... Done mysql-server : Depends: mysql-community-server (= 8.0.18-1ubuntu16.04) but it is not going to be installed E: Unmet dependencies. Try 'apt-get -f install' with no packages (or specify a solution). ```
ubuntu 12.04 LTS 版在执行apt-get命令时报错
![图片说明](https://img-ask.csdn.net/upload/201703/01/1488372542_357853.png) 我是在VMware9.0虚拟机上装的Ubuntu操作系统
Ubuntu apt-get autoremove 报错
在终端 apt-get autoremove 时报错如下 Reading package lists... Done Building dependency tree Reading state information... Done 0 to upgrade, 0 to newly install, 0 to remove and 400 not to upgrade. 1 not fully installed or removed. After this operation, 0 B of additional disk space will be used. Setting up compizconfig-settings-manager (1:0.9.12.2+16.04.20160823-0ubuntu1) ... Traceback (most recent call last): File "/usr/bin/pycompile", line 35, in <module> from debpython.version import SUPPORTED, debsorted, vrepr, \ File "/usr/share/python/debpython/version.py", line 24, in <module> from ConfigParser import SafeConfigParser ImportError: No module named 'ConfigParser' dpkg: error processing package compizconfig-settings-manager (--configure): subprocess installed post-installation script returned error exit status 1 Errors were encountered while processing: compizconfig-settings-manager E: Sub-process /usr/bin/dpkg returned an error code (1) 网上说是因为Python2升级到Python3以后,ConfigParse就变成了configparse,把名字改回configparse就可以了,具体该怎么改呢? 高人指点,多谢了!
Ubuntu19.04 安装 libpng12-0 出错
在安装xfce桌面时,出现缺少依赖问题. ``` yh@yh-virtual-machine:~$ sudo apt install xfce4 正在读取软件包列表... 完成 正在分析软件包的依赖关系树 正在读取状态信息... 完成 xfce4 已经是最新版 (4.12.2)。 您也许需要运行“apt --fix-broken install”来修正上面的错误。 下列软件包有未满足的依赖关系: tumbler : 依赖: libpng12-0 (>= 1.2.13-4) 但是它将不会被安装 E: 有未能满足的依赖关系。请尝试不指明软件包的名字来运行“apt --fix-broken install”(也可以指定一个解决办法)。 ``` 然而当我尝试安装这个包时。。。 ``` yh@yh-virtual-machine:~$ sudo apt-get install libpng12-0 正在读取软件包列表... 完成 正在分析软件包的依赖关系树 正在读取状态信息... 完成 下列【新】软件包将被安装: libpng12-0 升级了 0 个软件包,新安装了 1 个软件包,要卸载 0 个软件包,有 3 个软件包未被升级。 有 4 个软件包没有被完全安装或卸载。 需要下载 0 B/116 kB 的归档。 解压缩后会消耗 285 kB 的额外空间。 (正在读取数据库 ... 系统当前共安装有 156022 个文件和目录。) 准备解压 .../libpng12-0_1.2.54-1ubuntu1.1_amd64.deb ... 正在解压 libpng12-0:amd64 (1.2.54-1ubuntu1.1) ... dpkg: 处理归档 /var/cache/apt/archives/libpng12-0_1.2.54-1ubuntu1.1_amd64.deb (--unpack)时出错: 无法安装 /lib/x86_64-linux-gnu/libpng12.so.0 的新版本: 没有那个文件或目录 错误信息显示本地系统有一些问题,因此没有写入 apport 报告 在处理时有错误发生: /var/cache/apt/archives/libpng12-0_1.2.54-1ubuntu1.1_amd64.deb E: Sub-process /usr/bin/dpkg returned an error code (1) ``` 有没有大佬提示一下,如何解决这个问题
ubuntu 16.04 安装 phpmyadmin 后打开空白
使用 VMware 安装的 ubuntu 16.04 apache 版本是: Server version: Apache/2.4.18 (Ubuntu) Server built: 2016-04-15T18:00:57 php 版本是: PHP 7.0.4-7ubuntu2.1 (cli) ( NTS ) Copyright (c) 1997-2016 The PHP Group Zend Engine v3.0.0, Copyright (c) 1998-2016 Zend Technologies with Zend OPcache v7.0.6-dev, Copyright (c) 1999-2016, by Zend Technologies mysql 版本是: +-----------------+ | version() | +-----------------+ | 5.7.12-0ubuntu1 | +-----------------+ 1 row in set (0.04 sec) 然后使用 apt-get 安装了 phpmyadmin ln -s /usr/share/phpmyadmin /var/www/html 之后在地址栏输入 IP + /phpmyadmin 后提示没有安装 mbstring ,但标签栏的图标已经是 phpmyadmin 的图标了 但安装了 mbstring 后再输入 IP + /phpmyadmin 后就空白了,而且标签栏的 phpmyadmin 图片也没有了。 求帮助~这里先谢谢大家了。 我又重新使用虚拟了一个 ubuntu 14.04.4 就可以用了。 是不是因为 ubuntu 16.04 里面的 php7.0 默认没有 mysql 只有 mysqli 的原因。 如果是那样的话。php7.0 如何添加上 mysql ?
ubuntu12.04下装个软件,提示没有libSM.so.6库
ubuntu12.04下装个软件,提示没有libSM.so.6库,我查看依赖库,提示如下: libSM.so.6 => not found libICE.so.6 => not found libXrender.so.1 => not found libfontconfig.so.1 => not found libfreetype.so.6 => not found libXext.so.6 => not found libX11.so.6 => not found 可是我用sudo apt-get install libSM.so.6安装不成功,请问应该怎么解决,谢谢。
linux火狐设置代理后可以上外网,但是ping不同外网,apt-get不能获取软件包啊!!
用的是ubuntu12.04,火狐设置代理后可以上外网,但是ping不同外网,apt-get不能获取软件包啊!!
虚拟机ubuntu apt-get update/install软件无法连接到指定源
虚拟机系统版本:ubuntu 12.04 问题详情:虚拟机采用桥接模式联网,浏览器上网正常,终端里能ping通指定的软件源, 但是每次采用sudo apt-get update/install软件时,就会一直提示”%0等待报头“, 按照网上的帖子进行换源试过了,删除/var/cache/apt/archives/下的文件也试了,结果还是一个样,正在等待报头,或者忽略 http://mirrors.163.com precise InRelease 连接失败[”网易的IP"] 急求指教
Ubuntu apt安装图形界面
Ubuntu用apt-get install ubuntu-desktop安装图形界面,文件下载好了,安装过程中突然停电。再次安装总是从上次安装的地方开始。想问下怎么重新下载安装,或是正确安装(我执行过apt-get clean命令) 以下是断电后再次安装时的信息: Reading package lists... Building dependency tree... Reading state information... ubuntu-desktop is already the newest version. The following packages will be upgraded: ubuntu-docs 1 upgraded, 0 newly installed, 0 to remove and 0 not upgraded. 1 not fully installed or removed. Need to get 0 B/1452 kB of archives. After this operation, 37.0 MB of additional disk space will be used. (Reading database ... dpkg: warning: files list file for package `ubuntu-docs' missing, assuming package has no files currently installed. (Reading database ... 5% (Reading database ... 10% (Reading database ... 15% (Reading database ... 20% (Reading database ... 25% (Reading database ... 30% (Reading database ... 35% (Reading database ... 40% (Reading database ... 45% (Reading database ... 50% (Reading database ... 55% (Reading database ... 60% (Reading database ... 65% (Reading database ... 70% (Reading database ... 75% (Reading database ... 80% (Reading database ... 85% (Reading database ... 90% (Reading database ... 95% (Reading database ... 100% (Reading database ... 116252 files and directories currently installed.) Preparing to replace ubuntu-docs 12.04.4 (using .../ubuntu-docs_12.04.4_all.deb) ... Unpacking replacement ubuntu-docs ... dpkg: error processing /var/cache/apt/archives/ubuntu-docs_12.04.4_all.deb (--unpack): symbolic link '/usr/share/help/ast/ubuntu-help/a11y-locate-pointer.page' size has changed from 63 to 0 Errors were encountered while processing: /var/cache/apt/archives/ubuntu-docs_12.04.4_all.deb
ubuntu安装nginx进行到进入nginx-1.8.1的目录执行sudo ./make的时候报错:sudo: ./make:找不到命令
环境:ubuntu虚拟机16.04 问题:在网上找了一个FASTDFS的安装教程,链接是https://blog.csdn.net/michael_xwb/article/details/90267890 前面几步进行得都没有问题,但是到了安装Nginx + fastdfs-nginx-module时出现了问题,行到进入nginx-1.8.1的目录执行sudo ./make的时候报错:sudo: ./make:找不到命令 ![图片说明](https://img-ask.csdn.net/upload/201910/12/1570845361_573257.png) 他文章里要求的前置组件 ``` sudo apt-get install zlib1g-dev sudo apt-get install libpcre3 libpcre3-dev sudo apt-get install openssl libssl-dev ``` 这些我都安装了,但是依然没有成功,后面的步骤我一直没进行,在nginx1.8.1下也找不到make文件 ![图片说明](https://img-ask.csdn.net/upload/201910/12/1570845687_926181.png) 后来我又试了试nginx1.12.1版本,也是同样的问题,依旧是找不到make命令。 请问一下有没有大手子知道是怎么回事的?万分感谢!
ubuntu安装PIL时安装不成功
我的ubuntu12.04,python是2.7的, 要安装PIL库 当我用 sudo pip install pil安装时,错误提示: Could not find any downloads that satisfy the requirement pil Some externally hosted files were ignored (use --allow-external pil to allow). 当用sudo apt-get install python-imaging可以安装成功,但是运行程序的时候有错误提示: The _imaging C module is not installed 请问这两种安装的方法有什么区别吗?请问如何可以使第一种方法安装成功?恳请各位大师指点,谢谢.
ubuntu下Anaconda下好了但是无法启动Spyder
Anaconda加入了环境变量了, 我用conda list看了是存在一个spyder的。 vim修改好了程序也能运行 但是终端下试图运行spyder都报错,看信息是缺了东西?但是我下载Anaconda的时候都没有改动原来的设定。 > Traceback (most recent call last): > File "/root/anaconda2/bin/spyder", line 6, in <module> > sys.exit(spyder.app.start.main()) > File "/root/anaconda2/lib/python2.7/site-packages/spyder/app/start.py", line 103, in main > from spyder.app import mainwindow > File "/root/anaconda2/lib/python2.7/site-packages/spyder/app/mainwindow.py", line 78, in <module> > from qtpy.compat import from_qvariant > File "/root/anaconda2/lib/python2.7/site-packages/qtpy/compat.py", line 15, in <module> > from .QtWidgets import QFileDialog > File "/root/anaconda2/lib/python2.7/site-packages/qtpy/QtWidgets.py", line 22, in <module> > from PyQt5.QtWidgets import * > ImportError: libGL.so.1: cannot open shared object file: No such file or directory 可转支付宝,谢谢! 更新: =20170507= ![Anaconda版本](https://img-ask.csdn.net/upload/201705/07/1494137456_673954.png) 谢谢大家看来我是缺了很多东西。 现在 * pygt 更新 4.3.14-py27_0 --> 4.3.17-py27_0 * libgl1-mesa-dev下载了最新版本12.0.6-0ubuntu0.16.04.1) * 再spyder也是报错信息变为 > This application failed to start because it could not find or load the Qt platform plugin "xcb" > in "". > Available platform plugins are: minimal, offscreen, xcb. > Reinstalling the application may fix this problem. 此外 再度apt-get install libgl1-mesa-dev或者apt-get install "^libxcb.*" libx11-xcb-dev libglu1-mesa-dev libxrender-dev 除了说已经安装最新,它会提示我有2个没用的可以卸载 > The following packages were automatically installed and are no longer required: > linux-headers-4.4.0-31 linux-headers-4.4.0-31-generic linux-image-4.4.0-31-generic > linux-image-extra-4.4.0-31-generic > Use 'apt autoremove' to remove them. 不过我没敢动。多余的应该不影响?
乌班兔更新之后安装仍“找不到包”
我刚下载了Ubuntu12.04.5, 看到很多网页上面说要先sudo apt-get update才能install,我这样试过了,在sudo apt-get update之后终端结果为下图所示(我觉得一定是这里的问题,因为并没有404、file fail to download等等的错误),然后再输入sudo apt-get install XXX之后还是unable to locate package。请各位大神帮忙解决一下,小女子不胜感激~~![图片说明](https://img-ask.csdn.net/upload/201510/25/1445717390_895885.png)
Ubuntu15.04搭建tftp服务器,环测transfer time out 问题,亟待解决!
用的虚拟机是VMware workstation 12,Ubuntu用的是15.04 软件安装 sudo apt-get install tftp-hpa tftpd-hpa xinetd 配置文件/etc/xinetd.d/tftp没有,自己创建的写的是 ![图片说明](https://img-ask.csdn.net/upload/201511/24/1448380639_284588.png) 配置完重启,/etc/init.d/tftpd-hpa restart /etc/init.d/xinetd restart 根目录下创建一个tftpboot文件夹 chmod 777 /tftpboot -R 在tftpboot下touch key文件,文件写上1234567890 然后使用回环测试 tftp 127.0.0.1或者tftp localhost 完美进入 tftp>界面 我很高兴啊! 就get key 然后就 transfer time out !欲哭无泪 然后找问题 配置/etc/selinux/config ,也没有文件 自己创建的,而且还不懂啥意思照做了 ![图片说明](https://img-ask.csdn.net/upload/201511/25/1448381412_89560.png) 仍然不可以! 再找问题,配置了/etc/default/tftpd-hpa 文件 ![图片说明](https://img-ask.csdn.net/upload/201511/25/1448381577_245147.png) 不可以 使用ps -aux | grep tftpd-hpa/tftp-hpa/xinetd,结果如下 ![图片说明](https://img-ask.csdn.net/upload/201511/25/1448381856_170876.png) 使用aptitude show XXX查看 客户端和服务器的软件版本一致 使用/var/lib/tftpboot 创建key文件 看是不是配置错误使用默认目录, ufw disable关闭防火墙 方法都试过了 不行! 整了好长时间了 搞得自己都没气生了 ,求大家帮忙找问题啊!!!
checking battery state?
在虚拟机安装的ubuntu12.04,不知道怎么回事,开机进入checking battery state. 无法进入操作界面。看到网上的方法:sudo apt-get install gdm, sudo dpkg-reconfigure gdm之后选择lightgdm等,可是还是不可以。还有sudo rm /etc/X11/xorg.conf,这个文件 在这个版本都不存在。 求指教,怎么解决这个问题,怎么网上都说上面两个方法可以解决,我怎么不行啊??
挑战性的Docker问题:如何干净删除手动安装的docker - ce?
工作环境:Ubuntu 18.04.1 因为docker自动的源老出问题,所以就选择了手动安装,过程出奇的简单,具体步骤: 1. 下载 docker-18.03.1-ce.tgz 2. 解压 tar xzvf docker-18.03.1-ce.tgz 3. cp docker/* /usr/bin/ 4. sudo docker run hello-world 所有网上可以查到的验证方法都可以通过, ``` sudo docker -v Docker version 18.03.1-ce, build 9ee9f40 ``` 安装了一个lamp Container ``` # service docker status ● docker.service - docker static Loaded: loaded (/lib/systemd/system/docker.service; enabled; vendor preset: enabled) Active: active (running) since Thu 2018-12-13 16:25:07 CST; 33min ago Main PID: 14560 (dockerd) Tasks: 47 (limit: 4915) CGroup: /system.slice/docker.service ├─14560 /usr/bin/dockerd ├─14567 docker-containerd --config /var/run/docker/containerd/containerd.toml ├─14828 /usr/bin/docker-proxy -proto tcp -host-ip 0.0.0.0 -host-port 3307 -container-ip 172.17.0.2 -container-port 3306 ├─14840 /usr/bin/docker-proxy -proto tcp -host-ip 0.0.0.0 -host-port 81 -container-ip 172.17.0.2 -container-port 80 ├─14847 docker-containerd-shim -namespace moby -workdir /var/lib/docker/containerd/daemon/io.containerd.runtime.v1.linux/moby/886220dd45f02bf04d52f39d46af4dd5 ├─14864 /bin/bash ├─14995 /usr/sbin/apache2 -k start ├─15000 /usr/sbin/apache2 -k start ├─15001 /usr/sbin/apache2 -k start ├─15007 /usr/sbin/apache2 -k start ├─15008 /usr/sbin/apache2 -k start ├─15009 /usr/sbin/apache2 -k start ├─15010 /usr/sbin/apache2 -k start ├─15011 /usr/sbin/apache2 -k start ├─15012 /usr/sbin/apache2 -k start └─15013 /usr/sbin/apache2 -k start 12月 13 16:25:07 Dell dockerd[14560]: time="2018-12-13T16:25:07.246084925+08:00" level=warning msg="Your kernel does not support cgroup rt runtime" ``` docker ps -a; docker start lamp; docker stop lamp; 等命令都可以正常执行。 **但是这个安装无法正常卸载** ``` root@Dell:/home/work# apt-get remove docker docker-engine docker-ce docker.io 正在读取软件包列表... 完成 正在分析软件包的依赖关系树 正在读取状态信息... 完成 软件包 docker-engine 未安装,所以不会被卸载 软件包 docker-ce 未安装,所以不会被卸载 软件包 docker 未安装,所以不会被卸载 软件包 docker.io 未安装,所以不会被卸载 升级了 0 个软件包,新安装了 0 个软件包,要卸载 0 个软件包,有 211 个软件包未被升级。 ``` **不知在此是否可以找到答案?** 其他相关信息: ``` $ sudo find / -iname docker /usr/bin/docker /run/docker /var/lib/docker /etc/docker /sys/fs/cgroup/pids/docker /sys/fs/cgroup/cpuset/docker /sys/fs/cgroup/memory/docker /sys/fs/cgroup/freezer/docker /sys/fs/cgroup/perf_event/docker /sys/fs/cgroup/blkio/docker /sys/fs/cgroup/hugetlb/docker /sys/fs/cgroup/cpu,cpuacct/docker /sys/fs/cgroup/net_cls,net_prio/docker /sys/fs/cgroup/devices/docker /sys/fs/cgroup/systemd/docker $ sudo find / -iname docker.service /etc/systemd/system/multi-user.target.wants/docker.service /sys/fs/cgroup/pids/system.slice/docker.service /sys/fs/cgroup/devices/system.slice/docker.service /sys/fs/cgroup/systemd/system.slice/docker.service /sys/fs/cgroup/unified/system.slice/docker.service /lib/systemd/system/docker.service ```
ubuntu 利用virtualenv 搭建多python环境出错
最近在网上看到一个博客http://blog.chinaunix.net/uid-15174104-id-4020426.html,貌似挺不错的,就自己试试搭建一下比较干净的ubuntu多python环境,结果刚开始就崩了,查了很多的资料还是没有解决,这里求大神解答 我在ubuntu下装了一个ubuntu-12.04.3,打算试试您的python环境搭建,但是中间遇到了点问题 我手动安装的python3.3.3,官网下载的,解压到/opt下面,然后是 sudo ./config sudo make sudo make install 然后在/usr/local/bin下面添加了符号链接python3.3.3 然后就开始用您的方法配置多python环境,但是出现了一个问题,当我执行 python3.3.3 virtualenv.py /home/lchris/pyVE/python3.3.3时,报错没有zlib,然后我在网上查了很多的资料,最后选择sudo apt-get install zlib1g-dev 安装成功后,我又重新编译安装了python3.3.3,再次执行python3.3.3 virtualenv.py /home/lchris/pyVE/python3.3.3还是报没有zlib的错误。 然后又上网找资料,找到了个方法,就是dpkg,这次好不容易没有报错没有找到zlib,现在又报这个错了:Traceback (most recent call last): File "/home/lchris/下载/virtualenv-1.10.1/virtualenv.py", line 2308, in <module> main() File "/home/lchris/下载/virtualenv-1.10.1/virtualenv.py", line 821, in main symlink=options.symlink) File "/home/lchris/下载/virtualenv-1.10.1/virtualenv.py", line 956, in create_environment site_packages=site_packages, clear=clear, symlink=symlink)) File "/home/lchris/下载/virtualenv-1.10.1/virtualenv.py", line 1151, in install_python copy_required_modules(home_dir, symlink) File "/home/lchris/下载/virtualenv-1.10.1/virtualenv.py", line 1089, in copy_required_modules dst_filename = change_prefix(filename, dst_prefix) File "/home/lchris/下载/virtualenv-1.10.1/virtualenv.py", line 1054, in change_prefix (filename, prefixes) AssertionError: Filename /opt/Python-3.3.3/Lib/os.py does not start with any of these prefixes: ['/usr/local', '/usr/local'] 我就真的没有办法了,真心不知道怎么解决了,求大神解救
NS运行时遇到couldn't execute "nam": no such file or directory但nam已安装好的问题怎么解决?
我在Ubuntu16.04虚拟机上按照教程完全完成了NS2(2.35)的安装,但运行示例时就遇到了问题. ``` $ ns simple.tcl 210 0.0037499999999999999 running nam... ns: finish: couldn't execute "nam": no such file or directory while executing "exec nam out.nam &" (procedure "finish" line 8) invoked from within "finish" ``` 网上搜索解决办法是: 说法1--------------------------- ``` 先手动编译nam生成可执行文件nam 进入NS_HOME/nam-1.12(NS_HOME为安装ns2的路径)输入命令:make 结果显示错误: xwd.c:87:29: 错误: X11/Xmu/WinUtil.h:No such file or directory make: *** [xwd.o] 错误 1 问题是xmu没有安装,于是只好再装xmu, 命令为: sudo apt-get install libxmu-dev 然后在输入make进行编译,完成后在NS_HOME/nam-1.12/中可以发现可执行文件nam将其复制到 NS_HOME/bin/目录下,这样由于$PATH环境变量中有NS_HOME/bin项,nam就可以直接运行了。 ``` 说法2---------------------------- ``` 进入你自己的电脑所安装ns2的目录,然后进入/ns-allinone-2.35/nam-1.15目录 例如我安装在Documents目录下: cd /home/prowc/Documents/ns-allinone-2.35/nam-1.15 sudo make 执行了make后会生成一个名字为nam的可执行文件,然后在这个目录下执行命令 sudo cp nam /usr/local/bin 把nam这个可执行文件拷贝到/usr/local/bin目录下,然后应该就可以正常运行了。 ``` 但实际上,我在nam文件夹下输入命令:make 后,显示:make: 'nam' is up to date. 并且也没有生成名字为nam的可执行文件 怎么解决? (菜鸟第一次用,不知道是不是在这里提问?请谅解)
在中国程序员是青春饭吗?
今年,我也32了 ,为了不给大家误导,咨询了猎头、圈内好友,以及年过35岁的几位老程序员……舍了老脸去揭人家伤疤……希望能给大家以帮助,记得帮我点赞哦。 目录: 你以为的人生 一次又一次的伤害 猎头界的真相 如何应对互联网行业的「中年危机」 一、你以为的人生 刚入行时,拿着傲人的工资,想着好好干,以为我们的人生是这样的: 等真到了那一天,你会发现,你的人生很可能是这样的: ...
《MySQL 性能优化》之理解 MySQL 体系结构
本文介绍 MySQL 的体系结构,包括物理结构、逻辑结构以及插件式存储引擎。
【资源】一个C/C++开发工程师的学习路线(已经无路可退,唯有逆风飞翔)【内附资源页】
声明: 1)该文章整理自网上的大牛和专家无私奉献的资料,具体引用的资料请看参考文献。 2)本文仅供学术交流,非商用。所以每一部分具体的参考资料并没有详细对应。如果某部分不小心侵犯了大家的利益,还望海涵,并联系博主删除。 3)博主才疏学浅,文中如有不当之处,请各位指出,共同进步,谢谢。 4)此属于第一版本,若有错误,还需继续修正与增删。还望大家多多指点。大家都共享一点点,一起为祖国科研的推进...
程序员请照顾好自己,周末病魔差点一套带走我。
程序员在一个周末的时间,得了重病,差点当场去世,还好及时挽救回来了。
20道你必须要背会的微服务面试题,面试一定会被问到
写在前面: 在学习springcloud之前大家一定要先了解下,常见的面试题有那块,然后我们带着问题去学习这个微服务技术,那么就会更加理解springcloud技术。如果你已经学了springcloud,那么在准备面试的时候,一定要看看看这些面试题。 文章目录1、什么是微服务?2、微服务之间是如何通讯的?3、springcloud 与dubbo有哪些区别?4、请谈谈对SpringBoot 和S...
达摩院十大科技趋势发布:2020 非同小可!
【CSDN编者按】1月2日,阿里巴巴发布《达摩院2020十大科技趋势》,十大科技趋势分别是:人工智能从感知智能向认知智能演进;计算存储一体化突破AI算力瓶颈;工业互联网的超融合;机器间大规模协作成为可能;模块化降低芯片设计门槛;规模化生产级区块链应用将走入大众;量子计算进入攻坚期;新材料推动半导体器件革新;保护数据隐私的AI技术将加速落地;云成为IT技术创新的中心 。 新的画卷,正在徐徐展开。...
轻松搭建基于 SpringBoot + Vue 的 Web 商城应用
首先介绍下在本文出现的几个比较重要的概念: 函数计算(Function Compute): 函数计算是一个事件驱动的服务,通过函数计算,用户无需管理服务器等运行情况,只需编写代码并上传。函数计算准备计算资源,并以弹性伸缩的方式运行用户代码,而用户只需根据实际代码运行所消耗的资源进行付费。Fun: Fun 是一个用于支持 Serverless 应用部署的工具,能帮助您便捷地管理函数计算、API ...
Python+OpenCV实时图像处理
目录 1、导入库文件 2、设计GUI 3、调用摄像头 4、实时图像处理 4.1、阈值二值化 4.2、边缘检测 4.3、轮廓检测 4.4、高斯滤波 4.5、色彩转换 4.6、调节对比度 5、退出系统 初学OpenCV图像处理的小伙伴肯定对什么高斯函数、滤波处理、阈值二值化等特性非常头疼,这里给各位分享一个小项目,可通过摄像头实时动态查看各类图像处理的特点,也可对各位调参、测试...
2020年一线城市程序员工资大调查
人才需求 一线城市共发布岗位38115个,招聘120827人。 其中 beijing 22805 guangzhou 25081 shanghai 39614 shenzhen 33327 工资分布 2020年中国一线城市程序员的平均工资为16285元,工资中位数为14583元,其中95%的人的工资位于5000到20000元之间。 和往年数据比较: yea...
为什么猝死的都是程序员,基本上不见产品经理猝死呢?
相信大家时不时听到程序员猝死的消息,但是基本上听不到产品经理猝死的消息,这是为什么呢? 我们先百度搜一下:程序员猝死,出现将近700多万条搜索结果: 搜索一下:产品经理猝死,只有400万条的搜索结果,从搜索结果数量上来看,程序员猝死的搜索结果就比产品经理猝死的搜索结果高了一倍,而且从下图可以看到,首页里面的五条搜索结果,其实只有两条才是符合条件。 所以程序员猝死的概率真的比产品经理大,并不是错...
害怕面试被问HashMap?这一篇就搞定了!
声明:本文以jdk1.8为主! 搞定HashMap 作为一个Java从业者,面试的时候肯定会被问到过HashMap,因为对于HashMap来说,可以说是Java集合中的精髓了,如果你觉得自己对它掌握的还不够好,我想今天这篇文章会非常适合你,至少,看了今天这篇文章,以后不怕面试被问HashMap了 其实在我学习HashMap的过程中,我个人觉得HashMap还是挺复杂的,如果真的想把它搞得明明白...
毕业5年,我问遍了身边的大佬,总结了他们的学习方法
我问了身边10个大佬,总结了他们的学习方法,原来成功都是有迹可循的。
python爬取百部电影数据,我分析出了一个残酷的真相
2019年就这么匆匆过去了,就在前几天国家电影局发布了2019年中国电影市场数据,数据显示去年总票房为642.66亿元,同比增长5.4%;国产电影总票房411.75亿元,同比增长8.65%,市场占比 64.07%;城市院线观影人次17.27亿,同比增长0.64%。 看上去似乎是一片大好对不对?不过作为一名严谨求实的数据分析师,我从官方数据中看出了一点端倪:国产票房增幅都已经高达8.65%了,为什...
推荐10个堪称神器的学习网站
每天都会收到很多读者的私信,问我:“二哥,有什么推荐的学习网站吗?最近很浮躁,手头的一些网站都看烦了,想看看二哥这里有什么新鲜货。” 今天一早做了个恶梦,梦到被老板辞退了。虽然说在我们公司,只有我辞退老板的份,没有老板辞退我这一说,但是还是被吓得 4 点多都起来了。(主要是因为我掌握着公司所有的核心源码,哈哈哈) 既然 4 点多起来,就得好好利用起来。于是我就挑选了 10 个堪称神器的学习网站,推...
这些软件太强了,Windows必装!尤其程序员!
Windows可谓是大多数人的生产力工具,集娱乐办公于一体,虽然在程序员这个群体中都说苹果是信仰,但是大部分不都是从Windows过来的,而且现在依然有很多的程序员用Windows。 所以,今天我就把我私藏的Windows必装的软件分享给大家,如果有一个你没有用过甚至没有听过,那你就赚了????,这可都是提升你幸福感的高效率生产力工具哦! 走起!???? NO、1 ScreenToGif 屏幕,摄像头和白板...
阿里面试,面试官没想到一个ArrayList,我都能跟他扯半小时
我是真的没想到,面试官会这样问我ArrayList。
曾经优秀的人,怎么就突然不优秀了。
职场上有很多辛酸事,很多合伙人出局的故事,很多技术骨干被裁员的故事。说来模板都类似,曾经是名校毕业,曾经是优秀员工,曾经被领导表扬,曾经业绩突出,然而突然有一天,因为种种原因,被裁员了,...
大学四年因为知道了这32个网站,我成了别人眼中的大神!
依稀记得,毕业那天,我们导员发给我毕业证的时候对我说“你可是咱们系的风云人物啊”,哎呀,别提当时多开心啦????,嗯,我们导员是所有导员中最帅的一个,真的???? 不过,导员说的是实话,很多人都叫我大神的,为啥,因为我知道这32个网站啊,你说强不强????,这次是绝对的干货,看好啦,走起来! PS:每个网站都是学计算机混互联网必须知道的,真的牛杯,我就不过多介绍了,大家自行探索,觉得没用的,尽管留言吐槽吧???? 社...
良心推荐,我珍藏的一些Chrome插件
上次搬家的时候,发了一个朋友圈,附带的照片中不小心暴露了自己的 Chrome 浏览器插件之多,于是就有小伙伴评论说分享一下我觉得还不错的浏览器插件。 我下面就把我日常工作和学习中经常用到的一些 Chrome 浏览器插件分享给大家,随便一个都能提高你的“生活品质”和工作效率。 Markdown Here Markdown Here 可以让你更愉快的写邮件,由于支持 Markdown 直接转电子邮...
看完这篇HTTP,跟面试官扯皮就没问题了
我是一名程序员,我的主要编程语言是 Java,我更是一名 Web 开发人员,所以我必须要了解 HTTP,所以本篇文章就来带你从 HTTP 入门到进阶,看完让你有一种恍然大悟、醍醐灌顶的感觉。 最初在有网络之前,我们的电脑都是单机的,单机系统是孤立的,我还记得 05 年前那会儿家里有个电脑,想打电脑游戏还得两个人在一个电脑上玩儿,及其不方便。我就想为什么家里人不让上网,我的同学 xxx 家里有网,每...
2020 年,大火的 Python 和 JavaScript 是否会被取而代之?
Python 和 JavaScript 是目前最火的两大编程语言,但是2020 年,什么编程语言将会取而代之呢? 作者 |Richard Kenneth Eng 译者 |明明如月,责编 | 郭芮 出品 | CSDN(ID:CSDNnews) 以下为译文: Python 和 JavaScript 是目前最火的两大编程语言。然而,他们不可能永远屹立不倒。最终,必将像其他编程语言一...
史上最全的IDEA快捷键总结
现在Idea成了主流开发工具,这篇博客对其使用的快捷键做了总结,希望对大家的开发工作有所帮助。
阿里程序员写了一个新手都写不出的低级bug,被骂惨了。
这种新手都不会范的错,居然被一个工作好几年的小伙子写出来,差点被当场开除了。
谁是华为扫地僧?
是的,华为也有扫地僧!2020年2月11-12日,“养在深闺人不知”的华为2012实验室扫地僧们,将在华为开发者大会2020(Cloud)上,和大家见面。到时,你可以和扫地僧们,吃一个洋...
AI 没让人类失业,搞 AI 的人先失业了
最近和几个 AI 领域的大佬闲聊 根据他们讲的消息和段子 改编出下面这个故事 如有雷同 都是巧合 1. 老王创业失败,被限制高消费 “这里写我跑路的消息实在太夸张了。” 王葱葱哼笑一下,把消息分享给群里。 阿杰也看了消息,笑了笑。在座几位也都笑了。 王葱葱是个有名的人物,21岁那年以全额奖学金进入 KMU 攻读人工智能博士,累计发表论文 40 余篇,个人技术博客更是成为深度学习领域内风向标。 ...
2020年,冯唐49岁:我给20、30岁IT职场年轻人的建议
点击“技术领导力”关注∆每天早上8:30推送 作者|Mr.K 编辑| Emma 来源|技术领导力(ID:jishulingdaoli) 前天的推文《冯唐:职场人35岁以后,方法论比经验重要》,收到了不少读者的反馈,觉得挺受启发。其实,冯唐写了不少关于职场方面的文章,都挺不错的。可惜大家只记住了“春风十里不如你”、“如何避免成为油腻腻的中年人”等不那么正经的文章。 本文整理了冯...
神级宝库!GitHub 标星 1.2w+,Chrome 最天秀的插件都在这里啦!
作者 | Rocky0429 来源 | Python空间 大家好,我是 Rocky0429,一个沉迷 Chrome 不能自拔的蒟蒻… 作为一个在远古时代用过什么 IE、360、猎豹等浏览器的资深器哥,当我第一次了解 Chrome 的时候,就被它的美貌给吸引住了… 就在我用了一段时间之后,我坚决的卸载了电脑上其它碍眼的浏览器,并觉得在之前的搬砖生涯中,我不配当哥,我只配是个沙雕… ...
作为一名大学生,如何在B站上快乐的学习?
B站是个宝,谁用谁知道???? 作为一名大学生,你必须掌握的一项能力就是自学能力,很多看起来很牛X的人,你可以了解下,人家私底下一定是花大量的时间自学的,你可能会说,我也想学习啊,可是嘞,该学习啥嘞,不怕告诉你,互联网时代,最不缺的就是学习资源,最宝贵的是啥? 你可能会说是时间,不,不是时间,而是你的注意力,懂了吧! 那么,你说学习资源多,我咋不知道,那今天我就告诉你一个你必须知道的学习的地方,人称...
那些年,我们信了课本里的那些鬼话
教材永远都是有错误的,从小学到大学,我们不断的学习了很多错误知识。 斑羚飞渡 在我们学习的很多小学课文里,有很多是错误文章,或者说是假课文。像《斑羚飞渡》: 随着镰刀头羊的那声吼叫,整个斑羚群迅速分成两拨,老年斑羚为一拨,年轻斑羚为一拨。 就在这时,我看见,从那拨老斑羚里走出一只公斑羚来。公斑羚朝那拨年轻斑羚示意性地咩了一声,一只半大的斑羚应声走了出来。一老一少走到伤心崖,后退了几步,突...
张朝阳回应迟到 1 分钟罚 500:资本家就得剥削员工
loonggg读完需要2分钟速读仅需 1 分钟大家我,我是你们的校长。前几天,搜狐的董事局主席兼 CEO 张朝阳和搜狐都上热搜了。原因很简单,就是搜狐出了“考勤新规”。一封搜狐对员工发布...
立即提问