编译安卓4.4出错如下,求解!

各位大虾,编译安卓4.4 根文件系统,报错如下, 很多网友的帖子说是swap分区空间不够,我也增大了swap分区,并且在编译时监控内存使用率,并没有达到100%

代码肯定没问题,在其他地方都编译成功了,提示一大堆的undefined ,不知道为什么

有哪位知道如何处理,请指教,谢谢!

external/chromium_org/third_party/WebKit/Source/core/platform/sql/SQLiteDatabase.cpp:343: error: undefined reference to 'sqlite3_errcode'
external/chromium_org/third_party/WebKit/Source/core/platform/sql/SQLiteDatabase.cpp:349: error: undefined reference to 'sqlite3_errmsg'
external/chromium_org/third_party/WebKit/Source/core/platform/sql/SQLiteDatabase.cpp:461: error: undefined reference to 'sqlite3_set_authorizer'
external/chromium_org/third_party/WebKit/Source/core/platform/sql/SQLiteDatabase.cpp:466: error: undefined reference to 'sqlite3_get_autocommit'
external/chromium_org/third_party/WebKit/Source/core/platform/sql/SQLiteDatabase.cpp:129: error: undefined reference to 'sqlite3_interrupt'
external/chromium_org/third_party/WebKit/Source/core/platform/sql/SQLiteDatabase.cpp:114: error: undefined reference to 'sqlite3_close'
external/chromium_org/third_party/WebKit/Source/core/platform/sql/SQLiteDatabase.cpp:76: error: undefined reference to 'sqlite3_errmsg'
external/chromium_org/third_party/WebKit/Source/core/platform/sql/SQLiteDatabase.cpp:79: error: undefined reference to 'sqlite3_close'
external/chromium_org/third_party/WebKit/Source/core/platform/sql/SQLiteDatabase.cpp:84: error: undefined reference to 'sqlite3_extended_result_codes'
external/chromium_org/third_party/WebKit/Source/core/platform/sql/SQLiteDatabase.cpp:86: error: undefined reference to 'sqlite3_errmsg'
external/chromium_org/third_party/WebKit/Source/core/platform/sql/SQLiteDatabase.cpp:88: error: undefined reference to 'sqlite3_close'
external/chromium_org/third_party/WebKit/Source/core/platform/sql/SQLiteStatement.cpp:75: error: undefined reference to 'sqlite3_prepare_v2'
external/chromium_org/third_party/WebKit/Source/core/platform/sql/SQLiteStatement.cpp:104: error: undefined reference to 'sqlite3_step'
external/chromium_org/third_party/WebKit/Source/core/platform/sql/SQLiteStatement.cpp:121: error: undefined reference to 'sqlite3_finalize'
external/chromium_org/third_party/WebKit/Source/core/platform/sql/SQLiteStatement.cpp:218: error: undefined reference to 'sqlite3_bind_double'
external/chromium_org/third_party/WebKit/Source/core/platform/sql/SQLiteStatement.cpp:227: error: undefined reference to 'sqlite3_bind_null'
external/chromium_org/third_party/WebKit/Source/core/platform/sql/SQLiteStatement.cpp:250: error: undefined reference to 'sqlite3_bind_parameter_count'
external/chromium_org/third_party/WebKit/Source/core/platform/sql/SQLiteStatement.cpp:258: error: undefined reference to 'sqlite3_data_count'
external/chromium_org/third_party/WebKit/Source/core/platform/sql/SQLiteStatement.cpp:292: error: undefined reference to 'sqlite3_column_name16'
external/chromium_org/third_party/WebKit/Source/core/platform/sql/SQLiteStatement.cpp:306: error: undefined reference to 'sqlite3_column_value'
external/chromium_org/third_party/WebKit/Source/core/platform/sql/SQLiteStatement.cpp:307: error: undefined reference to 'sqlite3_value_type'
external/chromium_org/third_party/WebKit/Source/core/platform/sql/SQLiteStatement.cpp:310: error: undefined reference to 'sqlite3_value_double'
external/chromium_org/third_party/WebKit/Source/core/platform/sql/SQLiteStatement.cpp:313: error: undefined reference to 'sqlite3_value_text16'
external/chromium_org/third_party/WebKit/Source/core/platform/sql/SQLiteStatement.cpp:334: error: undefined reference to 'sqlite3_column_text16'
external/chromium_org/third_party/WebKit/Source/core/platform/sql/SQLiteStatement.cpp:335: error: undefined reference to 'sqlite3_column_bytes16'
external/chromium_org/third_party/WebKit/Source/core/platform/sql/SQLiteStatement.cpp:357: error: undefined reference to 'sqlite3_column_int'
external/chromium_org/third_party/WebKit/Source/core/platform/sql/SQLiteStatement.cpp:368: error: undefined reference to 'sqlite3_column_int64'
external/chromium_org/third_party/WebKit/Source/core/platform/sql/SQLiteStatement.cpp:191: error: undefined reference to 'sqlite3_bind_text16'
external/chromium_org/third_party/WebKit/Source/core/platform/sql/chromium/SQLiteFileSystemChromium.cpp:49: error: undefined reference to 'sqlite3_open'
external/chromium_org/third_party/WebKit/Source/core/platform/sql/chromium/SQLiteFileSystemChromium.cpp:51: error: undefined reference to 'sqlite3_open_v2'
external/chromium_org/third_party/WebKit/Source/core/platform/sql/chromium/SQLiteFileSystemChromiumPosix.cpp:150: error: undefined reference to 'sqlite3_snprintf'
external/chromium_org/third_party/WebKit/Source/core/platform/sql/chromium/SQLiteFileSystemChromiumPosix.cpp:65: error: undefined reference to 'chromium_sqlite3_initialize_unix_sqlite3_file'
external/chromium_org/third_party/WebKit/Source/core/platform/sql/chromium/SQLiteFileSystemChromiumPosix.cpp:67: error: undefined reference to 'chromium_sqlite3_get_reusable_file_handle'
external/chromium_org/third_party/WebKit/Source/core/platform/sql/chromium/SQLiteFileSystemChromiumPosix.cpp:79: error: undefined reference to 'chromium_sqlite3_destroy_reusable_file_handle'
external/chromium_org/third_party/WebKit/Source/core/platform/sql/chromium/SQLiteFileSystemChromiumPosix.cpp:85: error: undefined reference to 'chromium_sqlite3_update_reusable_file_handle'
external/chromium_org/third_party/WebKit/Source/core/platform/sql/chromium/SQLiteFileSystemChromiumPosix.cpp:92: error: undefined reference to 'chromium_sqlite3_fill_in_unix_sqlite3_file'
external/chromium_org/third_party/WebKit/Source/core/platform/sql/chromium/SQLiteFileSystemChromiumPosix.cpp:94: error: undefined reference to 'chromium_sqlite3_destroy_reusable_file_handle'
external/chromium_org/third_party/WebKit/Source/core/platform/sql/chromium/SQLiteFileSystemChromiumPosix.cpp:173: error: undefined reference to 'sqlite3_vfs_find'
external/chromium_org/third_party/WebKit/Source/core/platform/sql/chromium/SQLiteFileSystemChromiumPosix.cpp:194: error: undefined reference to 'sqlite3_vfs_register'
external/chromium_org/webkit/glue/webkit_glue.cc:14: error: undefined reference to 'v8::V8::SetFlagsFromString(char const*, int)'
external/chromium_org/webkit/child/webkit_child_helpers.cc:29: error: undefined reference to 'v8::HeapStatistics::HeapStatistics()'
****external/chromium_org/webkit/child/webkit_child_helpers.cc:32: error: undefined reference to 'v8::Isolate::GetHeapStatistics(v8::HeapStatistics*)'
collect2: error: ld returned 1 exit status
make: *** [out/target/product/drone2/obj/SHARED_LIBRARIES/libwebviewchromium_intermediates/LINKED/libwebviewchromium.so] Error 1


1个回答

看输出应该是sqlite的问题,话说你的电脑上安装了sqlite的头文件么

Csdn user default icon
上传中...
上传图片
插入图片
抄袭、复制答案,以达到刷声望分或其他目的的行为,在CSDN问答是严格禁止的,一经发现立刻封号。是时候展现真正的技术了!
其他相关推荐
编译提示出错.求解.
#ifndef _ACCOUNT_H_rn#define _ACCOUNT_H_rnrnstruct Accountrn int AccNum;rn CString name;rn CString nick;rn CString pass;rn CString phone;rn CString birth;rn rn char sex[2];rn rn Account()rn rn memset(sex,0,sizeof(sex));rn rn;rnrn#endifrn//----------------------------------------------------------------------rn我在一个类的私有成员中定义了一个rn _REGISTERDLG_H_rnprivate:rn Account account;rn//----------------------------------------------------------------------rn _REGISTERDLG_H_rnCString m_RName 类型, rn account.name = m_RName;rnrn两台不同的电脑,用VC6.0调试,一个正常,一个一个提示出错.rn编译通过,可是调试过程 中走到这边提示出错.rn
编译release时出错,如下
nafxcw.lib(afxmem.obj) : error LNK2005: "void * __cdecl operator new(unsigned int)" (??2@YAPAXI@Z) already defined in LIBC.lib(new.obj)rnrnrn好像是setting里设的不对?
Android4.4 安卓4.4源代码
安卓4.4的官方源代码,方便开发使用,欢迎下载,如果有错误请在评论中指出
安卓4.4实现透明状态栏
首先,我们要知道的是,在安卓5.0.1开始,状态栏就已经是透明的了,所以我们需要手动修改状态栏为透明的安卓版本只有4.4和5.0(4.4以下不支持透明状态栏) 先看styles.xml true true 以上两行代码只在安卓4.4以上有效 运行代码你会发现你的ui组件被状态栏覆盖了,但不用担心,只要在你的activity布局文件
安卓4.4原生相机
安卓4.4原生相机
安卓4.4的短信权限
做手机短信的处理时,发现安卓4.4和4.4以下的系统 ,短信处理不同, 后来才知道4.4对短信app有了安全权限 上传一些代码 public static boolean setWriteEnabled(Context context, boolean enabled) { int uid = getUid(context); int mode = enabled ? AppOpsManager.MODE_ALLOWED : AppOpsManager.MODE_IGNORED; return setMode(context, OP_WRITE_SMS, uid, mode); }
安卓4.4镜像
想要安卓4.4镜像的朋友们有福啦! 谷歌服务器搬了这个大家都知道. 官方的下载地址已经报废,所以导致王油无法下载.还好我的迅雷离线下载过这个镜像!这个本文文档里有下载地址,我放在度盘里的。想在电脑上运行安卓的用户快下载吧!如果度盘显示过期了请联系我!我会发布新的下载地址!QQ2416804502
安卓4.4时钟
可直接替换相机。替换之前,请检查一下安装文件,是否可用——因为资源来自其他网站。
安卓4.4移植
对4K 播放器:关闭预览动画,关闭悬浮窗口 android/device/softwinner/fiber-XXX/configs/cfg-fourkplayer.xml 文件中 关闭预览动画,并隐藏控制开关预览动画的菜单 <cfgOverride name="athumb_enable" value="0"/> <cfgOverride name="hide_menu_athumb" value="1"/> 关闭悬浮窗口,并隐藏控制悬浮窗口的按钮(可以考虑打开,但多测试下没问题再开) <cfgOverride name="floatwindow_enable" value="0"/> <cfgOverride name="hide_icon_floatwindow" value="1"/>
编译通过,构件出错,求解~
#include rn#define MY_WINCLASS_NAME "Direct3D"rnrnLPDIRECT3D8 g_pMyD3D=NULL;rnLPDIRECT3DDEVICE8 g_pMyd3dDevice=NULL;rnrnHRESULT InitMy3d(HWND hWnd)rnrn if(NULL==(g_pMyD3D = Direct3DCreate8(D3D_SDK_VERSION)))rn return E_FAIL;rnrn D3DDISPLAYMODE d3ddm;rn if(FAILED(g_pMyD3D->GetAdapterDisplayMode(D3DADAPTER_DEFAULT,&d3ddm)))rn return E_FAIL;rnrn D3DPRESENT_PARAMETERS d3dpp;rn ZeroMemory(&d3dpp,sizeof(d3dpp));rn d3dpp.Windowed=true;rn d3dpp.SwapEffect=D3DSWAPEFFECT_DISCARD;rn d3dpp.BackBufferFormat=d3ddm.Format;rn if(FAILED(g_pMyD3D->CreateDevice(D3DADAPTER_DEFAULT,D3DDEVTYPE_HAL,hWnd,D3DCREATE_SOFTWARE_VERTEXPROCESSING,&d3dpp,&g_pMyd3dDevice)))rn rn return E_FAIL;rn rn return S_OK;rnrnVOID Cleanup()rnrn if(g_pMyd3dDevice !=NULL)rn g_pMyd3dDevice->Release();rn rn if(g_pMyD3D!=NULL)rn g_pMyD3D->Release();rn return ;rnrnLRESULT WINAPI MsgProc(HWND hWnd,UINT msg,WPARAM wParam,LPARAM lParam)rnrn switch(msg)rn rn case WM_DESTROY:rn PostQuitMessage(0);rn return 0;rn case WM_PAINT:rn rn g_pMyd3dDevice->Clear(0,rn NULL,rn D3DCLEAR_TARGET,rn rn RGB(255,255,255),rn 1.0f,0);rn rn g_pMyd3dDevice->Present(NULL,NULL,NULL,NULL);rn ValidateRect(hWnd,NULL);rn return 0;rn rn return DefWindowProc(hWnd,msg,wParam,lParam);rnrnrnint APIENTRY WinMain(HINSTANCE hInstance,HINSTANCE hPrevInstance,LPSTR lpCmdLine,int nCmdShow)rnrn WNDCLASSEX wc=sizeof(WNDCLASSEX),rn CS_CLASSDC,rn MsgProc,rn 0L,rn 0L,rn GetModuleHandle(NULL),rn NULL,rn NULL,rn NULL,rn NULL,rn MY_WINCLASS_NAME,rn NULL;rnrnrn RegisterClassEx(&wc);rn HWND hWnd=CreateWindow(MY_WINCLASS_NAME,"HELLO!",WS_OVERLAPPEDWINDOW,100,100,400,300,GetDesktopWindow(),NULL,wc.hInstance,NULL);rn if(SUCCEEDED(InitMy3d(hWnd)))rn rn ShowWindow(hWnd,SW_SHOWDEFAULT);rn UpdateWindow(hWnd);rn MSG msg;rn while(GetMessage(&msg,NULL,0,0))rn rn TranslateMessage(&msg);rn DispatchMessage(&msg);rn rn rn Cleanup();rn UnregisterClass(MY_WINCLASS_NAME,wc.hInstance);rn return 0;rnrnrnrnrnrn--------------------Configuration: test1 - Win32 Debug--------------------rnLinking...rntest1-1.obj : error LNK2001: unresolved external symbol _Direct3DCreate8@4rnDebug/test1.exe : fatal error LNK1120: 1 unresolved externalsrnError executing link.exe.rnrntest1.exe - 2 error(s), 0 warning(s)rnrnrnrnrn因为看不懂英文了,请教~rn
GCC 编译CPP出错,求解
在LINUX中rn./a 后出错如下rnrnhello world.cpp:13: 错误:在新的 ISO ‘for’ 作用域中,‘i’ 的名称查找有变化rnhello world.cpp:8: 错误: 在 ‘i’ 使用过时绑定rnrn代码如下rnrn for(int i=0;i<15;i++)rn rn cin>>a[i];rn rn不是C++可以这样声明变量吗
android 4.4编译问题求解
下面是编译过程中出现的问题显示在网上查没有解决的办法,不知道网友有没有 CC      net/sched/act_api.o   CC      net/wireless/sysfs.o   CC      net/wireless/radiotap.o   CC      drivers/amlogic/input/new_remote/remote_main.o   C
Android源码4.4编译
Android源码4.4编译在编译Android时遇到一些问题,及时记下,以防以后忘记:环境Java环境 - JdK1.6需要用到的命令 - sudo apt-get install make - $ sudo apt-get install gcc - sudo apt-get install g++ - sudo apt-get instal
安卓x86 4.4 返回键没反应
有时会出现返回键没反应,关屏开屏又正常,或者得重启,有知道怎么解决的吗
安卓4.4音乐播放器,新手必看
新手必看,酷炫UI,代码简单,更有详细注释
vue 安卓4.4 打不开的坑
首先 npm install babel-polyfill 然后在webpack.base.conf.js中修改入口 entry: { app: [‘babel-polyfill’, ‘./src/main.js’]//最新的入口 // app: ‘./src/main.js’//原来的入口 }, 重新npm run dev 就可以啦!!!,安卓4.4重新打开,主要
安卓4.4以上版本的Emoji
Android 手机在API19以上(包括19 即安卓4.4版本)开始全面兼容Emoji 但是兼容的Emoji个数有限 现在把所有的Emoji 列出来 方便大家使用 项目传到GitHub 上了 方便查看 github:  https://github.com/HuaDanJson/AndroidEmoji ? ? ? ? ☺ ? ? ? ? ? ? ? ? ? ?
安卓4.4谷歌服务包
安卓4.4谷歌服务包,更好用的安卓谷歌服务,2015.1.11更新
分享:安卓x86 4.4常用软件
1、es文件管理器 可以像windows一样方便管理文件rn 2、rotation locker 强制横屏软件,这个必须有rn 3、ntfs hfs+ 一键挂载ntfs分区,简单实用,一看就懂rn 4、.rockplayer 视频播放。这个相信你等了很久的了,非常好用rn 5、绿色守护-流氓软件靠边站rn 6、wps编辑器,文本编辑不可少rn 7、uc浏览器x86专用版rn 相信这里面总有你需要的,谁还有好用的软件都分享出来啊
安卓4.4源码编译错误汇总
一、错误信息: make: *** [out/target/product/smdk4x12/obj/SHARED_LIBRARIES/libwebviewchromium_intermediates/LINKED/libwebviewchromium.so] Error 1 解决方法:增大swap缓存空间。 (1).dd if=/dev/zero of=/opt/swap1 bs=1024
安卓4.4源码架包
最新安卓4.4源码架包,kitkat,你值得拥有。
安卓4.4录屏(需要root)
安卓4.4录屏,需要添加的权限和使用方法在类中的注释,方法时间单位秒,最多录制3分钟。
KODI_17.1,安卓4.4适用的特别版~
你没看错!这是KODI的特别改版,能安装在安卓4.4系统上,非官方原版本。与官方版本功能一致,只是能安装在4.4上。插件等通用!
安卓4.4源码Android-19Source _eclipse
android-19 source 安卓4.4源码_eclipse 自己从SDK下载的,请解压到sdk目录 例:D:\Dev\adt-bundle-windows-x86-20131030\sdk Source Not Found的用户可以试试,添加解压后的文件夹。
关于statusBarManager的源代码(安卓4.4)
里面就一个android.view.View的源码,和Android.app.StatusBarManager的源码
新手求解,Android 4.4没有声音
直接装或者虚拟机,都没有声音,郁闷中....求救啊。。。rn
安卓4.4源码、goldfish 3.4内核。emulator使用方法出错
安卓4.4源码编译通过,goldfish 3.4内核编译时使用了make goldfish_armv7_defconfig 编译时“IO_START”未定义,我把hardware.h放在了include/linux/下了 然后在未定义的文件中把 #include 改成#include编译通过。rn然后在源码目录下 source bulid/envsetup.sh , lunch aosp_arm-eng , 然后 emulator &可以在模拟器上成功显示,但是只要一一指定内核 emulator -kernel ... 模拟器就一直黑屏,就解答!!!
windows下编译安卓ffmpeg错误求解!
我参考的是http://blog.csdn.net/klep1986/article/details/7717186做的,可是做到第七步是出现以下错误:[b][img=https://img-bbs.csdn.net/upload/201503/19/1426774027_575629.jpg][/img][/b]rnrnjni/libavfilter/../config.mak:6:*** missong separator. stoprnrn 求解!!
出错如下
[Linker Error] Unresolved external '_cmppe_submit_sm_set_dst_addr' referenced from D:\BCB\SMS.OBJrn我改一个函数,出现如上错误,怎么改能编译过去,(不用重编吧)
出错如下?
line 3, in n turtle.circle(200,step=8)nTypeError: circle() got an unexpected keyword argument 'step'
安卓求解~
[code=java]rnpublic class MainActivity extends Activity rn rn private static final String LOG_TAG = "IP Test";rn private EditText chattxt;rn private TextView chattxt2;rn private Button chatok;rn rn @Overridern public void onCreate(Bundle savedInstanceState) rn super.onCreate(savedInstanceState);rn setContentView(R.layout.activity_main);rnrn findviews();rn setonclick();rn chattxt2.setText(getLocalIpAddressV4());rn rnrn public void findviews() rn// chattxt = (EditText) this.findViewById(R.id.chattxt);rn chattxt2 = (TextView) this.findViewById(R.id.chattxt2);rn chatok = (Button) this.findViewById(R.id.chatOk);rn rnrn private void setonclick() rn chatok.setOnClickListener(new View.OnClickListener() rnrn @Overridern public void onClick(View v) rn try rn connecttoserver("I'm a client!");rn// connecttoserver(chattxt.getText().toString());rn catch (UnknownHostException e) rn // TODO Auto-generated catch blockrn e.printStackTrace();rn catch (IOException e) rn // TODO Auto-generated catch blockrn e.printStackTrace();rn rn rn );rn rnrn public void connecttoserver(String socketData) throws UnknownHostException,rn IOException rn Socket socket = RequestSocket("10.13.33.136", 5000);[color=#FF0000]// 程序一打开执行到这里就停止运行了,不知道为什么?手机连的是wifi,地址是10.24.28.139,网关10.24.16.1,电脑ip是10.13.33.136,网关是10.13.33.1,所以这里感觉应该是是不在一个导致的,但是为啥手机能打开我本机的网站,地址为:http://10.13.33.136:8080/phnt ps:网络学的不好~T_T[/color]rn// Socket socket = new Socket("10.13.33.136", 5000);rn// SendMsg(socket, socketData);rn// String txt = ReceiveMsg(socket);rn// this.chattxt2.setText(txt);rn rnrn private Socket RequestSocket(String host, int port)rn throws UnknownHostException, IOException rn Socket socket = new Socket(host, port);rn return socket;rn rnrn private void SendMsg(Socket socket, String msg) throws IOException rn BufferedWriter writer = new BufferedWriter(new OutputStreamWriter(rn socket.getOutputStream()));rn writer.write(msg.replace("\n", " ") + "\n");rn writer.flush();rn rnrn private String ReceiveMsg(Socket socket) throws IOException rn BufferedReader reader = new BufferedReader(new InputStreamReader(rn socket.getInputStream()));rnrn String txt = reader.readLine();rn return txt;rnrn rn[/code]
ubuntu18.04 编译安卓6.0 出错的总结
出现的错误: error: unsupported reloc 43 解决办法: cp ../ld.2.11  prebuilts/gcc/linux-x86/host/x86_64-linux-glibc2.11-4.8/x86_64-linux/bin/ld cp ../ld.2.15  prebuilts/gcc/linux-x86/host/x86_64-linux-glibc2.1...
谷歌原厂安卓4.4固件(Android 4.4 )( WiFi)版
刷机......
自己编译php时出错,求解
从php.net上下载了一个php的源码包,想自己编译一个rn编译过程虽然有些警告,但都编译过去了rn到最后的链接阶段总是提示rnrnphp5ts.dll.def : error LNK2001: 无法解析的外部符号 compressBoundrnphp5ts.dll.def : error LNK2001: 无法解析的外部符号 deflateBoundrnphp5ts.dll.def : error LNK2001: 无法解析的外部符号 deflatePrimernphp5ts.dll.def : error LNK2001: 无法解析的外部符号 gzclearerrrnphp5ts.dll.def : error LNK2001: 无法解析的外部符号 gzungetcrnphp5ts.dll.def : error LNK2001: 无法解析的外部符号 inflateBackrnphp5ts.dll.def : error LNK2001: 无法解析的外部符号 inflateBackEndrnphp5ts.dll.def : error LNK2001: 无法解析的外部符号 inflateBackInit_rnphp5ts.dll.def : error LNK2001: 无法解析的外部符号 inflateCopyrnphp5ts.dll.def : error LNK2001: 无法解析的外部符号 zlibCompileFlagsrnRelease_TS\php5ts.lib : fatal error LNK1120: 10 个无法解析的外部命令rnNMAKE : fatal error U1077: “"E:\Program Files\Microsoft Visual Studio 9.0\VC\BIN\cl.exe"”: 返回代码“0x2”rnStop.rnrn我检查了一下,zlib库是有的rn又从网上下载了一个zlib库,还是不行.rn求解
Android NDK 编译ffmpeg出错,求解
build-binary.mk:41:***目标文件“clean”含有:和::两种条目。停止rnrn求高手,应该怎么改.....多谢
vs2013+opencv2.4.13 编译没错,运行出错,求解
[img=https://img-bbs.csdn.net/upload/201612/01/1480554715_788544.png][/img]
很老的电脑可否安装安卓4.4 x86
为什么我装了之后,屏幕会不停的闪啊
出错求解
错误信息error: new types may not be defined in a return typernrn源代码.h文件rnrn#ifndef MAINWINDOW_Hrn#define MAINWINDOW_Hrnrn#include rn#includernrnnamespace Ui rn class MainWindow;rnrnrnclass MainWindow : public QMainWindowrnrn Q_OBJECTrnrnpublic:rn explicit MainWindow(QWidget *parent = 0);rn ~MainWindow();rnrnprivate:rn Ui::MainWindow *ui;rn;rnrnclass MyThread:public QThreadrnrnpublic:rn virtual void run();rnrn#endif // MAINWINDOW_Hrnrnrn.cPP 文件rn#include "mainwindow.h"rn#include "ui_mainwindow.h"rn#includernrnMainWindow::MainWindow(QWidget *parent) :rn QMainWindow(parent),rn ui(new Ui::MainWindow)rnrn ui->setupUi(this);rn MyThread a;rn MyThread b;rn a.start();rn b.start();rn a.wait();rn b.wait();rnrnrnrnMainWindow::~MainWindow()rnrn delete ui;rnrnrnvoid MyThread::run()rnrn for(int count=0;count<20;count++)rn rn sleep(1);rn qDeug("ping!");rnrn rnrnrnrn
求解 如下函数执行过程
int getInt()rn int i = 0;rn tryrn i = 1;rn return i;rn rn finallyrn i = 2;rn rnrn我试了一下 返回值是1rn但是我单步调试的时候运行如下rn1.i = 1rn2.return irn3. i = 2rn4. return irn哪位大神能给我解释一下啊/?????
求解如下代码
求解如下代码:rnrn[code=C/C++]rn#define INT_MAX ((int)(~0U>>1))rn#define INT_MIN (-INT_MAX - 1)rn#define UINT_MAX (~0U) //~按位取反rn#define LONG_MAX ((long)(~0UL>>1))rn#define LONG_MIN (-LONG_MAX - 1)rn#define ULONG_MAX (~0UL)rn[/code]rnrn这个应该涉及到C语言的基本点了,我理解起来到是有点困难,求解析,谢谢!
相关热词 c# stream 复制 android c# c#监测窗口句柄 c# md5 引用 c# 判断tabtip 自己写个浏览器程序c# c# 字符串变成整数数组 c#语言编程写出一个方法 c# 转盘抽奖 c#选中treeview