编译安卓4.4出错如下,求解!

各位大虾,编译安卓4.4 根文件系统,报错如下, 很多网友的帖子说是swap分区空间不够,我也增大了swap分区,并且在编译时监控内存使用率,并没有达到100%

代码肯定没问题,在其他地方都编译成功了,提示一大堆的undefined ,不知道为什么

有哪位知道如何处理,请指教,谢谢!

external/chromium_org/third_party/WebKit/Source/core/platform/sql/SQLiteDatabase.cpp:343: error: undefined reference to 'sqlite3_errcode'
external/chromium_org/third_party/WebKit/Source/core/platform/sql/SQLiteDatabase.cpp:349: error: undefined reference to 'sqlite3_errmsg'
external/chromium_org/third_party/WebKit/Source/core/platform/sql/SQLiteDatabase.cpp:461: error: undefined reference to 'sqlite3_set_authorizer'
external/chromium_org/third_party/WebKit/Source/core/platform/sql/SQLiteDatabase.cpp:466: error: undefined reference to 'sqlite3_get_autocommit'
external/chromium_org/third_party/WebKit/Source/core/platform/sql/SQLiteDatabase.cpp:129: error: undefined reference to 'sqlite3_interrupt'
external/chromium_org/third_party/WebKit/Source/core/platform/sql/SQLiteDatabase.cpp:114: error: undefined reference to 'sqlite3_close'
external/chromium_org/third_party/WebKit/Source/core/platform/sql/SQLiteDatabase.cpp:76: error: undefined reference to 'sqlite3_errmsg'
external/chromium_org/third_party/WebKit/Source/core/platform/sql/SQLiteDatabase.cpp:79: error: undefined reference to 'sqlite3_close'
external/chromium_org/third_party/WebKit/Source/core/platform/sql/SQLiteDatabase.cpp:84: error: undefined reference to 'sqlite3_extended_result_codes'
external/chromium_org/third_party/WebKit/Source/core/platform/sql/SQLiteDatabase.cpp:86: error: undefined reference to 'sqlite3_errmsg'
external/chromium_org/third_party/WebKit/Source/core/platform/sql/SQLiteDatabase.cpp:88: error: undefined reference to 'sqlite3_close'
external/chromium_org/third_party/WebKit/Source/core/platform/sql/SQLiteStatement.cpp:75: error: undefined reference to 'sqlite3_prepare_v2'
external/chromium_org/third_party/WebKit/Source/core/platform/sql/SQLiteStatement.cpp:104: error: undefined reference to 'sqlite3_step'
external/chromium_org/third_party/WebKit/Source/core/platform/sql/SQLiteStatement.cpp:121: error: undefined reference to 'sqlite3_finalize'
external/chromium_org/third_party/WebKit/Source/core/platform/sql/SQLiteStatement.cpp:218: error: undefined reference to 'sqlite3_bind_double'
external/chromium_org/third_party/WebKit/Source/core/platform/sql/SQLiteStatement.cpp:227: error: undefined reference to 'sqlite3_bind_null'
external/chromium_org/third_party/WebKit/Source/core/platform/sql/SQLiteStatement.cpp:250: error: undefined reference to 'sqlite3_bind_parameter_count'
external/chromium_org/third_party/WebKit/Source/core/platform/sql/SQLiteStatement.cpp:258: error: undefined reference to 'sqlite3_data_count'
external/chromium_org/third_party/WebKit/Source/core/platform/sql/SQLiteStatement.cpp:292: error: undefined reference to 'sqlite3_column_name16'
external/chromium_org/third_party/WebKit/Source/core/platform/sql/SQLiteStatement.cpp:306: error: undefined reference to 'sqlite3_column_value'
external/chromium_org/third_party/WebKit/Source/core/platform/sql/SQLiteStatement.cpp:307: error: undefined reference to 'sqlite3_value_type'
external/chromium_org/third_party/WebKit/Source/core/platform/sql/SQLiteStatement.cpp:310: error: undefined reference to 'sqlite3_value_double'
external/chromium_org/third_party/WebKit/Source/core/platform/sql/SQLiteStatement.cpp:313: error: undefined reference to 'sqlite3_value_text16'
external/chromium_org/third_party/WebKit/Source/core/platform/sql/SQLiteStatement.cpp:334: error: undefined reference to 'sqlite3_column_text16'
external/chromium_org/third_party/WebKit/Source/core/platform/sql/SQLiteStatement.cpp:335: error: undefined reference to 'sqlite3_column_bytes16'
external/chromium_org/third_party/WebKit/Source/core/platform/sql/SQLiteStatement.cpp:357: error: undefined reference to 'sqlite3_column_int'
external/chromium_org/third_party/WebKit/Source/core/platform/sql/SQLiteStatement.cpp:368: error: undefined reference to 'sqlite3_column_int64'
external/chromium_org/third_party/WebKit/Source/core/platform/sql/SQLiteStatement.cpp:191: error: undefined reference to 'sqlite3_bind_text16'
external/chromium_org/third_party/WebKit/Source/core/platform/sql/chromium/SQLiteFileSystemChromium.cpp:49: error: undefined reference to 'sqlite3_open'
external/chromium_org/third_party/WebKit/Source/core/platform/sql/chromium/SQLiteFileSystemChromium.cpp:51: error: undefined reference to 'sqlite3_open_v2'
external/chromium_org/third_party/WebKit/Source/core/platform/sql/chromium/SQLiteFileSystemChromiumPosix.cpp:150: error: undefined reference to 'sqlite3_snprintf'
external/chromium_org/third_party/WebKit/Source/core/platform/sql/chromium/SQLiteFileSystemChromiumPosix.cpp:65: error: undefined reference to 'chromium_sqlite3_initialize_unix_sqlite3_file'
external/chromium_org/third_party/WebKit/Source/core/platform/sql/chromium/SQLiteFileSystemChromiumPosix.cpp:67: error: undefined reference to 'chromium_sqlite3_get_reusable_file_handle'
external/chromium_org/third_party/WebKit/Source/core/platform/sql/chromium/SQLiteFileSystemChromiumPosix.cpp:79: error: undefined reference to 'chromium_sqlite3_destroy_reusable_file_handle'
external/chromium_org/third_party/WebKit/Source/core/platform/sql/chromium/SQLiteFileSystemChromiumPosix.cpp:85: error: undefined reference to 'chromium_sqlite3_update_reusable_file_handle'
external/chromium_org/third_party/WebKit/Source/core/platform/sql/chromium/SQLiteFileSystemChromiumPosix.cpp:92: error: undefined reference to 'chromium_sqlite3_fill_in_unix_sqlite3_file'
external/chromium_org/third_party/WebKit/Source/core/platform/sql/chromium/SQLiteFileSystemChromiumPosix.cpp:94: error: undefined reference to 'chromium_sqlite3_destroy_reusable_file_handle'
external/chromium_org/third_party/WebKit/Source/core/platform/sql/chromium/SQLiteFileSystemChromiumPosix.cpp:173: error: undefined reference to 'sqlite3_vfs_find'
external/chromium_org/third_party/WebKit/Source/core/platform/sql/chromium/SQLiteFileSystemChromiumPosix.cpp:194: error: undefined reference to 'sqlite3_vfs_register'
external/chromium_org/webkit/glue/webkit_glue.cc:14: error: undefined reference to 'v8::V8::SetFlagsFromString(char const*, int)'
external/chromium_org/webkit/child/webkit_child_helpers.cc:29: error: undefined reference to 'v8::HeapStatistics::HeapStatistics()'
****external/chromium_org/webkit/child/webkit_child_helpers.cc:32: error: undefined reference to 'v8::Isolate::GetHeapStatistics(v8::HeapStatistics*)'
collect2: error: ld returned 1 exit status
make: *** [out/target/product/drone2/obj/SHARED_LIBRARIES/libwebviewchromium_intermediates/LINKED/libwebviewchromium.so] Error 1


1个回答

看输出应该是sqlite的问题,话说你的电脑上安装了sqlite的头文件么

Csdn user default icon
上传中...
上传图片
插入图片
抄袭、复制答案,以达到刷声望分或其他目的的行为,在CSDN问答是严格禁止的,一经发现立刻封号。是时候展现真正的技术了!