使用install:file命令安装第三方jar到maven本地仓库,报错no pom

问题补充:
项目中要用到一个分词的jar包。于是我在晚上下了一个,本来是这样IK Analyzer 2012FF_hf1.jar, 为了符合maven install命令的规范,我随意加了一个版本号变为这样IK Analyzer 2012FF_1.0.1.然后切换到jar包所在文件夹,执行如图命令,爆出如图错误。查了百度,有说缺少pom.xml文件的,难道随便一个jar包安装到本地仓库,都要手写pom文件吗?我怎么知道它依赖了哪些包?
图片说明

图片说明

2个回答

其实问题很简单!
mvn install:install-file -DgroupId=org.lwtea -DartifactId=IKAnalyzer -Dversion=0.0.1-SNAPSHOT -Dpackaging=jar -Dfile=IKAnalyzer-0.0.1-SNAPSHOT.jar

你在DgroupId等参数的前面都少加了一个"-"符号!加上就没问题了……

Csdn user default icon
上传中...
上传图片
插入图片
抄袭、复制答案,以达到刷声望分或其他目的的行为,在CSDN问答是严格禁止的,一经发现立刻封号。是时候展现真正的技术了!
其他相关推荐
往本地maven库打jar包的时候提示访问路径拒绝访问
下面是错误提示 ![图片说明](https://img-ask.csdn.net/upload/201510/09/1444385233_691566.png) 我的打包命令如下 mvn install:install-file -Dfile=D:\maven\apache-maven-3.1.0\repository -DgroupId=org.jsoup -DartifactId=jsoup -Dversion=1.8.3 -Dpackaging=jar
mvn install离线使用不了,离线还是需要下载一堆东西
办公室电脑不能连外网,需要把jar包添加到本地maven仓库,网上查到可以使用mvn -install命令,如: ``` mvn install:install-file -Dfile=e:/it-blacklist-0.0.1-SNAPSHOT.jar -DgroupId=cn.blacklist -DartifactId=it-blacklist -Dversion=0.0.1-SNAPSHOT -Dpackaging=jar ``` 该命令我笔记本测试联网可用,但在台式机离线使用的时候,会尝试下载install的一些插件,但是因为台式机是离线的,导致下载不到就报错: No plugin found for prefix 'install' in the current project and in the plugin groups [org.apache.maven.plugins, org.codehaus.mojo] available from the repositories. 如附图所示。 ![图片说明](https://img-ask.csdn.net/upload/201911/25/1574679537_745197.jpg) 我想了一些办法解决,就是把笔记本上行mvn install执行过后的缓存文件复制到台式机上。即把笔记本上的maven仓库C:\Users\用户名\.m2\repository整个复制到台式机上覆盖响应文件夹,但是台式机仍然会尝试下载。 我在笔记本上的相应文件夹中是可以看到尝试下载的那些文件的。但是就是无法让台式机在离线的时候使用它。不知道有没有大佬知道应该怎么操作解决这个问题。
maven依赖项目打jar包问题
eclipse中有2个maven项目(都不是web项目)。A项目依赖B项目(A就是控制层,B就是service和DAO)A的pom.xml文件里<dependency><groupId>com.B</groupId<artifactId>B</artifactId></dependency>,A项目配了一些application.xml;在B中配置了一些beans.xml;将B项目maven install到本地仓库,A项目直接引用B的jar包。在eclipse里运行A一切正常。但将A打jar包后。一直报错。 org.springframework.beans.factory.BeanDefinitionStoreException: Invalid bean definition with name 'comDict' defined in URL [jar:file:/E:/game/A_lib/B.jar!/config/beans.xml] A项目打成jar包{ A的配置文件,A_lib(存放A所有依赖的jar包的文件夹),A.jar} 以上3块放在同一个文件夹下面。运行java -jar A.jar。就会报上面的错。comDict是配置在beans.xml里面的一个bean。jar:file:/E:/game/A_lib/B.jar!/config/beans.xml]这个B.jar后面带个感叹号。eclipse里运行A正常。打jar包运行就错。
用maven进行install的时候报错Error injecting: org.apache.maven.plugin.install.InstallMojo
[code="java"] ------------------------------------------------------- T E S T S ------------------------------------------------------- There are no tests to run. Results : Tests run: 0, Failures: 0, Errors: 0, Skipped: 0 [INFO] [INFO] --- maven-war-plugin:2.1.1:war (default-war) @ llemaicai --- [INFO] Packaging webapp [INFO] Assembling webapp [llemaicai] in [E:\dev\maicai\pro\llemaicai\target\llemaicai] [INFO] Processing war project [INFO] Copying webapp resources [E:\dev\maicai\pro\llemaicai\src\main\webapp] [INFO] Webapp assembled in [35 msecs] [INFO] Building war: E:\dev\maicai\pro\llemaicai\target\llemaicai.war [WARNING] Warning: selected war files include a WEB-INF/web.xml which will be ignored (webxml attribute is missing from war task, or ignoreWebxml attribute is specified as 'true') [INFO] [INFO] --- maven-install-plugin:2.3.1:install (default-install) @ llemaicai --- [WARNING] The POM for org.codehaus.plexus:plexus-digest:jar:1.0 is invalid, transitive dependencies (if any) will not be available, enable debug logging for more details 2013-2-20 14:41:14 org.sonatype.guice.bean.reflect.LoadedClass 警告: Error injecting: org.apache.maven.plugin.install.InstallMojo java.lang.NoClassDefFoundError: org/codehaus/plexus/digest/DigesterException at java.lang.Class.getDeclaredConstructors0(Native Method) at java.lang.Class.privateGetDeclaredConstructors(Class.java:2389) at java.lang.Class.getDeclaredConstructors(Class.java:1836) at com.google.inject.spi.InjectionPoint.forConstructorOf(InjectionPoint.java:243) at com.google.inject.internal.ConstructorBindingImpl.create(ConstructorBindingImpl.java:96) at com.google.inject.internal.InjectorImpl.createUninitializedBinding(InjectorImpl.java:628) at com.google.inject.internal.InjectorImpl.createJustInTimeBinding(InjectorImpl.java:835) at com.google.inject.internal.InjectorImpl.createJustInTimeBindingRecursive(InjectorImpl.java:769) at com.google.inject.internal.InjectorImpl.getJustInTimeBinding(InjectorImpl.java:254) at com.google.inject.internal.InjectorImpl.getBindingOrThrow(InjectorImpl.java:205) at com.google.inject.internal.InjectorImpl.getInternalFactory(InjectorImpl.java:843) at com.google.inject.internal.InjectorImpl.getProviderOrThrow(InjectorImpl.java:957) at com.google.inject.internal.InjectorImpl.getProvider(InjectorImpl.java:990) at com.google.inject.internal.InjectorImpl.getProvider(InjectorImpl.java:951) at com.google.inject.internal.InjectorImpl.getInstance(InjectorImpl.java:1003) at org.sonatype.guice.bean.reflect.AbstractDeferredClass.get(AbstractDeferredClass.java:47) at com.google.inject.internal.InternalFactoryToProviderAdapter.get(InternalFactoryToProviderAdapter.java:40) at com.google.inject.internal.InjectorImpl$4$1.call(InjectorImpl.java:968) at com.google.inject.internal.InjectorImpl.callInContext(InjectorImpl.java:1014) at com.google.inject.internal.InjectorImpl$4.get(InjectorImpl.java:964) at com.google.inject.Scopes$1$1.get(Scopes.java:59) at org.sonatype.guice.bean.locators.LazyBeanEntry.getValue(LazyBeanEntry.java:79) at org.sonatype.guice.plexus.locators.LazyPlexusBean.getValue(LazyPlexusBean.java:53) at org.codehaus.plexus.DefaultPlexusContainer.lookup(DefaultPlexusContainer.java:243) at org.codehaus.plexus.DefaultPlexusContainer.lookup(DefaultPlexusContainer.java:235) at org.apache.maven.plugin.internal.DefaultMavenPluginManager.getConfiguredMojo(DefaultMavenPluginManager.java:455) at org.apache.maven.plugin.DefaultBuildPluginManager.executeMojo(DefaultBuildPluginManager.java:92) at org.apache.maven.lifecycle.internal.MojoExecutor.execute(MojoExecutor.java:209) at org.apache.maven.lifecycle.internal.MojoExecutor.execute(MojoExecutor.java:153) at org.apache.maven.lifecycle.internal.MojoExecutor.execute(MojoExecutor.java:145) at org.apache.maven.lifecycle.internal.LifecycleModuleBuilder.buildProject(LifecycleModuleBuilder.java:84) at org.apache.maven.lifecycle.internal.LifecycleModuleBuilder.buildProject(LifecycleModuleBuilder.java:59) at org.apache.maven.lifecycle.internal.LifecycleStarter.singleThreadedBuild(LifecycleStarter.java:183) at org.apache.maven.lifecycle.internal.LifecycleStarter.execute(LifecycleStarter.java:161) at org.apache.maven.DefaultMaven.doExecute(DefaultMaven.java:319) at org.apache.maven.DefaultMaven.execute(DefaultMaven.java:156) at org.apache.maven.cli.MavenCli.execute(MavenCli.java:537) at org.apache.maven.cli.MavenCli.doMain(MavenCli.java:196) at org.apache.maven.cli.MavenCli.main(MavenCli.java:141) at sun.reflect.NativeMethodAccessorImpl.invoke0(Native Method) at sun.reflect.NativeMethodAccessorImpl.invoke(NativeMethodAccessorImpl.java:39) at sun.reflect.DelegatingMethodAccessorImpl.invoke(DelegatingMethodAccessorImpl.java:25) at java.lang.reflect.Method.invoke(Method.java:597) at org.codehaus.plexus.classworlds.launcher.Launcher.launchEnhanced(Launcher.java:290) at org.codehaus.plexus.classworlds.launcher.Launcher.launch(Launcher.java:230) at org.codehaus.plexus.classworlds.launcher.Launcher.mainWithExitCode(Launcher.java:409) at org.codehaus.plexus.classworlds.launcher.Launcher.main(Launcher.java:352) Caused by: java.lang.ClassNotFoundException: org.codehaus.plexus.digest.DigesterException at org.codehaus.plexus.classworlds.strategy.SelfFirstStrategy.loadClass(SelfFirstStrategy.java:50) at org.codehaus.plexus.classworlds.realm.ClassRealm.loadClass(ClassRealm.java:244) at org.codehaus.plexus.classworlds.realm.ClassRealm.loadClass(ClassRealm.java:230) ... 47 more [INFO] ------------------------------------------------------------------------ [INFO] BUILD FAILURE [INFO] ------------------------------------------------------------------------ [INFO] Total time: 1.669s [INFO] Finished at: Wed Feb 20 14:41:14 CST 2013 [INFO] Final Memory: 4M/15M [INFO] ------------------------------------------------------------------------ [ERROR] Failed to execute goal org.apache.maven.plugins:maven-install-plugin:2.3.1:install (default-install) on project llemaicai: Execution default-install of goal org.apache.maven.plugins:maven-install-plugin:2.3.1:install failed: Unable to load the mojo 'install' in the plugin 'org.apache.maven.plugins:maven-install-plugin:2.3.1'. A required class is missing: org/codehaus/plexus/digest/DigesterException [ERROR] ----------------------------------------------------- [ERROR] realm = plugin>org.apache.maven.plugins:maven-install-plugin:2.3.1 [ERROR] strategy = org.codehaus.plexus.classworlds.strategy.SelfFirstStrategy [ERROR] urls[0] = file:/D:/javalib/repository/org/apache/maven/plugins/maven-install-plugin/2.3.1/maven-install-plugin-2.3.1.jar [ERROR] urls[1] = file:/D:/javalib/repository/junit/junit/3.8.1/junit-3.8.1.jar [ERROR] urls[2] = file:/D:/javalib/repository/org/codehaus/plexus/plexus-utils/2.0.5/plexus-utils-2.0.5.jar [ERROR] urls[3] = file:/D:/javalib/repository/org/codehaus/plexus/plexus-digest/1.0/plexus-digest-1.0.jar [ERROR] Number of foreign imports: 1 [ERROR] import: Entry[import from realm ClassRealm[maven.api, parent: null]] [ERROR] [ERROR] -----------------------------------------------------: org.codehaus.plexus.digest.DigesterException [ERROR] -> [Help 1] [ERROR] [ERROR] To see the full stack trace of the errors, re-run Maven with the -e switch. [ERROR] Re-run Maven using the -X switch to enable full debug logging. [ERROR] [ERROR] For more information about the errors and possible solutions, please read the following articles: [ERROR] [Help 1] http://cwiki.apache.org/confluence/display/MAVEN/PluginContainerException [/code]
maven项目install时异常
[ERROR] Failed to execute goal on project order-api: Could not resolve dependencies for project com.dd:order-api: jar:0.0.1-SNAPSHOT: Could not transfer artifact com.dd:park:jar:0.0.1-SNAPSHOT from/to maven-releases (http://47. 104.107.80:8081/repository/maven-releases/): Failed to transfer file: http://47.104.107.80:8081/repository/maven- releases/com/dd/park/0.0.1-SNAPSHOT/park-0.0.1-SNAPSHOT.jar. Return code is: 400 , ReasonPhrase:Repository versio n policy: RELEASE does not allow version: 0.0.1-SNAPSHOT. -> [Help 1]
maven 项目导入的问题
在导入 maven 项目时 pom.xml --> run as --> maven install 出现下面问题!对maven 不太了解,是个新手 [code="java"] [INFO] Scanning for projects... [INFO] ------------------------------------------------------------------------ [INFO] Building Herbalife Maven Webapp [INFO] [INFO] Id: com.herbalife.webapp:herbalife:war:1.0-SNAPSHOT [INFO] task-segment: [install] [INFO] ------------------------------------------------------------------------ [INFO] [resources:resources] [INFO] Using default encoding to copy filtered resources. url = http://repo1.maven.org/maven2 Downloading: http://repo1.maven.org/maven2/opensymphony/xwork/2.0.4/xwork-2.0.4.pom url = http://repo1.maven.org/maven2 Downloading: http://repo1.maven.org/maven2/dojo/dojo/0.0/dojo-0.0.pom url = http://repo1.maven.org/maven2 Downloading: http://repo1.maven.org/maven2/fckeditor/fckeditor/2.3/fckeditor-2.3.pom url = http://repo1.maven.org/maven2 Downloading: http://repo1.maven.org/maven2/sqlserver/msbase/1.0/msbase-1.0.pom url = http://repo1.maven.org/maven2 Downloading: http://repo1.maven.org/maven2/sqlserver/mssqlserver/1.0/mssqlserver-1.0.pom url = http://repo1.maven.org/maven2 Downloading: http://repo1.maven.org/maven2/sqlserver/msutil/1.0/msutil-1.0.pom url = http://repo1.maven.org/maven2 Downloading: http://repo1.maven.org/maven2/opensymphony/jsonplugin/0[1].16-1.5/jsonplugin-0[1].16-1.5.pom url = http://repo1.maven.org/maven2 Downloading: http://repo1.maven.org/maven2/unitils/unitils/1.0-rc-1/unitils-1.0-rc-1.pom url = http://repo1.maven.org/maven2 Downloading: http://repo1.maven.org/maven2/opensymphony/xwork/2.0.4/xwork-2.0.4.jar url = http://repo1.maven.org/maven2 Downloading: http://repo1.maven.org/maven2/dojo/dojo/0.0/dojo-0.0.jar url = http://repo1.maven.org/maven2 Downloading: http://repo1.maven.org/maven2/fckeditor/fckeditor/2.3/fckeditor-2.3.jar url = http://repo1.maven.org/maven2 Downloading: http://repo1.maven.org/maven2/sqlserver/msbase/1.0/msbase-1.0.jar url = http://repo1.maven.org/maven2 Downloading: http://repo1.maven.org/maven2/sqlserver/mssqlserver/1.0/mssqlserver-1.0.jar url = http://repo1.maven.org/maven2 Downloading: http://repo1.maven.org/maven2/sqlserver/msutil/1.0/msutil-1.0.jar url = http://repo1.maven.org/maven2 Downloading: http://repo1.maven.org/maven2/opensymphony/jsonplugin/0[1].16-1.5/jsonplugin-0[1].16-1.5.jar [ERROR] Transitive dependency resolution for scope: compile has failed for your project. Error message: Missing: ---------- 1) opensymphony:xwork:jar:2.0.4 Try downloading the file manually from the project website. Then, install it using the command: mvn install:install-file -DgroupId=opensymphony -DartifactId=xwork -Dversion=2.0.4 -Dpackaging=jar -Dfile=/path/to/file Alternatively, if you host your own repository you can deploy the file there: mvn deploy:deploy-file -DgroupId=opensymphony -DartifactId=xwork -Dversion=2.0.4 -Dpackaging=jar -Dfile=/path/to/file -Durl=[url] -DrepositoryId=[id] Path to dependency: 1) com.herbalife.webapp:herbalife:war:1.0-SNAPSHOT 2) opensymphony:xwork:jar:2.0.4 2) dojo:dojo:jar:0.0 Try downloading the file manually from the project website. Then, install it using the command: mvn install:install-file -DgroupId=dojo -DartifactId=dojo -Dversion=0.0 -Dpackaging=jar -Dfile=/path/to/file Alternatively, if you host your own repository you can deploy the file there: mvn deploy:deploy-file -DgroupId=dojo -DartifactId=dojo -Dversion=0.0 -Dpackaging=jar -Dfile=/path/to/file -Durl=[url] -DrepositoryId=[id] Path to dependency: 1) com.herbalife.webapp:herbalife:war:1.0-SNAPSHOT 2) dojo:dojo:jar:0.0 3) fckeditor:fckeditor:jar:2.3 Try downloading the file manually from the project website. Then, install it using the command: mvn install:install-file -DgroupId=fckeditor -DartifactId=fckeditor -Dversion=2.3 -Dpackaging=jar -Dfile=/path/to/file Alternatively, if you host your own repository you can deploy the file there: mvn deploy:deploy-file -DgroupId=fckeditor -DartifactId=fckeditor -Dversion=2.3 -Dpackaging=jar -Dfile=/path/to/file -Durl=[url] -DrepositoryId=[id] Path to dependency: 1) com.herbalife.webapp:herbalife:war:1.0-SNAPSHOT 2) fckeditor:fckeditor:jar:2.3 4) sqlserver:msbase:jar:1.0 Try downloading the file manually from the project website. Then, install it using the command: mvn install:install-file -DgroupId=sqlserver -DartifactId=msbase -Dversion=1.0 -Dpackaging=jar -Dfile=/path/to/file Alternatively, if you host your own repository you can deploy the file there: mvn deploy:deploy-file -DgroupId=sqlserver -DartifactId=msbase -Dversion=1.0 -Dpackaging=jar -Dfile=/path/to/file -Durl=[url] -DrepositoryId=[id] Path to dependency: 1) com.herbalife.webapp:herbalife:war:1.0-SNAPSHOT 2) sqlserver:msbase:jar:1.0 5) sqlserver:mssqlserver:jar:1.0 Try downloading the file manually from the project website. Then, install it using the command: mvn install:install-file -DgroupId=sqlserver -DartifactId=mssqlserver -Dversion=1.0 -Dpackaging=jar -Dfile=/path/to/file Alternatively, if you host your own repository you can deploy the file there: mvn deploy:deploy-file -DgroupId=sqlserver -DartifactId=mssqlserver -Dversion=1.0 -Dpackaging=jar -Dfile=/path/to/file -Durl=[url] -DrepositoryId=[id] Path to dependency: 1) com.herbalife.webapp:herbalife:war:1.0-SNAPSHOT 2) sqlserver:mssqlserver:jar:1.0 6) sqlserver:msutil:jar:1.0 Try downloading the file manually from the project website. Then, install it using the command: mvn install:install-file -DgroupId=sqlserver -DartifactId=msutil -Dversion=1.0 -Dpackaging=jar -Dfile=/path/to/file Alternatively, if you host your own repository you can deploy the file there: mvn deploy:deploy-file -DgroupId=sqlserver -DartifactId=msutil -Dversion=1.0 -Dpackaging=jar -Dfile=/path/to/file -Durl=[url] -DrepositoryId=[id] Path to dependency: 1) com.herbalife.webapp:herbalife:war:1.0-SNAPSHOT 2) sqlserver:msutil:jar:1.0 7) opensymphony:jsonplugin:jar:0[1].16-1.5 Try downloading the file manually from the project website. Then, install it using the command: mvn install:install-file -DgroupId=opensymphony -DartifactId=jsonplugin -Dversion=0[1].16-1.5 -Dpackaging=jar -Dfile=/path/to/file Alternatively, if you host your own repository you can deploy the file there: mvn deploy:deploy-file -DgroupId=opensymphony -DartifactId=jsonplugin -Dversion=0[1].16-1.5 -Dpackaging=jar -Dfile=/path/to/file -Durl=[url] -DrepositoryId=[id] Path to dependency: 1) com.herbalife.webapp:herbalife:war:1.0-SNAPSHOT 2) opensymphony:jsonplugin:jar:0[1].16-1.5 ---------- 7 required artifacts are missing. for artifact: com.herbalife.webapp:herbalife:war:1.0-SNAPSHOT from the specified remote repositories: central (http://repo1.maven.org/maven2) Group-Id: com.herbalife.webapp Artifact-Id: herbalife Version: 1.0-SNAPSHOT From file: D:\workspace\herbal-report\pom.xml [INFO] ------------------------------------------------------------------------ [INFO] For more information, run with the -e flag [INFO] ------------------------------------------------------------------------ [INFO] BUILD FAILED [INFO] ------------------------------------------------------------------------ [INFO] Total time: 13 seconds [INFO] Finished at: Fri Nov 20 13:49:19 CST 2009 [INFO] Final Memory: 2M/11M [INFO] ------------------------------------------------------------------------ [/code] [b]问题补充:[/b] D:\Downloads\xwork-2.0.4.jar 默认下载到什么地方了!这么多jar 包要一个一个导吗? 谢谢 [b]问题补充:[/b] 只剩下3 分了! :oops: 没有人知道吗??? [b]问题补充:[/b] 请问? cwx714 私服怎么建?? 我机子上的 repository 库算什么? 有没有参照的例子? 感激不尽! [img]http://dl.iteye.com/upload/attachment/171204/5b564360-105f-3cb7-96cb-4512a932b7e4.jpg[/img] [b]问题补充:[/b] 建私服太麻烦了,用 mvn 命令创建项目时为什么能自动下载对应jar 包,而导入项目时为什么就下载出错?
eclipse新建了maven项目后,执行maven命令出错,求指点
想在maven中加入ojdbc6.jar,于是按这篇博客 http://blog.csdn.net/mr_mlw/article/details/45094193 说的,在eclipse里执行命令 mvninstall:install-file -DgroupId=com.oracle -DartifactId=ojdbc6-Dversion=11.2.0.1.0 -Dpackaging=jar -Dfile=D:\ ojdbc6.jar 我的ojdbs6.jar已放到了d盘根目录,然后eclipse里执行这命令就报错 ![图片说明](https://img-ask.csdn.net/upload/201712/18/1513606542_440497.png) ![图片说明](https://img-ask.csdn.net/upload/201712/18/1513606552_171501.png) 不知什么回事,也不知道eclipse是不是要安装maven插件,windows也要安装maven的,我应该是没做过这些步骤,但是我这个是eclipse官网刚下的最新版的java ee eclipse,在新建project里能新建maven项目,不知是不是与这个有关...... 求指点
java.net.URISyntaxException: Relative path
在我用Maven package以后,运行java -jar target\test-0.0.1-SNAPSHOT.jar时提示有错误: java.net.URISyntaxException: Relative path in absolute URI: java://file:/C:/Users/user/workspace/test/target/test-0.0.1-SNAPSHOT.jar!/lib/fooJDBC-1.0.jar!/ Loaded JDBC driver: com.foo.Driver 这个fooJDBC-1.0.jar是我用mvn install:install-file 命令添加到本地repository的,这样mvn打包的时候就能把这个jar也能打进去. 这个错看起来好象和感叹号有关. 为什么会出现这样的错误?该怎么解决?谢谢.
哪位热心的大神来给看看~maven项目打成的jar包无法运行
第一次打jar包,第一次用maven遇到了问题,抓耳挠腮两天都没解决。 前提:项目在myeclispe里边运行时正常的。maven项目。 遇到问题:第一次打jar是直接export--jar file--然后被告知maven项目是不能这样打的。 然后:使用 run as 里边的先maven clean--再 myeclipse里边的project clean--再run as里边的maven install,然后得到一个很小的jar。 两种打法得到的jar包封装成windows服务的运行的时候都会报出错误,如下图: ************************************ INFO | jvm 1 | 2014/12/14 14:47:27 | WrapperSimpleApp: INFO | jvm 1 | 2014/12/14 14:47:27 | WrapperSimpleApp Error: Encountered an error running main: INFO | jvm 1 | 2014/12/14 14:47:27 | WrapperSimpleApp Error: java.lang.NoClassDefFoundError: org/apache/log4j/PropertyConfigurator INFO | jvm 1 | 2014/12/14 14:47:27 | WrapperSimpleApp Error: at com.ibm.tpc.monitoring.start.Launcher.main(Launcher.java:15) INFO | jvm 1 | 2014/12/14 14:47:27 | WrapperSimpleApp Error: at sun.reflect.NativeMethodAccessorImpl.invoke0(Native Method) INFO | jvm 1 | 2014/12/14 14:47:27 | WrapperSimpleApp Error: at sun.reflect.NativeMethodAccessorImpl.invoke(NativeMethodAccessorImpl.java:57) INFO | jvm 1 | 2014/12/14 14:47:27 | WrapperSimpleApp Error: at sun.reflect.DelegatingMethodAccessorImpl.invoke(DelegatingMethodAccessorImpl.java:43) INFO | jvm 1 | 2014/12/14 14:47:27 | WrapperSimpleApp Error: at java.lang.reflect.Method.invoke(Method.java:606) INFO | jvm 1 | 2014/12/14 14:47:27 | WrapperSimpleApp Error: at org.tanukisoftware.wrapper.WrapperSimpleApp.run(WrapperSimpleApp.java:290) INFO | jvm 1 | 2014/12/14 14:47:27 | WrapperSimpleApp Error: at java.lang.Thread.run(Thread.java:745) INFO | jvm 1 | 2014/12/14 14:47:27 | WrapperSimpleApp Error: Caused by: java.lang.ClassNotFoundException: org.apache.log4j.PropertyConfigurator INFO | jvm 1 | 2014/12/14 14:47:27 | WrapperSimpleApp Error: at java.net.URLClassLoader$1.run(URLClassLoader.java:366) INFO | jvm 1 | 2014/12/14 14:47:27 | WrapperSimpleApp Error: at java.net.URLClassLoader$1.run(URLClassLoader.java:355) INFO | jvm 1 | 2014/12/14 14:47:27 | WrapperSimpleApp Error: at java.security.AccessController.doPrivileged(Native Method) INFO | jvm 1 | 2014/12/14 14:47:27 | WrapperSimpleApp Error: at java.net.URLClassLoader.findClass(URLClassLoader.java:354) INFO | jvm 1 | 2014/12/14 14:47:27 | WrapperSimpleApp Error: at java.lang.ClassLoader.loadClass(ClassLoader.java:425) INFO | jvm 1 | 2014/12/14 14:47:27 | WrapperSimpleApp Error: at sun.misc.Launcher$AppClassLoader.loadClass(Launcher.java:308) INFO | jvm 1 | 2014/12/14 14:47:27 | WrapperSimpleApp Error: at java.lang.ClassLoader.loadClass(ClassLoader.java:358) INFO | jvm 1 | 2014/12/14 14:47:27 | WrapperSimpleApp Error: ... 7 more ******************************************** jar的主程序是这样的: import org.apache.log4j.PropertyConfigurator; import org.springframework.context.ApplicationContext; import org.springframework.context.support.ClassPathXmlApplicationContext; public class Launcher { public static void main(String[] args) { PropertyConfigurator .configure(""); ApplicationContext context = new ClassPathXmlApplicationContext( "spring/BeanLocations.xml");
maven项目编译时jar包冲突相关问题
从开源代码上拷下来一个源码学习,执行mvn clean install时报错: [WARNING] Error injecting: aQute.bnd.maven.plugin.BndMavenPlugin java.lang.NoClassDefFoundError: org/codehaus/plexus/util/Scanner at java.lang.Class.getDeclaredConstructors0(Native Method) at java.lang.Class.privateGetDeclaredConstructors(Class.java:2671) at java.lang.Class.getDeclaredConstructors(Class.java:2020) at com.google.inject.spi.InjectionPoint.forConstructorOf(InjectionPoint.java:245) at com.google.inject.internal.ConstructorBindingImpl.create(ConstructorBindingImpl.java:99) at com.google.inject.internal.InjectorImpl.createUninitializedBinding(InjectorImpl.java:658) at com.google.inject.internal.InjectorImpl.createJustInTimeBinding(InjectorImpl.java:882) at com.google.inject.internal.InjectorImpl.createJustInTimeBindingRecursive(InjectorImpl.java:805) at com.google.inject.internal.InjectorImpl.getJustInTimeBinding(InjectorImpl.java:282) at com.google.inject.internal.InjectorImpl.getBindingOrThrow(InjectorImpl.java:214) at com.google.inject.internal.InjectorImpl.getProviderOrThrow(InjectorImpl.java:1006) at com.google.inject.internal.InjectorImpl.getProvider(InjectorImpl.java:1038) at com.google.inject.internal.InjectorImpl.getProvider(InjectorImpl.java:1001) at com.google.inject.internal.InjectorImpl.getInstance(InjectorImpl.java:1051) at org.eclipse.sisu.space.AbstractDeferredClass.get(AbstractDeferredClass.java:48) at com.google.inject.internal.ProviderInternalFactory.provision(ProviderInternalFactory.java:81) at com.google.inject.internal.InternalFactoryToInitializableAdapter.provision(InternalFactoryToInitializableAdapter.java:53) at com.google.inject.internal.ProviderInternalFactory$1.call(ProviderInternalFactory.java:65) at com.google.inject.internal.ProvisionListenerStackCallback$Provision.provision(ProvisionListenerStackCallback.java:115) ........ Caused by: java.lang.ClassNotFoundException: org.codehaus.plexus.util.Scanner ........ [INFO] ------------------------------------------------------------------------ [INFO] BUILD FAILURE [INFO] ------------------------------------------------------------------------ [INFO] Total time: 4.616 s [INFO] Finished at: 2017-11-20T15:08:13+08:00 [INFO] Final Memory: 17M/201M [INFO] ------------------------------------------------------------------------ [ERROR] Failed to execute goal biz.aQute.bnd:bnd-maven-plugin:3.1.0:bnd-process (default) on project gson: Execution default of goal biz.aQute.bnd:bnd-maven-plugin:3.1.0:bnd-process failed: A required class was missing while executing biz.aQute.bnd:bnd-maven-plugin:3.1.0:bnd-process: org/codehaus/plexus/util/Scanner [ERROR] ----------------------------------------------------- [ERROR] realm = plugin>biz.aQute.bnd:bnd-maven-plugin:3.1.0 [ERROR] strategy = org.codehaus.plexus.classworlds.strategy.SelfFirstStrategy [ERROR] urls[0] = file:/Users/dasouche/.m2/repository/biz/aQute/bnd/bnd-maven-plugin/3.1.0/bnd-maven-plugin-3.1.0.jar [ERROR] urls[1] = file:/Users/dasouche/.m2/repository/org/sonatype/plexus/plexus-build-api/0.0.7/plexus-build-api-0.0.7.jar [ERROR] urls[2] = file:/Users/dasouche/.m2/repository/biz/aQute/bnd/biz.aQute.bndlib/3.1.0/biz.aQute.bndlib-3.1.0.jar [ERROR] urls[3] = file:/Users/dasouche/.m2/repository/org/codehaus/plexus/plexus-utils/1.1/plexus-utils-1.1.jar [ERROR] Number of foreign imports: 1 [ERROR] import: Entry[import from realm ClassRealm[maven.api, parent: null]] [ERROR] [ERROR] ----------------------------------------------------- [ERROR] : org.codehaus.plexus.util.Scanner [ERROR] -> [Help 1] [ERROR] [ERROR] To see the full stack trace of the errors, re-run Maven with the -e switch. [ERROR] Re-run Maven using the -X switch to enable full debug logging. [ERROR] [ERROR] For more information about the errors and possible solutions, please read the following articles: [ERROR] [Help 1] http://cwiki.apache.org/confluence/display/MAVEN/PluginContainerException 在项目的pom.xml文件中添加jar包依赖明确版本号: <dependency> <groupId>org.codehaus.plexus</groupId> <artifactId>plexus-utils</artifactId> <version>3.0.5</version> </dependency> 依然报上面的错误。 请问各位大神这个是什么问题,怎么解决?
maven项目导入到Eclipse中红色叹号!
最近看一个开源CMS系统Magnolia。 环境: Ubuntu14,Eclipse4.4 for j2ee,jdk1.6,tomcat6,maven2.2.1 按照文档,写了一个小项目。用maven。在命令行创建的项目结构大概: myProject ----myProject-webapp ----myTemplateModule 下面两个是上面的module。 在命令行中已经clean install成功。 但是导入到Eclipse中myProject-webapp项目的图标上有红色感叹号。 ![CSDN移动问答][1] 网上说是jar引用问题。我在buildpath》library中没有发现有问题的jar啊,也尝试过order and export,sellect all。打开.classpath里面貌似也没有引用什么jar啊。内容如下:.classpath. 另外,myProject项目上还有个红叉,其中的一个文件引用的某个类,Eclipse说找不到,可是我在library中都找到这个类了。 ![CSDN移动问答][2] 后来,我不管这个红色提醒,就把myProject-webapp部署在tomcat上面了。运行错误: 2014-9-4 18:25:42 org.apache.catalina.startup.TldConfig tldScanJar 严重: Exception processing JAR at resource path /home/user/.m2/repository/com/vaadin/vaadin-shared/7.1.7/vaadin-shared-7.1.7.jar in context /myProject-webapp java.util.zip.ZipException: error in opening zip file at java.util.zip.ZipFile.open(Native Method) at java.util.zip.ZipFile.<init>(ZipFile.java:127) at java.util.jar.JarFile.<init>(JarFile.java:136) at java.util.jar.JarFile.<init>(JarFile.java:100) at org.apache.catalina.startup.TldConfig.tldScanJar(TldConfig.java:393) at org.apache.catalina.startup.TldConfig.execute(TldConfig.java:320) at org.apache.catalina.startup.TldConfig.lifecycleEvent(TldConfig.java:688) at org.apache.catalina.util.LifecycleSupport.fireLifecycleEvent(LifecycleSupport.java:142) at org.apache.catalina.core.StandardContext.start(StandardContext.java:4616) at org.apache.catalina.core.ContainerBase.start(ContainerBase.java:1057) at org.apache.catalina.core.StandardHost.start(StandardHost.java:822) at org.apache.catalina.core.ContainerBase.start(ContainerBase.java:1057) at org.apache.catalina.core.StandardEngine.start(StandardEngine.java:463) at org.apache.catalina.core.StandardService.start(StandardService.java:525) at org.apache.catalina.core.StandardServer.start(StandardServer.java:754) at org.apache.catalina.startup.Catalina.start(Catalina.java:595) at sun.reflect.NativeMethodAccessorImpl.invoke0(Native Method) at sun.reflect.NativeMethodAccessorImpl.invoke(NativeMethodAccessorImpl.java:39) at sun.reflect.DelegatingMethodAccessorImpl.invoke(DelegatingMethodAccessorImpl.java:25) at java.lang.reflect.Method.invoke(Method.java:597) at org.apache.catalina.startup.Bootstrap.start(Bootstrap.java:289) at org.apache.catalina.startup.Bootstrap.main(Bootstrap.java:414) 2014-9-4 18:25:42 org.apache.catalina.startup.TldConfig tldScanJar 严重: Exception processing JAR at resource path /home/user/.m2/repository/org/jsoup/jsoup/1.6.3/jsoup-1.6.3.jar in context /myProject-webapp ............ ......... **附件:** .classpath <?xml version="1.0" encoding="UTF-8"?> <classpath> <classpathentry kind="src" output="target/classes" path="src/main/java"> <attributes> <attribute name="optional" value="true"/> <attribute name="maven.pomderived" value="true"/> </attributes> </classpathentry> <classpathentry kind="src" output="target/test-classes" path="src/test/java"> <attributes> <attribute name="optional" value="true"/> <attribute name="maven.pomderived" value="true"/> </attributes> </classpathentry> <classpathentry exported="true" kind="con" path="org.eclipse.m2e.MAVEN2_CLASSPATH_CONTAINER"> <attributes> <attribute name="maven.pomderived" value="true"/> <attribute name="org.eclipse.jst.component.dependency" value="/WEB-INF/lib"/> </attributes> </classpathentry> <classpathentry kind="con" path="org.eclipse.jst.server.core.container/org.eclipse.jst.server.tomcat.runtimeTarget/Apache Tomcat v6.0"> <attributes> <attribute name="owner.project.facets" value="jst.web"/> </attributes> </classpathentry> <classpathentry kind="con" path="org.eclipse.jdt.launching.JRE_CONTAINER/org.eclipse.jdt.internal.debug.ui.launcher.StandardVMType/jdk1.6.0_45"> <attributes> <attribute name="owner.project.facets" value="java"/> </attributes> </classpathentry> <classpathentry kind="output" path="target/classes"/> </classpath> [1]: http://my.csdn.net/my/album/detail/1784229 [2]: http://my.csdn.net/my/album/detail/1784231
关于MAVEN配置ORACLE数据库的问题
我安装的是MAVEN3.2.3。然后在CMD中,输入 mvn install:install-file -DgroupId=com.oracle -DartifactId=ojdbc6 -Dversion=11.2.0.1.0 -Dpackaging=jar -Dfile=E:\app\admin\product\11.2.0\dbhome_1\jdbc\lib\ojdbc6.jar BUILD SUCCESS。 我再回到MAVEN仓库中看,也确实是有了这个JAR包。 但是跑后台的时候,就是找不到这个驱动。已经困扰两天了。实属无奈。希望大神们帮帮忙。 org.mybatis.spring.MyBatisSystemException: nested exception is org.apache.ibatis.exceptions.PersistenceException: ### Error querying database. Cause: org.springframework.jdbc.CannotGetJdbcConnectionException: Could not get JDBC Connection; nested exception is org.apache.commons.dbcp.SQLNestedException: Cannot load JDBC driver class 'oracle.jdbc.OracleDrive' ### The error may exist in file [C:\Users\admin\Desktop\MUDAO\mudao\target\classes\com\cn\mudao\mapping\UserMapper.xml] ### The error may involve com.cn.mudao.dao.IUserDao.selectByPrimaryKey ### The error occurred while executing a query ### Cause: org.springframework.jdbc.CannotGetJdbcConnectionException: Could not get JDBC Connection; nested exception is org.apache.commons.dbcp.SQLNestedException: Cannot load JDBC driver class 'oracle.jdbc.OracleDrive' at org.mybatis.spring.MyBatisExceptionTranslator.translateExceptionIfPossible(MyBatisExceptionTranslator.java:75) at org.mybatis.spring.SqlSessionTemplate$SqlSessionInterceptor.invoke(SqlSessionTemplate.java:371) at com.sun.proxy.$Proxy16.selectOne(Unknown Source) at org.mybatis.spring.SqlSessionTemplate.selectOne(SqlSessionTemplate.java:163) at org.apache.ibatis.binding.MapperMethod.execute(MapperMethod.java:68) at org.apache.ibatis.binding.MapperProxy.invoke(MapperProxy.java:52) at com.sun.proxy.$Proxy17.selectByPrimaryKey(Unknown Source) at com.cn.mudao.service.impl.UserServiceImpl.getUserById(UserServiceImpl.java:18) at org.zsl.testmybatis.TestMyBatis.test1(TestMyBatis.java:35) at sun.reflect.NativeMethodAccessorImpl.invoke0(Native Method) at sun.reflect.NativeMethodAccessorImpl.invoke(NativeMethodAccessorImpl.java:57) at sun.reflect.DelegatingMethodAccessorImpl.invoke(DelegatingMethodAccessorImpl.java:43) at java.lang.reflect.Method.invoke(Method.java:606) at org.junit.runners.model.FrameworkMethod$1.runReflectiveCall(FrameworkMethod.java:47) at org.junit.internal.runners.model.ReflectiveCallable.run(ReflectiveCallable.java:12) at org.junit.runners.model.FrameworkMethod.invokeExplosively(FrameworkMethod.java:44) at org.junit.internal.runners.statements.InvokeMethod.evaluate(InvokeMethod.java:17) at org.springframework.test.context.junit4.statements.RunBeforeTestMethodCallbacks.evaluate(RunBeforeTestMethodCallbacks.java:74) at org.springframework.test.context.junit4.statements.RunAfterTestMethodCallbacks.evaluate(RunAfterTestMethodCallbacks.java:83) at org.springframework.test.context.junit4.statements.SpringRepeat.evaluate(SpringRepeat.java:72) at org.springframework.test.context.junit4.SpringJUnit4ClassRunner.runChild(SpringJUnit4ClassRunner.java:232) at org.springframework.test.context.junit4.SpringJUnit4ClassRunner.runChild(SpringJUnit4ClassRunner.java:89) at org.junit.runners.ParentRunner$3.run(ParentRunner.java:238) at org.junit.runners.ParentRunner$1.schedule(ParentRunner.java:63) at org.junit.runners.ParentRunner.runChildren(ParentRunner.java:236) at org.junit.runners.ParentRunner.access$000(ParentRunner.java:53) at org.junit.runners.ParentRunner$2.evaluate(ParentRunner.java:229) at org.springframework.test.context.junit4.statements.RunBeforeTestClassCallbacks.evaluate(RunBeforeTestClassCallbacks.java:61) at org.springframework.test.context.junit4.statements.RunAfterTestClassCallbacks.evaluate(RunAfterTestClassCallbacks.java:71) at org.junit.runners.ParentRunner.run(ParentRunner.java:309) at org.springframework.test.context.junit4.SpringJUnit4ClassRunner.run(SpringJUnit4ClassRunner.java:175) at org.eclipse.jdt.internal.junit4.runner.JUnit4TestReference.run(JUnit4TestReference.java:50) at org.eclipse.jdt.internal.junit.runner.TestExecution.run(TestExecution.java:38) at org.eclipse.jdt.internal.junit.runner.RemoteTestRunner.runTests(RemoteTestRunner.java:467) at org.eclipse.jdt.internal.junit.runner.RemoteTestRunner.runTests(RemoteTestRunner.java:683) at org.eclipse.jdt.internal.junit.runner.RemoteTestRunner.run(RemoteTestRunner.java:390) at org.eclipse.jdt.internal.junit.runner.RemoteTestRunner.main(RemoteTestRunner.java:197) Caused by: org.apache.ibatis.exceptions.PersistenceException: ### Error querying database. Cause: org.springframework.jdbc.CannotGetJdbcConnectionException: Could not get JDBC Connection; nested exception is org.apache.commons.dbcp.SQLNestedException: Cannot load JDBC driver class 'oracle.jdbc.OracleDrive' ### The error may exist in file [C:\Users\admin\Desktop\MUDAO\mudao\target\classes\com\cn\mudao\mapping\UserMapper.xml] ### The error may involve com.cn.mudao.dao.IUserDao.selectByPrimaryKey ### The error occurred while executing a query ### Cause: org.springframework.jdbc.CannotGetJdbcConnectionException: Could not get JDBC Connection; nested exception is org.apache.commons.dbcp.SQLNestedException: Cannot load JDBC driver class 'oracle.jdbc.OracleDrive' at org.apache.ibatis.exceptions.ExceptionFactory.wrapException(ExceptionFactory.java:26) at org.apache.ibatis.session.defaults.DefaultSqlSession.selectList(DefaultSqlSession.java:111) at org.apache.ibatis.session.defaults.DefaultSqlSession.selectList(DefaultSqlSession.java:102) at org.apache.ibatis.session.defaults.DefaultSqlSession.selectOne(DefaultSqlSession.java:66) at sun.reflect.NativeMethodAccessorImpl.invoke0(Native Method) at sun.reflect.NativeMethodAccessorImpl.invoke(NativeMethodAccessorImpl.java:57) at sun.reflect.DelegatingMethodAccessorImpl.invoke(DelegatingMethodAccessorImpl.java:43) at java.lang.reflect.Method.invoke(Method.java:606) at org.mybatis.spring.SqlSessionTemplate$SqlSessionInterceptor.invoke(SqlSessionTemplate.java:358) ... 35 more Caused by: org.springframework.jdbc.CannotGetJdbcConnectionException: Could not get JDBC Connection; nested exception is org.apache.commons.dbcp.SQLNestedException: Cannot load JDBC driver class 'oracle.jdbc.OracleDrive' at org.springframework.jdbc.datasource.DataSourceUtils.getConnection(DataSourceUtils.java:80) at org.mybatis.spring.transaction.SpringManagedTransaction.openConnection(SpringManagedTransaction.java:81) at org.mybatis.spring.transaction.SpringManagedTransaction.getConnection(SpringManagedTransaction.java:67) at org.apache.ibatis.executor.BaseExecutor.getConnection(BaseExecutor.java:279) at org.apache.ibatis.executor.SimpleExecutor.prepareStatement(SimpleExecutor.java:72) at org.apache.ibatis.executor.SimpleExecutor.doQuery(SimpleExecutor.java:59) at org.apache.ibatis.executor.BaseExecutor.queryFromDatabase(BaseExecutor.java:267) at org.apache.ibatis.executor.BaseExecutor.query(BaseExecutor.java:137) at org.apache.ibatis.executor.CachingExecutor.query(CachingExecutor.java:96) at org.apache.ibatis.executor.CachingExecutor.query(CachingExecutor.java:77) at org.apache.ibatis.session.defaults.DefaultSqlSession.selectList(DefaultSqlSession.java:108) ... 42 more Caused by: org.apache.commons.dbcp.SQLNestedException: Cannot load JDBC driver class 'oracle.jdbc.OracleDrive' at org.apache.commons.dbcp.BasicDataSource.createDataSource(BasicDataSource.java:1136) at org.apache.commons.dbcp.BasicDataSource.getConnection(BasicDataSource.java:880) at org.springframework.jdbc.datasource.DataSourceUtils.doGetConnection(DataSourceUtils.java:111) at org.springframework.jdbc.datasource.DataSourceUtils.getConnection(DataSourceUtils.java:77) ... 52 more Caused by: java.lang.ClassNotFoundException: oracle.jdbc.OracleDrive at java.net.URLClassLoader$1.run(URLClassLoader.java:366) at java.net.URLClassLoader$1.run(URLClassLoader.java:355) at java.security.AccessController.doPrivileged(Native Method) at java.net.URLClassLoader.findClass(URLClassLoader.java:354) at java.lang.ClassLoader.loadClass(ClassLoader.java:424) at sun.misc.Launcher$AppClassLoader.loadClass(Launcher.java:308) at java.lang.ClassLoader.loadClass(ClassLoader.java:357) at java.lang.Class.forName0(Native Method) at java.lang.Class.forName(Class.java:190) at org.apache.commons.dbcp.BasicDataSource.createDataSource(BasicDataSource.java:1130) ... 55 more
maven ear包的问题!
From file: /home/zx/workspace/adboard2009/adboard-chn-ear/pom.xml Reason: Cannot copy a directory: /home/zx/workspace/adboard2009/adboard-core/entity-jar/target/classes; Did you package/install com.ericsson.adboard:entity-jar:jar:3.0.0-alpha:compile? 原POM如下 <project xmlns="http://maven.apache.org/POM/4.0.0" xmlns:xsi="http://www.w3.org/2001/XMLSchema-instance" xsi:schemaLocation="http://maven.apache.org/POM/4.0.0 http://maven.apache.org/xsd/maven-4.0.0.xsd"> <modelVersion>4.0.0</modelVersion> <parent> <groupId>com.ericsson.adboard</groupId> <artifactId>adboard</artifactId> <version>3.0.0-alpha</version> </parent> <artifactId>adboard-chn-ear</artifactId> <packaging>ear</packaging> <name>Adboard China EAR</name> <dependencies> <dependency> <groupId>com.ericsson.adboard</groupId> <artifactId>entity-jar</artifactId> <version>3.0.0-alpha</version> <type>jar</type> </dependency> </dependencies> <build> <plugins> <plugin> <groupId>org.apache.maven.plugins</groupId> <artifactId>maven-ear-plugin</artifactId> <configuration> <modules> <jarModule> <groupId>com.ericsson.adboard</groupId> <artifactId>entity-jar</artifactId> <bundleDir>lib</bundleDir> </jarModule> </modules> </configuration> </plugin> </plugins> </build> </project>
请问:在SSM框架中,引入了oracle的jar包 ,依赖是添加成功了的,但是使用时报异常
请问:在SSM框架中,引入了oracle的jar包 ,依赖是添加成功了的,但是使用mybatis-generator:generate时报异常 这是报错代码 [INFO] Scanning for projects... [INFO] [INFO] ------------------------------------------------------------------------ [INFO] Building ssm Maven Webapp 1.0-SNAPSHOT [INFO] ------------------------------------------------------------------------ [INFO] [INFO] --- mybatis-generator-maven-plugin:1.3.0:generate (default-cli) @ ssm --- [INFO] ------------------------------------------------------------------------ [INFO] BUILD FAILURE [INFO] ------------------------------------------------------------------------ [INFO] Total time: 0.562 s [INFO] Finished at: 2017-09-08T09:46:14+08:00 java.lang.RuntimeException: Exception getting JDBC Driver at org.mybatis.generator.internal.db.ConnectionFactory.getDriver(ConnectionFactory.java:84) at org.mybatis.generator.internal.db.ConnectionFactory.getConnection(ConnectionFactory.java:53) at org.mybatis.generator.config.Context.getConnection(Context.java:487) at org.mybatis.generator.config.Context.introspectTables(Context.java:396) at org.mybatis.generator.api.MyBatisGenerator.generate(MyBatisGenerator.java:222) at org.mybatis.generator.maven.MyBatisGeneratorMojo.execute(MyBatisGeneratorMojo.java:184) at org.apache.maven.plugin.DefaultBuildPluginManager.executeMojo(DefaultBuildPluginManager.java:134) at org.apache.maven.lifecycle.internal.MojoExecutor.execute(MojoExecutor.java:207) at org.apache.maven.lifecycle.internal.MojoExecutor.execute(MojoExecutor.java:153) at org.apache.maven.lifecycle.internal.MojoExecutor.execute(MojoExecutor.java:145) at org.apache.maven.lifecycle.internal.LifecycleModuleBuilder.buildProject(LifecycleModuleBuilder.java:116) at org.apache.maven.lifecycle.internal.LifecycleModuleBuilder.buildProject(LifecycleModuleBuilder.java:80) at org.apache.maven.lifecycle.internal.builder.singlethreaded.SingleThreadedBuilder.build(SingleThreadedBuilder.java:51) at org.apache.maven.lifecycle.internal.LifecycleStarter.execute(LifecycleStarter.java:128) at org.apache.maven.DefaultMaven.doExecute(DefaultMaven.java:307) at org.apache.maven.DefaultMaven.doExecute(DefaultMaven.java:193) at org.apache.maven.DefaultMaven.execute(DefaultMaven.java:106) at org.apache.maven.cli.MavenCli.execute(MavenCli.java:863) at org.apache.maven.cli.MavenCli.doMain(MavenCli.java:288) at org.apache.maven.cli.MavenCli.main(MavenCli.java:199) at sun.reflect.NativeMethodAccessorImpl.invoke0(Native Method) at sun.reflect.NativeMethodAccessorImpl.invoke(NativeMethodAccessorImpl.java:62) at sun.reflect.DelegatingMethodAccessorImpl.invoke(DelegatingMethodAccessorImpl.java:43) at java.lang.reflect.Method.invoke(Method.java:498) at org.codehaus.plexus.classworlds.launcher.Launcher.launchEnhanced(Launcher.java:289) at org.codehaus.plexus.classworlds.launcher.Launcher.launch(Launcher.java:229) at org.codehaus.plexus.classworlds.launcher.Launcher.mainWithExitCode(Launcher.java:415) at org.codehaus.plexus.classworlds.launcher.Launcher.main(Launcher.java:356) Caused by: java.lang.**_ClassNotFoundException: oracle.jdbc.driver.OracleDriver_** at org.codehaus.plexus.classworlds.strategy.SelfFirstStrategy.loadClass(SelfFirstStrategy.java:50) at org.codehaus.plexus.classworlds.realm.ClassRealm.unsynchronizedLoadClass(ClassRealm.java:271) at org.codehaus.plexus.classworlds.realm.ClassRealm.loadClass(ClassRealm.java:247) at org.codehaus.plexus.classworlds.realm.ClassRealm.loadClass(ClassRealm.java:239) at java.lang.Class.forName0(Native Method) at java.lang.Class.forName(Class.java:264) at org.mybatis.generator.internal.ObjectFactory.externalClassForName(ObjectFactory.java:89) at org.mybatis.generator.internal.db.ConnectionFactory.getDriver(ConnectionFactory.java:81) ... 27 more [INFO] Final Memory: 9M/77M [INFO] ------------------------------------------------------------------------ [ERROR] Failed to execute goal org.mybatis.generator:mybatis-generator-maven-plugin:1.3.0:generate (default-cli) on project ssm: Exception getting JDBC Driver -> [Help 1] [ERROR] [ERROR] To see the full stack trace of the errors, re-run Maven with the -e switch. [ERROR] Re-run Maven using the -X switch to enable full debug logging. [ERROR] [ERROR] For more information about the errors and possible solutions, please read the following articles: [ERROR] [Help 1] http://cwiki.apache.org/confluence/display/MAVEN/MojoExecutionException 这是pom文件配置 <project xmlns="http://maven.apache.org/POM/4.0.0" xmlns:xsi="http://www.w3.org/2001/XMLSchema-instance" xsi:schemaLocation="http://maven.apache.org/POM/4.0.0 http://maven.apache.org/maven-v4_0_0.xsd"> <modelVersion>4.0.0</modelVersion> <groupId>com.chinasofti.ssmdemo</groupId> <artifactId>ssm</artifactId> <packaging>war</packaging> <version>1.0-SNAPSHOT</version> <name>ssm Maven Webapp</name> <url>http://maven.apache.org</url> <properties> <aspectj.version>1.8.9</aspectj.version> <jackson.version>1.9.13</jackson.version> <spring.version>4.3.4.RELEASE</spring.version> </properties> <dependencies> <!-- mvn install:install-file -DgroupId=com.oracle -DartifactId=ojdbc6 -Dversion=11.2.0.1.0 -Dpackaging=jar -Dfile=ojdbc6.jar --> <dependency> <groupId>com.oracle</groupId> <artifactId>ojdbc6</artifactId> <version>11.2.0.1.0</version> </dependency> <dependency> <groupId>junit</groupId> <artifactId>junit</artifactId> <version>3.8.1</version> <scope>test</scope> </dependency> <!-- servlet API --> <dependency> <groupId>javax.servlet</groupId> <artifactId>javax.servlet-api</artifactId> <version>3.1.0</version> </dependency> <!-- jstl֧�� --> <dependency> <groupId>javax.servlet</groupId> <artifactId>jstl</artifactId> <version>1.1.2</version> <type>jar</type> </dependency> <dependency> <groupId>taglibs</groupId> <artifactId>standard</artifactId> <version>1.1.2</version> <type>jar</type> </dependency> <!-- spring --> <dependency> <groupId>org.springframework</groupId> <artifactId>spring-webmvc</artifactId> <version>${spring.version}</version> </dependency> <dependency> <groupId>org.springframework</groupId> <artifactId>spring-orm</artifactId> <version>${spring.version}</version> </dependency> <!-- aspectj --> <dependency> <groupId>org.aspectj</groupId> <artifactId>aspectjrt</artifactId> <version>${aspectj.version}</version> </dependency> <dependency> <groupId>org.aspectj</groupId> <artifactId>aspectjweaver</artifactId> <version>${aspectj.version}</version> </dependency> <!-- jackson --> <dependency> <groupId>com.fasterxml.jackson.core</groupId> <artifactId>jackson-core</artifactId> <version>2.7.5</version> </dependency> <dependency> <groupId>com.fasterxml.jackson.core</groupId> <artifactId>jackson-databind</artifactId> <version>2.7.5</version> </dependency> <dependency> <groupId>com.fasterxml.jackson.core</groupId> <artifactId>jackson-annotations</artifactId> <version>2.7.5</version> </dependency> <dependency> <groupId>org.hibernate</groupId> <artifactId>hibernate-validator</artifactId> <version>5.3.4.Final</version> </dependency> <!-- �ļ��ϴ� --> <dependency> <groupId>commons-fileupload</groupId> <artifactId>commons-fileupload</artifactId> <version>1.3.3</version> </dependency> <!-- �־û� --> <dependency> <groupId>org.mybatis</groupId> <artifactId>mybatis</artifactId> <version>3.4.2</version> </dependency> <dependency> <groupId>org.mybatis</groupId> <artifactId>mybatis-spring</artifactId> <version>1.3.1</version> </dependency> <dependency> <groupId>mysql</groupId> <artifactId>mysql-connector-java</artifactId> <version>5.1.38</version> </dependency> <dependency> <groupId>commons-dbcp</groupId> <artifactId>commons-dbcp</artifactId> <version>1.4</version> </dependency> </dependencies> <build> <finalName>ssm</finalName> <plugins> <plugin> <groupId>org.apache.maven.plugins</groupId> <artifactId>maven-compiler-plugin</artifactId> <version>3.6.0</version> <configuration> <source>8</source> <target>8</target> <encoding>UTF-8</encoding> </configuration> </plugin> <plugin> <groupId>org.mybatis.generator</groupId> <artifactId>mybatis-generator-maven-plugin</artifactId> <version>1.3.0</version> <dependencies> <dependency> <groupId>mysql</groupId> <artifactId>mysql-connector-java</artifactId> <version>5.1.38</version> </dependency> </dependencies> </plugin> <plugin> <groupId>org.apache.maven.plugins</groupId> <artifactId>maven-dependency-plugin</artifactId> <executions> <execution> <id>copy-dependencies</id> <goals> <goal>copy-dependencies</goal> </goals> <configuration> <excludeArtifactIds>servlet-api,jsp-api</excludeArtifactIds> <outputDirectory>web/WEB-INF/lib</outputDirectory> <overWriteReleases>false</overWriteReleases> <overWriteSnapshots>true</overWriteSnapshots> </configuration> </execution> </executions> </plugin> </plugins> </build> </project> maven库是添加了oracl的jar包的![图片说明](https://img-ask.csdn.net/upload/201709/08/1504835578_584970.png)
springboot +shiro项目打成jar或war包后shiroFilter报错,无法创建bean shiroFilter
在STS上正常运行,mvnclean 和install后打成的jar包和war包都报错,报错内容如下: ``` org.springframework.beans.factory.BeanCreationException: Error creating bean with name 'shiroFilter' defined in class path resource [com/livinglibrary/config/ShiroConfig.class]: BeanPostProcessor before instantiation of bean failed; nested exception is org.springframework.beans.factory.UnsatisfiedDependencyException: Error creating bean with name 'authorizationAttributeSourceAdvisor' defined in class path resource [com/livinglibrary/config/ShiroConfig.class]: Unsatisfied dependency expressed through method 'authorizationAttributeSourceAdvisor' parameter 0; nested exception is org.springframework.beans.factory.BeanCreationException: Error creating bean with name 'securityManager' defined in class path resource [com/livinglibrary/config/ShiroConfig.class]: Bean instantiation via factory method failed; nested exception is org.springframework.beans.BeanInstantiationException: Failed to instantiate [org.apache.shiro.mgt.SecurityManager]: Factory method 'securityManager' threw exception; nested exception is org.springframework.beans.factory.BeanCreationException: Error creating bean with name 'myShiroRealm': Injection of resource dependencies failed; nested exception is org.springframework.beans.factory.BeanCreationException: Error creating bean with name 'shiroService': Injection of resource dependencies failed; nested exception is org.springframework.beans.factory.UnsatisfiedDependencyException: Error creating bean with name 'userMapper' defined in URL [jar:file:/F:/SpringBootProjects/livinglibrary/target/livinglibrary-0.0.1-SNAPSHOT.jar!/BOOT-INF/classes!/com/livinglibrary/mapper/UserMapper.class]: Unsatisfied dependency expressed through bean property 'sqlSessionFactory'; nested exception is org.springframework.beans.factory.UnsatisfiedDependencyException: Error creating bean with name 'org.mybatis.spring.boot.autoconfigure.MybatisAutoConfiguration': Unsatisfied dependency expressed through constructor parameter 0; nested exception is org.springframework.beans.factory.BeanCreationException: Error creating bean with name 'mybatis-org.mybatis.spring.boot.autoconfigure.MybatisProperties': Initialization of bean failed; nested exception is java.lang.NoClassDefFoundError: javax/xml/bind/ValidationException at org.springframework.beans.factory.support.AbstractAutowireCapableBeanFactory.createBean(AbstractAutowireCapableBeanFactory.java:478) ~[spring-beans-4.3.3.RELEASE.jar!/:4.3.3.RELEASE] at org.springframework.beans.factory.support.AbstractBeanFactory$1.getObject(AbstractBeanFactory.java:306) ~[spring-beans-4.3.3.RELEASE.jar!/:4.3.3.RELEASE] at org.springframework.beans.factory.support.DefaultSingletonBeanRegistry.getSingleton(DefaultSingletonBeanRegistry.java:230) ~[spring-beans-4.3.3.RELEASE.jar!/:4.3.3.RELEASE] at org.springframework.beans.factory.support.AbstractBeanFactory.doGetBean(AbstractBeanFactory.java:302) ~[spring-beans-4.3.3.RELEASE.jar!/:4.3.3.RELEASE] at org.springframework.beans.factory.support.AbstractBeanFactory.getBean(AbstractBeanFactory.java:202) ~[spring-beans-4.3.3.RELEASE.jar!/:4.3.3.RELEASE] at org.springframework.context.support.PostProcessorRegistrationDelegate.registerBeanPostProcessors(PostProcessorRegistrationDelegate.java:240) ~[spring-context-4.3.3.RELEASE.jar!/:4.3.3.RELEASE] at org.springframework.context.support.AbstractApplicationContext.registerBeanPostProcessors(AbstractApplicationContext.java:697) ~[spring-context-4.3.3.RELEASE.jar!/:4.3.3.RELEASE] at org.springframework.context.support.AbstractApplicationContext.refresh(AbstractApplicationContext.java:526) ~[spring-context-4.3.3.RELEASE.jar!/:4.3.3.RELEASE] at org.springframework.boot.context.embedded.EmbeddedWebApplicationContext.refresh(EmbeddedWebApplicationContext.java:122) ~[spring-boot-1.4.1.RELEASE.jar!/:1.4.1.RELEASE] at org.springframework.boot.SpringApplication.refresh(SpringApplication.java:761) [spring-boot-1.4.1.RELEASE.jar!/:1.4.1.RELEASE] at org.springframework.boot.SpringApplication.refreshContext(SpringApplication.java:371) [spring-boot-1.4.1.RELEASE.jar!/:1.4.1.RELEASE] at org.springframework.boot.SpringApplication.run(SpringApplication.java:315) [spring-boot-1.4.1.RELEASE.jar!/:1.4.1.RELEASE] at org.springframework.boot.SpringApplication.run(SpringApplication.java:1186) [spring-boot-1.4.1.RELEASE.jar!/:1.4.1.RELEASE] at org.springframework.boot.SpringApplication.run(SpringApplication.java:1175) [spring-boot-1.4.1.RELEASE.jar!/:1.4.1.RELEASE] at com.livinglibrary.App.main(App.java:65) [classes!/:0.0.1-SNAPSHOT] at java.base/jdk.internal.reflect.NativeMethodAccessorImpl.invoke0(Native Method) ~[na:na] at java.base/jdk.internal.reflect.NativeMethodAccessorImpl.invoke(Unknown Source) ~[na:na] at java.base/jdk.internal.reflect.DelegatingMethodAccessorImpl.invoke(Unknown Source) ~[na:na] at java.base/java.lang.reflect.Method.invoke(Unknown Source) ~[na:na] at org.springframework.boot.loader.MainMethodRunner.run(MainMethodRunner.java:48) [livinglibrary-0.0.1-SNAPSHOT.jar:0.0.1-SNAPSHOT] at org.springframework.boot.loader.Launcher.launch(Launcher.java:87) [livinglibrary-0.0.1-SNAPSHOT.jar:0.0.1-SNAPSHOT] at org.springframework.boot.loader.Launcher.launch(Launcher.java:50) [livinglibrary-0.0.1-SNAPSHOT.jar:0.0.1-SNAPSHOT] at org.springframework.boot.loader.JarLauncher.main(JarLauncher.java:58) [livinglibrary-0.0.1-SNAPSHOT.jar:0.0.1-SNAPSHOT] Caused by: org.springframework.beans.factory.UnsatisfiedDependencyException: Error creating bean with name 'authorizationAttributeSourceAdvisor' defined in class path resource [com/livinglibrary/config/ShiroConfig.class]: Unsatisfied dependency expressed through method 'authorizationAttributeSourceAdvisor' parameter 0; nested exception is org.springframework.beans.factory.BeanCreationException: Error creating bean with name 'securityManager' defined in class path resource [com/livinglibrary/config/ShiroConfig.class]: Bean instantiation via factory method failed; nested exception is org.springframework.beans.BeanInstantiationException: Failed to instantiate [org.apache.shiro.mgt.SecurityManager]: Factory method 'securityManager' threw exception; nested exception is org.springframework.beans.factory.BeanCreationException: Error creating bean with name 'myShiroRealm': Injection of resource dependencies failed; nested exception is org.springframework.beans.factory.BeanCreationException: Error creating bean with name 'shiroService': Injection of resource dependencies failed; nested exception is org.springframework.beans.factory.UnsatisfiedDependencyException: Error creating bean with name 'userMapper' defined in URL [jar:file:/F:/SpringBootProjects/livinglibrary/target/livinglibrary-0.0.1-SNAPSHOT.jar!/BOOT-INF/classes!/com/livinglibrary/mapper/UserMapper.class]: Unsatisfied dependency expressed through bean property 'sqlSessionFactory'; nested exception is org.springframework.beans.factory.UnsatisfiedDependencyException: Error creating bean with name 'org.mybatis.spring.boot.autoconfigure.MybatisAutoConfiguration': Unsatisfied dependency expressed through constructor parameter 0; nested exception is org.springframework.beans.factory.BeanCreationException: Error creating bean with name 'mybatis-org.mybatis.spring.boot.autoconfigure.MybatisProperties': Initialization of bean failed; nested exception is java.lang.NoClassDefFoundError: javax/xml/bind/ValidationException at org.springframework.beans.factory.support.ConstructorResolver.createArgumentArray(ConstructorResolver.java:749) ~[spring-beans-4.3.3.RELEASE.jar!/:4.3.3.RELEASE] at org.springframework.beans.factory.support.ConstructorResolver.instantiateUsingFactoryMethod(ConstructorResolver.java:467) ~[spring-beans-4.3.3.RELEASE.jar!/:4.3.3.RELEASE] at org.springframework.beans.factory.support.AbstractAutowireCapableBeanFactory.instantiateUsingFactoryMethod(AbstractAutowireCapableBeanFactory.java:1128) ~[spring-beans-4.3.3.RELEASE.jar!/:4.3.3.RELEASE] at org.springframework.beans.factory.support.AbstractAutowireCapableBeanFactory.createBeanInstance(AbstractAutowireCapableBeanFactory.java:1023) ~[spring-beans-4.3.3.RELEASE.jar!/:4.3.3.RELEASE] at org.springframework.beans.factory.support.AbstractAutowireCapableBeanFactory.doCreateBean(AbstractAutowireCapableBeanFactory.java:510) ~[spring-beans-4.3.3.RELEASE.jar!/:4.3.3.RELEASE] at org.springframework.beans.factory.support.AbstractAutowireCapableBeanFactory.createBean(AbstractAutowireCapableBeanFactory.java:482) ~[spring-beans-4.3.3.RELEASE.jar!/:4.3.3.RELEASE] at org.springframework.beans.factory.support.AbstractBeanFactory$1.getObject(AbstractBeanFactory.java:306) ~[spring-beans-4.3.3.RELEASE.jar!/:4.3.3.RELEASE] at org.springframework.beans.factory.support.DefaultSingletonBeanRegistry.getSingleton(DefaultSingletonBeanRegistry.java:230) ~[spring-beans-4.3.3.RELEASE.jar!/:4.3.3.RELEASE] at org.springframework.beans.factory.support.AbstractBeanFactory.doGetBean(AbstractBeanFactory.java:302) ~[spring-beans-4.3.3.RELEASE.jar!/:4.3.3.RELEASE] at org.springframework.beans.factory.support.AbstractBeanFactory.getBean(AbstractBeanFactory.java:202) ~[spring-beans-4.3.3.RELEASE.jar!/:4.3.3.RELEASE] at org.springframework.aop.framework.autoproxy.BeanFactoryAdvisorRetrievalHelper.findAdvisorBeans(BeanFactoryAdvisorRetrievalHelper.java:92) ~[spring-aop-4.3.3.RELEASE.jar!/:4.3.3.RELEASE] at org.springframework.aop.framework.autoproxy.AbstractAdvisorAutoProxyCreator.findCandidateAdvisors(AbstractAdvisorAutoProxyCreator.java:101) ~[spring-aop-4.3.3.RELEASE.jar!/:4.3.3.RELEASE] at org.springframework.aop.aspectj.annotation.AnnotationAwareAspectJAutoProxyCreator.findCandidateAdvisors(AnnotationAwareAspectJAutoProxyCreator.java:85) ~[spring-aop-4.3.3.RELEASE.jar!/:4.3.3.RELEASE] at org.springframework.aop.aspectj.autoproxy.AspectJAwareAdvisorAutoProxyCreator.shouldSkip(AspectJAwareAdvisorAutoProxyCreator.java:103) ~[spring-aop-4.3.3.RELEASE.jar!/:4.3.3.RELEASE] at org.springframework.aop.framework.autoproxy.AbstractAutoProxyCreator.postProcessBeforeInstantiation(AbstractAutoProxyCreator.java:249) ~[spring-aop-4.3.3.RELEASE.jar!/:4.3.3.RELEASE] at org.springframework.beans.factory.support.AbstractAutowireCapableBeanFactory.applyBeanPostProcessorsBeforeInstantiation(AbstractAutowireCapableBeanFactory.java:993) ~[spring-beans-4.3.3.RELEASE.jar!/:4.3.3.RELEASE] at org.springframework.beans.factory.support.AbstractAutowireCapableBeanFactory.resolveBeforeInstantiation(AbstractAutowireCapableBeanFactory.java:964) ~[spring-beans-4.3.3.RELEASE.jar!/:4.3.3.RELEASE] at org.springframework.beans.factory.support.AbstractAutowireCapableBeanFactory.createBean(AbstractAutowireCapableBeanFactory.java:472) ~[spring-beans-4.3.3.RELEASE.jar!/:4.3.3.RELEASE] ... 22 common frames omitted Caused by: org.springframework.beans.factory.BeanCreationException: Error creating bean with name 'securityManager' defined in class path resource [com/livinglibrary/config/ShiroConfig.class]: Bean instantiation via factory method failed; nested exception is org.springframework.beans.BeanInstantiationException: Failed to instantiate [org.apache.shiro.mgt.SecurityManager]: Factory method 'securityManager' threw exception; nested exception is org.springframework.beans.factory.BeanCreationException: Error creating bean with name 'myShiroRealm': Injection of resource dependencies failed; nested exception is org.springframework.beans.factory.BeanCreationException: Error creating bean with name 'shiroService': Injection of resource dependencies failed; nested exception is org.springframework.beans.factory.UnsatisfiedDependencyException: Error creating bean with name 'userMapper' defined in URL [jar:file:/F:/SpringBootProjects/livinglibrary/target/livinglibrary-0.0.1-SNAPSHOT.jar!/BOOT-INF/classes!/com/livinglibrary/mapper/UserMapper.class]: Unsatisfied dependency expressed through bean property 'sqlSessionFactory'; nested exception is org.springframework.beans.factory.UnsatisfiedDependencyException: Error creating bean with name 'org.mybatis.spring.boot.autoconfigure.MybatisAutoConfiguration': Unsatisfied dependency expressed through constructor parameter 0; nested exception is org.springframework.beans.factory.BeanCreationException: Error creating bean with name 'mybatis-org.mybatis.spring.boot.autoconfigure.MybatisProperties': Initialization of bean failed; nested exception is java.lang.NoClassDefFoundError: javax/xml/bind/ValidationException at org.springframework.beans.factory.support.ConstructorResolver.instantiateUsingFactoryMethod(ConstructorResolver.java:599) ~[spring-beans-4.3.3.RELEASE.jar!/:4.3.3.RELEASE] at org.springframework.beans.factory.support.AbstractAutowireCapableBeanFactory.instantiateUsingFactoryMethod(AbstractAutowireCapableBeanFactory.java:1128) ~[spring-beans-4.3.3.RELEASE.jar!/:4.3.3.RELEASE] at org.springframework.beans.factory.support.AbstractAutowireCapableBeanFactory.createBeanInstance(AbstractAutowireCapableBeanFactory.java:1023) ~[spring-beans-4.3.3.RELEASE.jar!/:4.3.3.RELEASE] at org.springframework.beans.factory.support.AbstractAutowireCapableBeanFactory.doCreateBean(AbstractAutowireCapableBeanFactory.java:510) ~[spring-beans-4.3.3.RELEASE.jar!/:4.3.3.RELEASE] at org.springframework.beans.factory.support.AbstractAutowireCapableBeanFactory.createBean(AbstractAutowireCapableBeanFactory.java:482) ~[spring-beans-4.3.3.RELEASE.jar!/:4.3.3.RELEASE] at org.springframework.beans.factory.support.AbstractBeanFactory$1.getObject(AbstractBeanFactory.java:306) ~[spring-beans-4.3.3.RELEASE.jar!/:4.3.3.RELEASE] at org.springframework.beans.factory.support.DefaultSingletonBeanRegistry.getSingleton(DefaultSingletonBeanRegistry.java:230) ~[spring-beans-4.3.3.RELEASE.jar!/:4.3.3.RELEASE] at org.springframework.beans.factory.support.AbstractBeanFactory.doGetBean(AbstractBeanFactory.java:302) ~[spring-beans-4.3.3.RELEASE.jar!/:4.3.3.RELEASE] at org.springframework.beans.factory.support.AbstractBeanFactory.getBean(AbstractBeanFactory.java:202) ~[spring-beans-4.3.3.RELEASE.jar!/:4.3.3.RELEASE] at org.springframework.beans.factory.config.DependencyDescriptor.resolveCandidate(DependencyDescriptor.java:207) ~[spring-beans-4.3.3.RELEASE.jar!/:4.3.3.RELEASE] at org.springframework.beans.factory.support.DefaultListableBeanFactory.doResolveDependency(DefaultListableBeanFactory.java:1128) ~[spring-beans-4.3.3.RELEASE.jar!/:4.3.3.RELEASE] at org.springframework.beans.factory.support.DefaultListableBeanFactory.resolveDependency(DefaultListableBeanFactory.java:1056) ~[spring-beans-4.3.3.RELEASE.jar!/:4.3.3.RELEASE] at org.springframework.beans.factory.support.ConstructorResolver.resolveAutowiredArgument(ConstructorResolver.java:835) ~[spring-beans-4.3.3.RELEASE.jar!/:4.3.3.RELEASE] at org.springframework.beans.factory.support.ConstructorResolver.createArgumentArray(ConstructorResolver.java:741) ~[spring-beans-4.3.3.RELEASE.jar!/:4.3.3.RELEASE] ... 39 common frames omitted Caused by: org.springframework.beans.BeanInstantiationException: Failed to instantiate [org.apache.shiro.mgt.SecurityManager]: Factory method 'securityManager' threw exception; nested exception is org.springframework.beans.factory.BeanCreationException: Error creating bean with name 'myShiroRealm': Injection of resource dependencies failed; nested exception is org.springframework.beans.factory.BeanCreationException: Error creating bean with name 'shiroService': Injection of resource dependencies failed; nested exception is org.springframework.beans.factory.UnsatisfiedDependencyException: Error creating bean with name 'userMapper' defined in URL [jar:file:/F:/SpringBootProjects/livinglibrary/target/livinglibrary-0.0.1-SNAPSHOT.jar!/BOOT-INF/classes!/com/livinglibrary/mapper/UserMapper.class]: Unsatisfied dependency expressed through bean property 'sqlSessionFactory'; nested exception is org.springframework.beans.factory.UnsatisfiedDependencyException: Error creating bean with name 'org.mybatis.spring.boot.autoconfigure.MybatisAutoConfiguration': Unsatisfied dependency expressed through constructor parameter 0; nested exception is org.springframework.beans.factory.BeanCreationException: Error creating bean with name 'mybatis-org.mybatis.spring.boot.autoconfigure.MybatisProperties': Initialization of bean failed; nested exception is java.lang.NoClassDefFoundError: javax/xml/bind/ValidationException at org.springframework.beans.factory.support.SimpleInstantiationStrategy.instantiate(SimpleInstantiationStrategy.java:189) ~[spring-beans-4.3.3.RELEASE.jar!/:4.3.3.RELEASE] at org.springframework.beans.factory.support.ConstructorResolver.instantiateUsingFactoryMethod(ConstructorResolver.java:588) ~[spring-beans-4.3.3.RELEASE.jar!/:4.3.3.RELEASE] ... 52 common frames omitted Caused by: org.springframework.beans.factory.BeanCreationException: Error creating bean with name 'myShiroRealm': Injection of resource dependencies failed; nested exception is org.springframework.beans.factory.BeanCreationException: Error creating bean with name 'shiroService': Injection of resource dependencies failed; nested exception is org.springframework.beans.factory.UnsatisfiedDependencyException: Error creating bean with name 'userMapper' defined in URL [jar:file:/F:/SpringBootProjects/livinglibrary/target/livinglibrary-0.0.1-SNAPSHOT.jar!/BOOT-INF/classes!/com/livinglibrary/mapper/UserMapper.class]: Unsatisfied dependency expressed through bean property 'sqlSessionFactory'; nested exception is org.springframework.beans.factory.UnsatisfiedDependencyException: Error creating bean with name 'org.mybatis.spring.boot.autoconfigure.MybatisAutoConfiguration': Unsatisfied dependency expressed through constructor parameter 0; nested exception is org.springframework.beans.factory.BeanCreationException: Error creating bean with name 'mybatis-org.mybatis.spring.boot.autoconfigure.MybatisProperties': Initialization of bean failed; nested exception is java.lang.NoClassDefFoundError: javax/xml/bind/ValidationException at org.springframework.context.annotation.CommonAnnotationBeanPostProcessor.postProcessPropertyValues(CommonAnnotationBeanPostProcessor.java:321) ~[spring-context-4.3.3.RELEASE.jar!/:4.3.3.RELEASE] at org.springframework.beans.factory.support.AbstractAutowireCapableBeanFactory.populateBean(AbstractAutowireCapableBeanFactory.java:1219) ~[spring-beans-4.3.3.RELEASE.jar!/:4.3.3.RELEASE] at org.springframework.beans.factory.support.AbstractAutowireCapableBeanFactory.doCreateBean(AbstractAutowireCapableBeanFactory.java:543) ~[spring-beans-4.3.3.RELEASE.jar!/:4.3.3.RELEASE] at org.springframework.beans.factory.support.AbstractAutowireCapableBeanFactory.createBean(AbstractAutowireCapableBeanFactory.java:482) ~[spring-beans-4.3.3.RELEASE.jar!/:4.3.3.RELEASE] at org.springframework.beans.factory.support.AbstractBeanFactory$1.getObject(AbstractBeanFactory.java:306) ~[spring-beans-4.3.3.RELEASE.jar!/:4.3.3.RELEASE] at org.springframework.beans.factory.support.DefaultSingletonBeanRegistry.getSingleton(DefaultSingletonBeanRegistry.java:230) ~[spring-beans-4.3.3.RELEASE.jar!/:4.3.3.RELEASE] at org.springframework.beans.factory.support.AbstractBeanFactory.doGetBean(AbstractBeanFactory.java:302) ~[spring-beans-4.3.3.RELEASE.jar!/:4.3.3.RELEASE] at org.springframework.beans.factory.support.AbstractBeanFactory.getBean(AbstractBeanFactory.java:197) ~[spring-beans-4.3.3.RELEASE.jar!/:4.3.3.RELEASE] at org.springframework.context.annotation.ConfigurationClassEnhancer$BeanMethodInterceptor.intercept(ConfigurationClassEnhancer.java:381) ~[spring-context-4.3.3.RELEASE.jar!/:4.3.3.RELEASE] at com.livinglibrary.config.ShiroConfig$$EnhancerBySpringCGLIB$$6346f6e4.myShiroRealm(<generated>) ~[classes!/:0.0.1-SNAPSHOT] at com.livinglibrary.config.ShiroConfig.securityManager(ShiroConfig.java:89) ~[classes!/:0.0.1-SNAPSHOT] at com.livinglibrary.config.ShiroConfig$$EnhancerBySpringCGLIB$$6346f6e4.CGLIB$securityManager$0(<generated>) ~[classes!/:0.0.1-SNAPSHOT] at com.livinglibrary.config.ShiroConfig$$EnhancerBySpringCGLIB$$6346f6e4$$FastClassBySpringCGLIB$$5d683da7.invoke(<generated>) ~[classes!/:0.0.1-SNAPSHOT] at org.springframework.cglib.proxy.MethodProxy.invokeSuper(MethodProxy.java:228) ~[spring-core-4.3.3.RELEASE.jar!/:4.3.3.RELEASE] at org.springframework.context.annotation.ConfigurationClassEnhancer$BeanMethodInterceptor.intercept(ConfigurationClassEnhancer.java:356) ~[spring-context-4.3.3.RELEASE.jar!/:4.3.3.RELEASE] at com.livinglibrary.config.ShiroConfig$$EnhancerBySpringCGLIB$$6346f6e4.securityManager(<generated>) ~[classes!/:0.0.1-SNAPSHOT] at java.base/jdk.internal.reflect.NativeMethodAccessorImpl.invoke0(Native Method) ~[na:na] at java.base/jdk.internal.reflect.NativeMethodAccessorImpl.invoke(Unknown Source) ~[na:na] at java.base/jdk.internal.reflect.DelegatingMethodAccessorImpl.invoke(Unknown Source) ~[na:na] at java.base/java.lang.reflect.Method.invoke(Unknown Source) ~[na:na] at org.springframework.beans.factory.support.SimpleInstantiationStrategy.instantiate(SimpleInstantiationStrategy.java:162) ~[spring-beans-4.3.3.RELEASE.jar!/:4.3.3.RELEASE] ... 53 common frames omitted Caused by: org.springframework.beans.factory.BeanCreationException: Error creating bean with name 'shiroService': Injection of resource dependencies failed; nested exception is org.springframework.beans.factory.UnsatisfiedDependencyException: Error creating bean with name 'userMapper' defined in URL [jar:file:/F:/SpringBootProjects/livinglibrary/target/livinglibrary-0.0.1-SNAPSHOT.jar!/BOOT-INF/classes!/com/livinglibrary/mapper/UserMapper.class]: Unsatisfied dependency expressed through bean property 'sqlSessionFactory'; nested exception is org.springframework.beans.factory.UnsatisfiedDependencyException: Error creating bean with name 'org.mybatis.spring.boot.autoconfigure.MybatisAutoConfiguration': Unsatisfied dependency expressed through constructor parameter 0; nested exception is org.springframework.beans.factory.BeanCreationException: Error creating bean with name 'mybatis-org.mybatis.spring.boot.autoconfigure.MybatisProperties': Initialization of bean failed; nested exception is java.lang.NoClassDefFoundError: javax/xml/bind/ValidationException at org.springframework.context.annotation.CommonAnnotationBeanPostProcessor.postProcessPropertyValues(CommonAnnotationBeanPostProcessor.java:321) ~[spring-context-4.3.3.RELEASE.jar!/:4.3.3.RELEASE] at org.springframework.beans.factory.support.AbstractAutowireCapableBeanFactory.populateBean(AbstractAutowireCapableBeanFactory.java:1219) ~[spring-beans-4.3.3.RELEASE.jar!/:4.3.3.RELEASE] at org.springframework.beans.factory.support.AbstractAutowireCapableBeanFactory.doCreateBean(AbstractAutowireCapableBeanFactory.java:543) ~[spring-beans-4.3.3.RELEASE.jar!/:4.3.3.RELEASE] at org.springframework.beans.factory.support.AbstractAutowireCapableBeanFactory.createBean(AbstractAutowireCapableBeanFactory.java:482) ~[spring-beans-4.3.3.RELEASE.jar!/:4.3.3.RELEASE] at org.springframework.beans.factory.support.AbstractBeanFactory$1.getObject(AbstractBeanFactory.java:306) ~[spring-beans-4.3.3.RELEASE.jar!/:4.3.3.RELEASE] at org.springframework.beans.factory.support.DefaultSingletonBeanRegistry.getSingleton(DefaultSingletonBeanRegistry.java:230) ~[spring-beans-4.3.3.RELEASE.jar!/:4.3.3.RELEASE] at org.springframework.beans.factory.support.AbstractBeanFactory.doGetBean(AbstractBeanFactory.java:302) ~[spring-beans-4.3.3.RELEASE.jar!/:4.3.3.RELEASE] at org.springframework.beans.factory.support.AbstractBeanFactory.getBean(AbstractBeanFactory.java:202) ~[spring-beans-4.3.3.RELEASE.jar!/:4.3.3.RELEASE] at org.springframework.context.annotation.CommonAnnotationBeanPostProcessor.autowireResource(CommonAnnotationBeanPostProcessor.java:522) ~[spring-context-4.3.3.RELEASE.jar!/:4.3.3.RELEASE] at org.springframework.context.annotation.CommonAnnotationBeanPostProcessor.getResource(CommonAnnotationBeanPostProcessor.java:496) ~[spring-context-4.3.3.RELEASE.jar!/:4.3.3.RELEASE] at org.springframework.context.annotation.CommonAnnotationBeanPostProcessor$ResourceElement.getResourceToInject(CommonAnnotationBeanPostProcessor.java:627) ~[spring-context-4.3.3.RELEASE.jar!/:4.3.3.RELEASE] at org.springframework.beans.factory.annotation.InjectionMetadata$InjectedElement.inject(InjectionMetadata.java:169) ~[spring-beans-4.3.3.RELEASE.jar!/:4.3.3.RELEASE] at org.springframework.beans.factory.annotation.InjectionMetadata.inject(InjectionMetadata.java:88) ~[spring-beans-4.3.3.RELEASE.jar!/:4.3.3.RELEASE] at org.springframework.context.annotation.CommonAnnotationBeanPostProcessor.postProcessPropertyValues(CommonAnnotationBeanPostProcessor.java:318) ~[spring-context-4.3.3.RELEASE.jar!/:4.3.3.RELEASE] ... 73 common frames omitted Caused by: org.springframework.beans.factory.UnsatisfiedDependencyException: Error creating bean with name 'userMapper' defined in URL [jar:file:/F:/SpringBootProjects/livinglibrary/target/livinglibrary-0.0.1-SNAPSHOT.jar!/BOOT-INF/classes!/com/livinglibrary/mapper/UserMapper.class]: Unsatisfied dependency expressed through bean property 'sqlSessionFactory'; nested exception is org.springframework.beans.factory.UnsatisfiedDependencyException: Error creating bean with name 'org.mybatis.spring.boot.autoconfigure.MybatisAutoConfiguration': Unsatisfied dependency expressed through constructor parameter 0; nested exception is org.springframework.beans.factory.BeanCreationException: Error creating bean with name 'mybatis-org.mybatis.spring.boot.autoconfigure.MybatisProperties': Initialization of bean failed; nested exception is java.lang.NoClassDefFoundError: javax/xml/bind/ValidationException at org.springframework.beans.factory.support.AbstractAutowireCapableBeanFactory.autowireByType(AbstractAutowireCapableBeanFactory.java:1312) ~[spring-beans-4.3.3.RELEASE.jar!/:4.3.3.RELEASE] at org.springframework.beans.factory.support.AbstractAutowireCapableBeanFactory.populateBean(AbstractAutowireCapableBeanFactory.java:1204) ~[spring-beans-4.3.3.RELEASE.jar!/:4.3.3.RELEASE] at org.springframework.beans.factory.support.AbstractAutowireCapableBeanFactory.doCreateBean(AbstractAutowireCapableBeanFactory.java:543) ~[spring-beans-4.3.3.RELEASE.jar!/:4.3.3.RELEASE] at org.springframework.beans.factory.support.AbstractAutowireCapableBeanFactory.createBean(AbstractAutowireCapableBeanFactory.java:482) ~[spring-beans-4.3.3.RELEASE.jar!/:4.3.3.RELEASE] at org.springframework.beans.factory.support.AbstractBeanFactory$1.getObject(AbstractBeanFactory.java:306) ~[spring-beans-4.3.3.RELEASE.jar!/:4.3.3.RELEASE] at org.springframework.beans.factory.support.DefaultSingletonBeanRegistry.getSingleton(DefaultSingletonBeanRegistry.java:230) ~[spring-beans-4.3.3.RELEASE.jar!/:4.3.3.RELEASE] at org.springframework.beans.factory.support.AbstractBeanFactory.doGetBean(AbstractBeanFactory.java:302) ~[spring-beans-4.3.3.RELEASE.jar!/:4.3.3.RELEASE] at org.springframework.beans.factory.support.AbstractBeanFactory.getBean(AbstractBeanFactory.java:202) ~[spring-beans-4.3.3.RELEASE.jar!/:4.3.3.RELEASE] at org.springframework.context.annotation.CommonAnnotationBeanPostProcessor.autowireResource(CommonAnnotationBeanPostProcessor.java:522) ~[spring-context-4.3.3.RELEASE.jar!/:4.3.3.RELEASE] at org.springframework.context.annotation.CommonAnnotationBeanPostProcessor.getResource(CommonAnnotationBeanPostProcessor.java:496) ~[spring-context-4.3.3.RELEASE.jar!/:4.3.3.RELEASE] at org.springframework.context.annotation.CommonAnnotationBeanPostProcessor$ResourceElement.getResourceToInject(CommonAnnotationBeanPostProcessor.java:627) ~[spring-context-4.3.3.RELEASE.jar!/:4.3.3.RELEASE] at org.springframework.beans.factory.annotation.InjectionMetadata$InjectedElement.inject(InjectionMetadata.java:169) ~[spring-beans-4.3.3.RELEASE.jar!/:4.3.3.RELEASE] at org.springframework.beans.factory.annotation.InjectionMetadata.inject(InjectionMetadata.java:88) ~[spring-beans-4.3.3.RELEASE.jar!/:4.3.3.RELEASE] at org.springframework.context.annotation.CommonAnnotationBeanPostProcessor.postProcessPropertyValues(CommonAnnotationBeanPostProcessor.java:318) ~[spring-context-4.3.3.RELEASE.jar!/:4.3.3.RELEASE] ... 86 common frames omitted Caused by: org.springframework.beans.factory.UnsatisfiedDependencyException: Error creating bean with name 'org.mybatis.spring.boot.autoconfigure.MybatisAutoConfiguration': Unsatisfied dependency expressed through constructor parameter 0; nested exception is org.springframework.beans.factory.BeanCreationException: Error creating bean with name 'mybatis-org.mybatis.spring.boot.autoconfigure.MybatisProperties': Initialization of bean failed; nested exception is java.lang.NoClassDefFoundError: javax/xml/bind/ValidationException at org.springframework.beans.factory.support.ConstructorResolver.createArgumentArray(ConstructorResolver.java:749) ~[spring-beans-4.3.3.RELEASE.jar!/:4.3.3.RELEASE] at org.springframework.beans.factory.support.ConstructorResolver.autowireConstructor(ConstructorResolver.java:189) ~[spring-beans-4.3.3.RELEASE.jar!/:4.3.3.RELEASE] at org.springframework.beans.factory.support.AbstractAutowireCapableBeanFactory.autowireConstructor(AbstractAutowireCapableBeanFactory.java:1148) ~[spring-beans-4.3.3.RELEASE.jar!/:4.3.3.RELEASE] at org.springframework.beans.factory.support.AbstractAutowireCapableBeanFactory.createBeanInstance(AbstractAutowireCapableBeanFactory.java:1051) ~[spring-beans-4.3.3.RELEASE.jar!/:4.3.3.RELEASE] at org.springframework.beans.factory.support.AbstractAutowireCapableBeanFactory.doCreateBean(AbstractAutowireCapableBeanFactory.java:510) ~[spring-beans-4.3.3.RELEASE.jar!/:4.3.3.RELEASE] at org.springframework.beans.factory.support.AbstractAutowireCapableBeanFactory.createBean(AbstractAutowireCapableBeanFactory.java:482) ~[spring-beans-4.3.3.RELEASE.jar!/:4.3.3.RELEASE] at org.springframework.beans.factory.support.AbstractBeanFactory$1.getObject(AbstractBeanFactory.java:306) ~[spring-beans-4.3.3.RELEASE.jar!/:4.3.3.RELEASE] at org.springframework.beans.factory.support.DefaultSingletonBeanRegistry.getSingleton(DefaultSingletonBeanRegistry.java:230) ~[spring-beans-4.3.3.RELEASE.jar!/:4.3.3.RELEASE] at org.springframework.beans.factory.support.AbstractBeanFactory.doGetBean(AbstractBeanFactory.java:302) ~[spring-beans-4.3.3.RELEASE.jar!/:4.3.3.RELEASE] at org.springframework.beans.factory.support.AbstractBeanFactory.getBean(AbstractBeanFactory.java:197) ~[spring-beans-4.3.3.RELEASE.jar!/:4.3.3.RELEASE] at org.springframework.beans.factory.support.ConstructorResolver.instantiateUsingFactoryMethod(ConstructorResolver.java:372) ~[spring-beans-4.3.3.RELEASE.jar!/:4.3.3.RELEASE] at org.springframework.beans.factory.support.AbstractAutowireCapableBeanFactory.instantiateUsingFactoryMethod(AbstractAutowireCapableBeanFactory.java:1128) ~[spring-beans-4.3.3.RELEASE.jar!/:4.3.3.RELEASE] at org.springframework.beans.factory.support.AbstractAutowireCapableBeanFactory.createBeanInstance(AbstractAutowireCapableBeanFactory.java:1023) ~[spring-beans-4.3.3.RELEASE.jar!/:4.3.3.RELEASE] at org.springframework.beans.factory.support.AbstractAutowireCapableBeanFactory.doCreateBean(AbstractAutowireCapableBeanFactory.java:510) ~[spring-beans-4.3.3.RELEASE.jar!/:4.3.3.RELEASE] at org.springframework.beans.factory.support.AbstractAutowireCapableBeanFactory.createBean(AbstractAutowireCapableBeanFactory.java:482) ~[spring-beans-4.3.3.RELEASE.jar!/:4.3.3.RELEASE] at org.springframework.beans.factory.support.AbstractBeanFactory$1.getObject(AbstractBeanFactory.java:306) ~[spring-beans-4.3.3.RELEASE.jar!/:4.3.3.RELEASE] at org.springframework.beans.factory.support.DefaultSingletonBeanRegistry.getSingleton(DefaultSingletonBeanRegistry.java:230) ~[spring-beans-4.3.3.RELEASE.jar!/:4.3.3.RELEASE] at org.springframework.beans.factory.support.AbstractBeanFactory.doGetBean(AbstractBeanFactory.java:302) ~[spring-beans-4.3.3.RELEASE.jar!/:4.3.3.RELEASE] at org.springframework.beans.factory.support.AbstractBeanFactory.getBean(AbstractBeanFactory.java:202) ~[spring-beans-4.3.3.RELEASE.jar!/:4.3.3.RELEASE] at org.springframework.beans.factory.config.DependencyDescriptor.resolveCandidate(DependencyDescriptor.java:207) ~[spring-beans-4.3.3.RELEASE.jar!/:4.3.3.RELEASE] at org.springframework.beans.factory.support.DefaultListableBeanFactory.doResolveDependency(DefaultListableBeanFactory.java:1128) ~[spring-beans-4.3.3.RELEASE.jar!/:4.3.3.RELEASE] at org.springframework.beans.factory.support.DefaultListableBeanFactory.resolveDependency(DefaultListableBeanFactory.java:1056) ~[spring-beans-4.3.3.RELEASE.jar!/:4.3.3.RELEASE] at org.springframework.beans.factory.support.AbstractAutowireCapableBeanFactory.autowireByType(AbstractAutowireCapableBeanFactory.java:1297) ~[spring-beans-4.3.3.RELEASE.jar!/:4.3.3.RELEASE] ... 99 common frames omitted Caused by: org.springframework.beans.factory.BeanCreationException: Error creating bean with name 'mybatis-org.mybatis.spring.boot.autoconfigure.MybatisProperties': Initialization of bean failed; nested exception is java.lang.NoClassDefFoundError: javax/xml/bind/ValidationException at org.springframework.beans.factory.support.AbstractAutowireCapableBeanFactory.doCreateBean(AbstractAutowireCapableBeanFactory.java:553) ~[spring-beans-4.3.3.RELEASE.jar!/:4.3.3.RELEASE] at org.springframework.beans.factory.support.AbstractAutowireCapableBeanFactory.createBean(AbstractAutowireCapableBeanFactory.java:482) ~[spring-beans-4.3.3.RELEASE.jar!/:4.3.3.RELEASE] at org.springframework.beans.factory.support.AbstractBeanFactory$1.getObject(AbstractBeanFactory.java:306) ~[spring-beans-4.3.3.RELEASE.jar!/:4.3.3.RELEASE] at org.springframework.beans.factory.support.DefaultSingletonBeanRegistry.getSingleton(DefaultSingletonBeanRegistry.java:230) ~[spring-beans-4.3.3.RELEASE.jar!/:4.3.3.RELEASE] at org.springframework.beans.factory.support.AbstractBeanFactory.doGetBean(AbstractBeanFactory.java:302) ~[spring-beans-4.3.3.RELEASE.jar!/:4.3.3.RELEASE] at org.springframework.beans.factory.support.AbstractBeanFactory.getBean(AbstractBeanFactory.java:202) ~[spring-beans-4.3.3.RELEASE.jar!/:4.3.3.RELEASE] at org.springframework.beans.factory.config.DependencyDescriptor.resolveCandidate(DependencyDescriptor.java:207) ~[spring-beans-4.3.3.RELEASE.jar!/:4.3.3.RELEASE] at org.springframework.beans.factory.support.DefaultListableBeanFactory.doResolveDependency(DefaultListableBeanFactory.java:1128) ~[spring-beans-4.3.3.RELEASE.jar!/:4.3.3.RELEASE] at org.springframework.beans.factory.support.DefaultListableBeanFactory.resolveDependency(DefaultListableBeanFactory.java:1056) ~[spring-beans-4.3.3.RELEASE.jar!/:4.3.3.RELEASE] at org.springframework.beans.factory.support.ConstructorResolver.resolveAutowiredArgument(ConstructorResolver.java:835) ~[spring-beans-4.3.3.RELEASE.jar!/:4.3.3.RELEASE] at org.springframework.beans.factory.support.ConstructorResolver.createArgumentArray(ConstructorResolver.java:741) ~[spring-beans-4.3.3.RELEASE.jar!/:4.3.3.RELEASE] ... 121 common frames omitted Caused by: java.lang.NoClassDefFoundError: javax/xml/bind/ValidationException at org.hibernate.validator.internal.engine.ConfigurationImpl.<init>(ConfigurationImpl.java:129) ~[hibernate-validator-5.2.4.Final.jar!/:5.2.4.Final] at org.hibernate.validator.internal.engine.ConfigurationImpl.<init>(ConfigurationImpl.java:96) ~[hibernate-validator-5.2.4.Final.jar!/:5.2.4.Final] at org.hibernate.validator.HibernateValidator.createGenericConfiguration(HibernateValidator.java:31) ~[hibernate-validator-5.2.4.Final.jar!/:5.2.4.Final] at javax.validation.Validation$GenericBootstrapImpl.configure(Validation.java:276) ~[validation-api-1.1.0.Final.jar!/:na] at org.springframework.validation.beanvalidation.LocalValidatorFactoryBean.afterPropertiesSet(LocalValidatorFactoryBean.java:248) ~[spring-context-4.3.3.RELEASE.jar!/:4.3.3.RELEASE] at org.springframework.boot.context.properties.ConfigurationPropertiesBindingPostProcessor$LocalValidatorFactory.run(ConfigurationPropertiesBindingPostProcessor.java:452) ~[spring-boot-1.4.1.RELEASE.jar!/:1.4.1.RELEASE] at org.springframework.boot.context.properties.ConfigurationPropertiesBindingPostProcessor.getValidator(ConfigurationPropertiesBindingPostProcessor.java:386) ~[spring-boot-1.4.1.RELEASE.jar!/:1.4.1.RELEASE] at org.springframework.boot.context.properties.ConfigurationPropertiesBindingPostProcessor.determineValidator(ConfigurationPropertiesBindingPostProcessor.java:369) ~[spring-boot-1.4.1.RELEASE.jar!/:1.4.1.RELEASE] at org.springframework.boot.context.properties.ConfigurationPropertiesBindingPostProcessor.postProcessBeforeInitialization(ConfigurationPropertiesBindingPostProcessor.java:331) ~[spring-boot-1.4.1.RELEASE.jar!/:1.4.1.RELEASE] at org.springframework.boot.context.properties.ConfigurationPropertiesBindingPostProcessor.postProcessBeforeInitialization(ConfigurationPropertiesBindingPostProcessor.java:302) ~[spring-boot-1.4.1.RELEASE.jar!/:1.4.1.RELEASE] at org.springframework.beans.factory.support.AbstractAutowireCapableBeanFactory.applyBeanPostProcessorsBeforeInitialization(AbstractAutowireCapableBeanFactory.java:408) ~[spring-beans-4.3.3.RELEASE.jar!/:4.3.3.RELEASE] at org.springframework.beans.factory.support.AbstractAutowireCapableBeanFactory.initializeBean(AbstractAutowireCapableBeanFactory.java:1575) ~[spring-beans-4.3.3.RELEASE.jar!/:4.3.3.RELEASE] at org.springframework.beans.factory.support.AbstractAutowireCapableBeanFactory.doCreateBean(AbstractAutowireCapableBeanFactory.java:545) ~[spring-beans-4.3.3.RELEASE.jar!/:4.3.3.RELEASE] ... 131 common frames omitted Caused by: java.lang.ClassNotFoundException: javax.xml.bind.ValidationException at java.base/java.net.URLClassLoader.findClass(Unknown Source) ~[na:na] at java.base/java.lang.ClassLoader.loadClass(Unknown Source) ~[na:na] at org.springframework.boot.loader.LaunchedURLClassLoader.loadClass(LaunchedURLClassLoader.java:89) ~[livinglibrary-0.0.1-SNAPSHOT.jar:0.0.1-SNAPSHOT] at java.base/java.lang.ClassLoader.loadClass(Unknown Source) ~[na:na] ... 144 common frames omitted ``` 困扰了好几天了,这几天急着要,求救!!!
终于明白阿里百度这样的大公司,为什么面试经常拿ThreadLocal考验求职者了
点击上面↑「爱开发」关注我们每晚10点,捕获技术思考和创业资源洞察什么是ThreadLocalThreadLocal是一个本地线程副本变量工具类,各个线程都拥有一份线程私...
《奇巧淫技》系列-python!!每天早上八点自动发送天气预报邮件到QQ邮箱
将代码部署服务器,每日早上定时获取到天气数据,并发送到邮箱。 也可以说是一个小人工智障。 思路可以运用在不同地方,主要介绍的是思路。
加快推动区块链技术和产业创新发展,2019可信区块链峰会在京召开
11月8日,由中国信息通信研究院、中国通信标准化协会、中国互联网协会、可信区块链推进计划联合主办,科技行者协办的2019可信区块链峰会将在北京悠唐皇冠假日酒店开幕。   区块链技术被认为是继蒸汽机、电力、互联网之后,下一代颠覆性的核心技术。如果说蒸汽机释放了人类的生产力,电力解决了人类基本的生活需求,互联网彻底改变了信息传递的方式,区块链作为构造信任的技术有重要的价值。   1...
阿里面试官问我:如何设计秒杀系统?我的回答让他比起大拇指
你知道的越多,你不知道的越多 点赞再看,养成习惯 GitHub上已经开源 https://github.com/JavaFamily 有一线大厂面试点脑图和个人联系方式,欢迎Star和指教 前言 Redis在互联网技术存储方面使用如此广泛,几乎所有的后端技术面试官都要在Redis的使用和原理方面对小伙伴们进行360°的刁难。 作为一个在互联网公司面一次拿一次Offer的面霸,打败了...
C语言魔塔游戏
很早就很想写这个,今天终于写完了。 游戏截图: 编译环境: VS2017 游戏需要一些图片,如果有想要的或者对游戏有什么看法的可以加我的QQ 2985486630 讨论,如果暂时没有回应,可以在博客下方留言,到时候我会看到。 下面我来介绍一下游戏的主要功能和实现方式 首先是玩家的定义,使用结构体,这个名字是可以自己改变的 struct gamerole { char n...
面试官问我:什么是消息队列?什么场景需要他?用了会出现什么问题?
你知道的越多,你不知道的越多 点赞再看,养成习惯 GitHub上已经开源 https://github.com/JavaFamily 有一线大厂面试点脑图、个人联系方式和人才交流群,欢迎Star和完善 前言 消息队列在互联网技术存储方面使用如此广泛,几乎所有的后端技术面试官都要在消息队列的使用和原理方面对小伙伴们进行360°的刁难。 作为一个在互联网公司面一次拿一次Offer的面霸...
Android性能优化(4):UI渲染机制以及优化
文章目录1. 渲染机制分析1.1 渲染机制1.2 卡顿现象1.3 内存抖动2. 渲染优化方式2.1 过度绘制优化2.1.1 Show GPU overdraw2.1.2 Profile GPU Rendering2.2 卡顿优化2.2.1 SysTrace2.2.2 TraceView 在从Android 6.0源码的角度剖析View的绘制原理一文中,我们了解到View的绘制流程有三个步骤,即m...
微服务中的Kafka与Micronaut
今天,我们将通过Apache Kafka主题构建一些彼此异步通信的微服务。我们使用Micronaut框架,它为与Kafka集成提供专门的库。让我们简要介绍一下示例系统的体系结构。我们有四个微型服务:订单服务,行程服务,司机服务和乘客服务。这些应用程序的实现非常简单。它们都有内存存储,并连接到同一个Kafka实例。 我们系统的主要目标是为客户安排行程。订单服务应用程序还充当网关。它接收来自客户的请求...
致 Python 初学者们!
作者| 许向武 责编 | 屠敏 出品 | CSDN 博客 前言 在 Python 进阶的过程中,相信很多同学应该大致上学习了很多 Python 的基础知识,也正在努力成长。在此期间,一定遇到了很多的困惑,对未来的学习方向感到迷茫。我非常理解你们所面临的处境。我从2007年开始接触 Python 这门编程语言,从2009年开始单一使用 Python 应对所有的开发工作,直至今...
究竟你适不适合买Mac?
我清晰的记得,刚买的macbook pro回到家,开机后第一件事情,就是上了淘宝网,花了500元钱,找了一个上门维修电脑的师傅,上门给我装了一个windows系统。。。。。。 表砍我。。。 当时买mac的初衷,只是想要个固态硬盘的笔记本,用来运行一些复杂的扑克软件。而看了当时所有的SSD笔记本后,最终决定,还是买个好(xiong)看(da)的。 已经有好几个朋友问我mba怎么样了,所以今天尽量客观...
程序员一般通过什么途径接私活?
二哥,你好,我想知道一般程序猿都如何接私活,我也想接,能告诉我一些方法吗? 上面是一个读者“烦不烦”问我的一个问题。其实不止是“烦不烦”,还有很多读者问过我类似这样的问题。 我接的私活不算多,挣到的钱也没有多少,加起来不到 20W。说实话,这个数目说出来我是有点心虚的,毕竟太少了,大家轻喷。但我想,恰好配得上“一般程序员”这个称号啊。毕竟苍蝇再小也是肉,我也算是有经验的人了。 唾弃接私活、做外...
字节跳动面试官这样问消息队列:分布式事务、重复消费、顺序消费,我整理了一下
你知道的越多,你不知道的越多 点赞再看,养成习惯 GitHub上已经开源 https://github.com/JavaFamily 有一线大厂面试点脑图、个人联系方式和人才交流群,欢迎Star和完善 前言 消息队列在互联网技术存储方面使用如此广泛,几乎所有的后端技术面试官都要在消息队列的使用和原理方面对小伙伴们进行360°的刁难。 作为一个在互联网公司面一次拿一次Offer的面霸...
Python爬虫爬取淘宝,京东商品信息
小编是一个理科生,不善长说一些废话。简单介绍下原理然后直接上代码。 使用的工具(Python+pycharm2019.3+selenium+xpath+chromedriver)其中要使用pycharm也可以私聊我selenium是一个框架可以通过pip下载 pip installselenium -ihttps://pypi.tuna.tsinghua.edu.cn/simple/ ...
阿里程序员写了一个新手都写不出的低级bug,被骂惨了。
这种新手都不会范的错,居然被一个工作好几年的小伙子写出来,差点被当场开除了。
Java工作4年来应聘要16K最后没要,细节如下。。。
前奏: 今天2B哥和大家分享一位前几天面试的一位应聘者,工作4年26岁,统招本科。 以下就是他的简历和面试情况。 基本情况: 专业技能: 1、&nbsp;熟悉Sping了解SpringMVC、SpringBoot、Mybatis等框架、了解SpringCloud微服务 2、&nbsp;熟悉常用项目管理工具:SVN、GIT、MAVEN、Jenkins 3、&nbsp;熟悉Nginx、tomca...
SpringBoot2.x系列教程(三十六)SpringBoot之Tomcat配置
Spring Boot默认内嵌的Tomcat为Servlet容器,关于Tomcat的所有属性都在ServerProperties配置类中。同时,也可以实现一些接口来自定义内嵌Servlet容器和内嵌Tomcat等的配置。 关于此配置,网络上有大量的资料,但都是基于SpringBoot1.5.x版本,并不适合当前最新版本。本文将带大家了解一下最新版本的使用。 ServerProperties的部分源...
Python绘图,圣诞树,花,爱心 | Turtle篇
每周每日,分享Python实战代码,入门资料,进阶资料,基础语法,爬虫,数据分析,web网站,机器学习,深度学习等等。 公众号回复【进群】沟通交流吧,QQ扫码进群学习吧 微信群 QQ群 1.画圣诞树 import turtle screen = turtle.Screen() screen.setup(800,600) circle = turtle.Turtle()...
作为一个程序员,CPU的这些硬核知识你必须会!
CPU对每个程序员来说,是个既熟悉又陌生的东西? 如果你只知道CPU是中央处理器的话,那可能对你并没有什么用,那么作为程序员的我们,必须要搞懂的就是CPU这家伙是如何运行的,尤其要搞懂它里面的寄存器是怎么一回事,因为这将让你从底层明白程序的运行机制。 随我一起,来好好认识下CPU这货吧 把CPU掰开来看 对于CPU来说,我们首先就要搞明白它是怎么回事,也就是它的内部构造,当然,CPU那么牛的一个东...
破14亿,Python分析我国存在哪些人口危机!
一、背景 二、爬取数据 三、数据分析 1、总人口 2、男女人口比例 3、人口城镇化 4、人口增长率 5、人口老化(抚养比) 6、各省人口 7、世界人口 四、遇到的问题 遇到的问题 1、数据分页,需要获取从1949-2018年数据,观察到有近20年参数:LAST20,由此推测获取近70年的参数可设置为:LAST70 2、2019年数据没有放上去,可以手动添加上去 3、将数据进行 行列转换 4、列名...
听说想当黑客的都玩过这个Monyer游戏(1~14攻略)
第零关 进入传送门开始第0关(游戏链接) 请点击链接进入第1关: 连接在左边→ ←连接在右边 看不到啊。。。。(只能看到一堆大佬做完的留名,也能看到菜鸡的我,在后面~~) 直接fn+f12吧 &lt;span&gt;连接在左边→&lt;/span&gt; &lt;a href="first.php"&gt;&lt;/a&gt; &lt;span&gt;←连接在右边&lt;/span&gt; o...
在家远程办公效率低?那你一定要收好这个「在家办公」神器!
相信大家都已经收到国务院延长春节假期的消息,接下来,在家远程办公可能将会持续一段时间。 但是问题来了。远程办公不是人在电脑前就当坐班了,相反,对于沟通效率,文件协作,以及信息安全都有着极高的要求。有着非常多的挑战,比如: 1在异地互相不见面的会议上,如何提高沟通效率? 2文件之间的来往反馈如何做到及时性?如何保证信息安全? 3如何规划安排每天工作,以及如何进行成果验收? ...... ...
作为一个程序员,内存和磁盘的这些事情,你不得不知道啊!!!
截止目前,我已经分享了如下几篇文章: 一个程序在计算机中是如何运行的?超级干货!!! 作为一个程序员,CPU的这些硬核知识你必须会! 作为一个程序员,内存的这些硬核知识你必须懂! 这些知识可以说是我们之前都不太重视的基础知识,可能大家在上大学的时候都学习过了,但是嘞,当时由于老师讲解的没那么有趣,又加上这些知识本身就比较枯燥,所以嘞,大家当初几乎等于没学。 再说啦,学习这些,也看不出来有什么用啊!...
这个世界上人真的分三六九等,你信吗?
偶然间,在知乎上看到一个问题 一时间,勾起了我深深的回忆。 以前在厂里打过两次工,做过家教,干过辅导班,做过中介。零下几度的晚上,贴过广告,满脸、满手地长冻疮。 再回首那段岁月,虽然苦,但让我学会了坚持和忍耐。让我明白了,在这个世界上,无论环境多么的恶劣,只要心存希望,星星之火,亦可燎原。 下文是原回答,希望能对你能有所启发。 如果我说,这个世界上人真的分三六九等,...
2020年全新Java学习路线图,含配套视频,学完即为中级Java程序员!!
新的一年来临,突如其来的疫情打破了平静的生活! 在家的你是否很无聊,如果无聊就来学习吧! 世上只有一种投资只赚不赔,那就是学习!!! 传智播客于2020年升级了Java学习线路图,硬核升级,免费放送! 学完你就是中级程序员,能更快一步找到工作! 一、Java基础 JavaSE基础是Java中级程序员的起点,是帮助你从小白到懂得编程的必经之路。 在Java基础板块中有6个子模块的学...
B 站上有哪些很好的学习资源?
哇说起B站,在小九眼里就是宝藏般的存在,放年假宅在家时一天刷6、7个小时不在话下,更别提今年的跨年晚会,我简直是跪着看完的!! 最早大家聚在在B站是为了追番,再后来我在上面刷欧美新歌和漂亮小姐姐的舞蹈视频,最近两年我和周围的朋友们已经把B站当作学习教室了,而且学习成本还免费,真是个励志的好平台ヽ(.◕ฺˇд ˇ◕ฺ;)ノ 下面我们就来盘点一下B站上优质的学习资源: 综合类 Oeasy: 综合...
爬取薅羊毛网站百度云资源
这是疫情期间无聊做的爬虫, 去获取暂时用不上的教程 import threading import time import pandas as pd import requests import re from threading import Thread, Lock # import urllib.request as request # req=urllib.request.Requ...
如何优雅地打印一个Java对象?
你好呀,我是沉默王二,一个和黄家驹一样身高,和刘德华一样颜值的程序员。虽然已经写了十多年的 Java 代码,但仍然觉得自己是个菜鸟(请允许我惭愧一下)。 在一个月黑风高的夜晚,我思前想后,觉得再也不能这么蹉跎下去了。于是痛下决心,准备通过输出的方式倒逼输入,以此来修炼自己的内功,从而进阶成为一名真正意义上的大神。与此同时,希望这些文章能够帮助到更多的读者,让大家在学习的路上不再寂寞、空虚和冷。 ...
雷火神山直播超两亿,Web播放器事件监听是怎么实现的?
Web播放器解决了在手机浏览器和PC浏览器上播放音视频数据的问题,让视音频内容可以不依赖用户安装App,就能进行播放以及在社交平台进行传播。在视频业务大数据平台中,播放数据的统计分析非常重要,所以Web播放器在使用过程中,需要对其内部的数据进行收集并上报至服务端,此时,就需要对发生在其内部的一些播放行为进行事件监听。 那么Web播放器事件监听是怎么实现的呢? 01 监听事件明细表 名...
3万字总结,Mysql优化之精髓
本文知识点较多,篇幅较长,请耐心学习 MySQL已经成为时下关系型数据库产品的中坚力量,备受互联网大厂的青睐,出门面试想进BAT,想拿高工资,不会点MySQL优化知识,拿offer的成功率会大大下降。 为什么要优化 系统的吞吐量瓶颈往往出现在数据库的访问速度上 随着应用程序的运行,数据库的中的数据会越来越多,处理时间会相应变慢 数据是存放在磁盘上的,读写速度无法和内存相比 如何优化 设计...
HTML5适合的情人节礼物有纪念日期功能
前言 利用HTML5,css,js实现爱心树 以及 纪念日期的功能 网页有播放音乐功能 以及打字倾诉感情的画面,非常适合情人节送给女朋友 具体的HTML代码 具体只要修改代码里面的男某某和女某某 文字段也可自行修改,还有代码下半部分的JS代码需要修改一下起始日期 注意月份为0~11月 也就是月份需要减一。 当然只有一部分HTML和JS代码不够运行的,文章最下面还附加了完整代码的下载地址 &lt;!...
Python新型冠状病毒疫情数据自动爬取+统计+发送报告+数据屏幕(三)发送篇
今天介绍的项目是使用 Itchat 发送统计报告 项目功能设计: 定时爬取疫情数据存入Mysql 进行数据分析制作疫情报告 使用itchat给亲人朋友发送分析报告 基于Django做数据屏幕 使用Tableau做数据分析 来看看最终效果 目前已经完成,预计2月12日前更新 使用 itchat 发送数据统计报告 itchat 是一个基于 web微信的一个框架,但微信官方并不允许使用这...
python沙箱逃逸
沙箱逃逸是CTF和实际场景中经常遇到的一种情况。需要利用python的特性来实现逃逸。本文详细介绍了关于python逃逸的基础以及一些构造payload方法,并且附加习题提供练习。
作为程序员的我,大学四年一直自学,全靠这些实用工具和学习网站!
我本人因为高中沉迷于爱情,导致学业荒废,后来高考,毫无疑问进入了一所普普通通的大学,实在惭愧???? 我又是那么好强,现在学历不行,没办法改变的事情了,所以,进入大学开始,我就下定决心,一定要让自己掌握更多的技能,尤其选择了计算机这个行业,一定要多学习技术。 在进入大学学习不久后,我就认清了一个现实:我这个大学的整体教学质量和学习风气,真的一言难尽,懂的人自然知道怎么回事? 怎么办?我该如何更好的提升自...
新来个技术总监,禁止我们使用Lombok!
我有个学弟,在一家小型互联网公司做Java后端开发,最近他们公司新来了一个技术总监,这位技术总监对技术细节很看重,一来公司之后就推出了很多"政策",比如定义了很多开发规范、日志规范、甚至是要求大家统一使用某一款IDE。 但是这些都不是我这个学弟和我吐槽的点,他真正和我吐槽的是,他很不能理解,这位新来的技术总监竟然禁止公司内部所有开发使用Lombok。但是又没给出十分明确的,可以让人信服的理由。 于...
相关热词 c# 为空 判断 委托 c#记事本颜色 c# 系统默认声音 js中调用c#方法参数 c#引入dll文件报错 c#根据名称实例化 c#从邮件服务器获取邮件 c# 保存文件夹 c#代码打包引用 c# 压缩效率
立即提问