使用install:file命令安装第三方jar到maven本地仓库,报错no pom

问题补充:
项目中要用到一个分词的jar包。于是我在晚上下了一个,本来是这样IK Analyzer 2012FF_hf1.jar, 为了符合maven install命令的规范,我随意加了一个版本号变为这样IK Analyzer 2012FF_1.0.1.然后切换到jar包所在文件夹,执行如图命令,爆出如图错误。查了百度,有说缺少pom.xml文件的,难道随便一个jar包安装到本地仓库,都要手写pom文件吗?我怎么知道它依赖了哪些包?
图片说明

图片说明

2个回答

其实问题很简单!
mvn install:install-file -DgroupId=org.lwtea -DartifactId=IKAnalyzer -Dversion=0.0.1-SNAPSHOT -Dpackaging=jar -Dfile=IKAnalyzer-0.0.1-SNAPSHOT.jar

你在DgroupId等参数的前面都少加了一个"-"符号!加上就没问题了……

Csdn user default icon
上传中...
上传图片
插入图片
抄袭、复制答案,以达到刷声望分或其他目的的行为,在CSDN问答是严格禁止的,一经发现立刻封号。是时候展现真正的技术了!
其他相关推荐
往本地maven库打jar包的时候提示访问路径拒绝访问
下面是错误提示 ![图片说明](https://img-ask.csdn.net/upload/201510/09/1444385233_691566.png) 我的打包命令如下 mvn install:install-file -Dfile=D:\maven\apache-maven-3.1.0\repository -DgroupId=org.jsoup -DartifactId=jsoup -Dversion=1.8.3 -Dpackaging=jar
maven依赖项目打jar包问题
eclipse中有2个maven项目(都不是web项目)。A项目依赖B项目(A就是控制层,B就是service和DAO)A的pom.xml文件里<dependency><groupId>com.B</groupId<artifactId>B</artifactId></dependency>,A项目配了一些application.xml;在B中配置了一些beans.xml;将B项目maven install到本地仓库,A项目直接引用B的jar包。在eclipse里运行A一切正常。但将A打jar包后。一直报错。 org.springframework.beans.factory.BeanDefinitionStoreException: Invalid bean definition with name 'comDict' defined in URL [jar:file:/E:/game/A_lib/B.jar!/config/beans.xml] A项目打成jar包{ A的配置文件,A_lib(存放A所有依赖的jar包的文件夹),A.jar} 以上3块放在同一个文件夹下面。运行java -jar A.jar。就会报上面的错。comDict是配置在beans.xml里面的一个bean。jar:file:/E:/game/A_lib/B.jar!/config/beans.xml]这个B.jar后面带个感叹号。eclipse里运行A正常。打jar包运行就错。
mvn install离线使用不了,离线还是需要下载一堆东西
办公室电脑不能连外网,需要把jar包添加到本地maven仓库,网上查到可以使用mvn -install命令,如: ``` mvn install:install-file -Dfile=e:/it-blacklist-0.0.1-SNAPSHOT.jar -DgroupId=cn.blacklist -DartifactId=it-blacklist -Dversion=0.0.1-SNAPSHOT -Dpackaging=jar ``` 该命令我笔记本测试联网可用,但在台式机离线使用的时候,会尝试下载install的一些插件,但是因为台式机是离线的,导致下载不到就报错: No plugin found for prefix 'install' in the current project and in the plugin groups [org.apache.maven.plugins, org.codehaus.mojo] available from the repositories. 如附图所示。 ![图片说明](https://img-ask.csdn.net/upload/201911/25/1574679537_745197.jpg) 我想了一些办法解决,就是把笔记本上行mvn install执行过后的缓存文件复制到台式机上。即把笔记本上的maven仓库C:\Users\用户名\.m2\repository整个复制到台式机上覆盖响应文件夹,但是台式机仍然会尝试下载。 我在笔记本上的相应文件夹中是可以看到尝试下载的那些文件的。但是就是无法让台式机在离线的时候使用它。不知道有没有大佬知道应该怎么操作解决这个问题。
用maven进行install的时候报错Error injecting: org.apache.maven.plugin.install.InstallMojo
[code="java"] ------------------------------------------------------- T E S T S ------------------------------------------------------- There are no tests to run. Results : Tests run: 0, Failures: 0, Errors: 0, Skipped: 0 [INFO] [INFO] --- maven-war-plugin:2.1.1:war (default-war) @ llemaicai --- [INFO] Packaging webapp [INFO] Assembling webapp [llemaicai] in [E:\dev\maicai\pro\llemaicai\target\llemaicai] [INFO] Processing war project [INFO] Copying webapp resources [E:\dev\maicai\pro\llemaicai\src\main\webapp] [INFO] Webapp assembled in [35 msecs] [INFO] Building war: E:\dev\maicai\pro\llemaicai\target\llemaicai.war [WARNING] Warning: selected war files include a WEB-INF/web.xml which will be ignored (webxml attribute is missing from war task, or ignoreWebxml attribute is specified as 'true') [INFO] [INFO] --- maven-install-plugin:2.3.1:install (default-install) @ llemaicai --- [WARNING] The POM for org.codehaus.plexus:plexus-digest:jar:1.0 is invalid, transitive dependencies (if any) will not be available, enable debug logging for more details 2013-2-20 14:41:14 org.sonatype.guice.bean.reflect.LoadedClass 警告: Error injecting: org.apache.maven.plugin.install.InstallMojo java.lang.NoClassDefFoundError: org/codehaus/plexus/digest/DigesterException at java.lang.Class.getDeclaredConstructors0(Native Method) at java.lang.Class.privateGetDeclaredConstructors(Class.java:2389) at java.lang.Class.getDeclaredConstructors(Class.java:1836) at com.google.inject.spi.InjectionPoint.forConstructorOf(InjectionPoint.java:243) at com.google.inject.internal.ConstructorBindingImpl.create(ConstructorBindingImpl.java:96) at com.google.inject.internal.InjectorImpl.createUninitializedBinding(InjectorImpl.java:628) at com.google.inject.internal.InjectorImpl.createJustInTimeBinding(InjectorImpl.java:835) at com.google.inject.internal.InjectorImpl.createJustInTimeBindingRecursive(InjectorImpl.java:769) at com.google.inject.internal.InjectorImpl.getJustInTimeBinding(InjectorImpl.java:254) at com.google.inject.internal.InjectorImpl.getBindingOrThrow(InjectorImpl.java:205) at com.google.inject.internal.InjectorImpl.getInternalFactory(InjectorImpl.java:843) at com.google.inject.internal.InjectorImpl.getProviderOrThrow(InjectorImpl.java:957) at com.google.inject.internal.InjectorImpl.getProvider(InjectorImpl.java:990) at com.google.inject.internal.InjectorImpl.getProvider(InjectorImpl.java:951) at com.google.inject.internal.InjectorImpl.getInstance(InjectorImpl.java:1003) at org.sonatype.guice.bean.reflect.AbstractDeferredClass.get(AbstractDeferredClass.java:47) at com.google.inject.internal.InternalFactoryToProviderAdapter.get(InternalFactoryToProviderAdapter.java:40) at com.google.inject.internal.InjectorImpl$4$1.call(InjectorImpl.java:968) at com.google.inject.internal.InjectorImpl.callInContext(InjectorImpl.java:1014) at com.google.inject.internal.InjectorImpl$4.get(InjectorImpl.java:964) at com.google.inject.Scopes$1$1.get(Scopes.java:59) at org.sonatype.guice.bean.locators.LazyBeanEntry.getValue(LazyBeanEntry.java:79) at org.sonatype.guice.plexus.locators.LazyPlexusBean.getValue(LazyPlexusBean.java:53) at org.codehaus.plexus.DefaultPlexusContainer.lookup(DefaultPlexusContainer.java:243) at org.codehaus.plexus.DefaultPlexusContainer.lookup(DefaultPlexusContainer.java:235) at org.apache.maven.plugin.internal.DefaultMavenPluginManager.getConfiguredMojo(DefaultMavenPluginManager.java:455) at org.apache.maven.plugin.DefaultBuildPluginManager.executeMojo(DefaultBuildPluginManager.java:92) at org.apache.maven.lifecycle.internal.MojoExecutor.execute(MojoExecutor.java:209) at org.apache.maven.lifecycle.internal.MojoExecutor.execute(MojoExecutor.java:153) at org.apache.maven.lifecycle.internal.MojoExecutor.execute(MojoExecutor.java:145) at org.apache.maven.lifecycle.internal.LifecycleModuleBuilder.buildProject(LifecycleModuleBuilder.java:84) at org.apache.maven.lifecycle.internal.LifecycleModuleBuilder.buildProject(LifecycleModuleBuilder.java:59) at org.apache.maven.lifecycle.internal.LifecycleStarter.singleThreadedBuild(LifecycleStarter.java:183) at org.apache.maven.lifecycle.internal.LifecycleStarter.execute(LifecycleStarter.java:161) at org.apache.maven.DefaultMaven.doExecute(DefaultMaven.java:319) at org.apache.maven.DefaultMaven.execute(DefaultMaven.java:156) at org.apache.maven.cli.MavenCli.execute(MavenCli.java:537) at org.apache.maven.cli.MavenCli.doMain(MavenCli.java:196) at org.apache.maven.cli.MavenCli.main(MavenCli.java:141) at sun.reflect.NativeMethodAccessorImpl.invoke0(Native Method) at sun.reflect.NativeMethodAccessorImpl.invoke(NativeMethodAccessorImpl.java:39) at sun.reflect.DelegatingMethodAccessorImpl.invoke(DelegatingMethodAccessorImpl.java:25) at java.lang.reflect.Method.invoke(Method.java:597) at org.codehaus.plexus.classworlds.launcher.Launcher.launchEnhanced(Launcher.java:290) at org.codehaus.plexus.classworlds.launcher.Launcher.launch(Launcher.java:230) at org.codehaus.plexus.classworlds.launcher.Launcher.mainWithExitCode(Launcher.java:409) at org.codehaus.plexus.classworlds.launcher.Launcher.main(Launcher.java:352) Caused by: java.lang.ClassNotFoundException: org.codehaus.plexus.digest.DigesterException at org.codehaus.plexus.classworlds.strategy.SelfFirstStrategy.loadClass(SelfFirstStrategy.java:50) at org.codehaus.plexus.classworlds.realm.ClassRealm.loadClass(ClassRealm.java:244) at org.codehaus.plexus.classworlds.realm.ClassRealm.loadClass(ClassRealm.java:230) ... 47 more [INFO] ------------------------------------------------------------------------ [INFO] BUILD FAILURE [INFO] ------------------------------------------------------------------------ [INFO] Total time: 1.669s [INFO] Finished at: Wed Feb 20 14:41:14 CST 2013 [INFO] Final Memory: 4M/15M [INFO] ------------------------------------------------------------------------ [ERROR] Failed to execute goal org.apache.maven.plugins:maven-install-plugin:2.3.1:install (default-install) on project llemaicai: Execution default-install of goal org.apache.maven.plugins:maven-install-plugin:2.3.1:install failed: Unable to load the mojo 'install' in the plugin 'org.apache.maven.plugins:maven-install-plugin:2.3.1'. A required class is missing: org/codehaus/plexus/digest/DigesterException [ERROR] ----------------------------------------------------- [ERROR] realm = plugin>org.apache.maven.plugins:maven-install-plugin:2.3.1 [ERROR] strategy = org.codehaus.plexus.classworlds.strategy.SelfFirstStrategy [ERROR] urls[0] = file:/D:/javalib/repository/org/apache/maven/plugins/maven-install-plugin/2.3.1/maven-install-plugin-2.3.1.jar [ERROR] urls[1] = file:/D:/javalib/repository/junit/junit/3.8.1/junit-3.8.1.jar [ERROR] urls[2] = file:/D:/javalib/repository/org/codehaus/plexus/plexus-utils/2.0.5/plexus-utils-2.0.5.jar [ERROR] urls[3] = file:/D:/javalib/repository/org/codehaus/plexus/plexus-digest/1.0/plexus-digest-1.0.jar [ERROR] Number of foreign imports: 1 [ERROR] import: Entry[import from realm ClassRealm[maven.api, parent: null]] [ERROR] [ERROR] -----------------------------------------------------: org.codehaus.plexus.digest.DigesterException [ERROR] -> [Help 1] [ERROR] [ERROR] To see the full stack trace of the errors, re-run Maven with the -e switch. [ERROR] Re-run Maven using the -X switch to enable full debug logging. [ERROR] [ERROR] For more information about the errors and possible solutions, please read the following articles: [ERROR] [Help 1] http://cwiki.apache.org/confluence/display/MAVEN/PluginContainerException [/code]
maven项目install时异常
[ERROR] Failed to execute goal on project order-api: Could not resolve dependencies for project com.dd:order-api: jar:0.0.1-SNAPSHOT: Could not transfer artifact com.dd:park:jar:0.0.1-SNAPSHOT from/to maven-releases (http://47. 104.107.80:8081/repository/maven-releases/): Failed to transfer file: http://47.104.107.80:8081/repository/maven- releases/com/dd/park/0.0.1-SNAPSHOT/park-0.0.1-SNAPSHOT.jar. Return code is: 400 , ReasonPhrase:Repository versio n policy: RELEASE does not allow version: 0.0.1-SNAPSHOT. -> [Help 1]
maven 项目导入的问题
在导入 maven 项目时 pom.xml --> run as --> maven install 出现下面问题!对maven 不太了解,是个新手 [code="java"] [INFO] Scanning for projects... [INFO] ------------------------------------------------------------------------ [INFO] Building Herbalife Maven Webapp [INFO] [INFO] Id: com.herbalife.webapp:herbalife:war:1.0-SNAPSHOT [INFO] task-segment: [install] [INFO] ------------------------------------------------------------------------ [INFO] [resources:resources] [INFO] Using default encoding to copy filtered resources. url = http://repo1.maven.org/maven2 Downloading: http://repo1.maven.org/maven2/opensymphony/xwork/2.0.4/xwork-2.0.4.pom url = http://repo1.maven.org/maven2 Downloading: http://repo1.maven.org/maven2/dojo/dojo/0.0/dojo-0.0.pom url = http://repo1.maven.org/maven2 Downloading: http://repo1.maven.org/maven2/fckeditor/fckeditor/2.3/fckeditor-2.3.pom url = http://repo1.maven.org/maven2 Downloading: http://repo1.maven.org/maven2/sqlserver/msbase/1.0/msbase-1.0.pom url = http://repo1.maven.org/maven2 Downloading: http://repo1.maven.org/maven2/sqlserver/mssqlserver/1.0/mssqlserver-1.0.pom url = http://repo1.maven.org/maven2 Downloading: http://repo1.maven.org/maven2/sqlserver/msutil/1.0/msutil-1.0.pom url = http://repo1.maven.org/maven2 Downloading: http://repo1.maven.org/maven2/opensymphony/jsonplugin/0[1].16-1.5/jsonplugin-0[1].16-1.5.pom url = http://repo1.maven.org/maven2 Downloading: http://repo1.maven.org/maven2/unitils/unitils/1.0-rc-1/unitils-1.0-rc-1.pom url = http://repo1.maven.org/maven2 Downloading: http://repo1.maven.org/maven2/opensymphony/xwork/2.0.4/xwork-2.0.4.jar url = http://repo1.maven.org/maven2 Downloading: http://repo1.maven.org/maven2/dojo/dojo/0.0/dojo-0.0.jar url = http://repo1.maven.org/maven2 Downloading: http://repo1.maven.org/maven2/fckeditor/fckeditor/2.3/fckeditor-2.3.jar url = http://repo1.maven.org/maven2 Downloading: http://repo1.maven.org/maven2/sqlserver/msbase/1.0/msbase-1.0.jar url = http://repo1.maven.org/maven2 Downloading: http://repo1.maven.org/maven2/sqlserver/mssqlserver/1.0/mssqlserver-1.0.jar url = http://repo1.maven.org/maven2 Downloading: http://repo1.maven.org/maven2/sqlserver/msutil/1.0/msutil-1.0.jar url = http://repo1.maven.org/maven2 Downloading: http://repo1.maven.org/maven2/opensymphony/jsonplugin/0[1].16-1.5/jsonplugin-0[1].16-1.5.jar [ERROR] Transitive dependency resolution for scope: compile has failed for your project. Error message: Missing: ---------- 1) opensymphony:xwork:jar:2.0.4 Try downloading the file manually from the project website. Then, install it using the command: mvn install:install-file -DgroupId=opensymphony -DartifactId=xwork -Dversion=2.0.4 -Dpackaging=jar -Dfile=/path/to/file Alternatively, if you host your own repository you can deploy the file there: mvn deploy:deploy-file -DgroupId=opensymphony -DartifactId=xwork -Dversion=2.0.4 -Dpackaging=jar -Dfile=/path/to/file -Durl=[url] -DrepositoryId=[id] Path to dependency: 1) com.herbalife.webapp:herbalife:war:1.0-SNAPSHOT 2) opensymphony:xwork:jar:2.0.4 2) dojo:dojo:jar:0.0 Try downloading the file manually from the project website. Then, install it using the command: mvn install:install-file -DgroupId=dojo -DartifactId=dojo -Dversion=0.0 -Dpackaging=jar -Dfile=/path/to/file Alternatively, if you host your own repository you can deploy the file there: mvn deploy:deploy-file -DgroupId=dojo -DartifactId=dojo -Dversion=0.0 -Dpackaging=jar -Dfile=/path/to/file -Durl=[url] -DrepositoryId=[id] Path to dependency: 1) com.herbalife.webapp:herbalife:war:1.0-SNAPSHOT 2) dojo:dojo:jar:0.0 3) fckeditor:fckeditor:jar:2.3 Try downloading the file manually from the project website. Then, install it using the command: mvn install:install-file -DgroupId=fckeditor -DartifactId=fckeditor -Dversion=2.3 -Dpackaging=jar -Dfile=/path/to/file Alternatively, if you host your own repository you can deploy the file there: mvn deploy:deploy-file -DgroupId=fckeditor -DartifactId=fckeditor -Dversion=2.3 -Dpackaging=jar -Dfile=/path/to/file -Durl=[url] -DrepositoryId=[id] Path to dependency: 1) com.herbalife.webapp:herbalife:war:1.0-SNAPSHOT 2) fckeditor:fckeditor:jar:2.3 4) sqlserver:msbase:jar:1.0 Try downloading the file manually from the project website. Then, install it using the command: mvn install:install-file -DgroupId=sqlserver -DartifactId=msbase -Dversion=1.0 -Dpackaging=jar -Dfile=/path/to/file Alternatively, if you host your own repository you can deploy the file there: mvn deploy:deploy-file -DgroupId=sqlserver -DartifactId=msbase -Dversion=1.0 -Dpackaging=jar -Dfile=/path/to/file -Durl=[url] -DrepositoryId=[id] Path to dependency: 1) com.herbalife.webapp:herbalife:war:1.0-SNAPSHOT 2) sqlserver:msbase:jar:1.0 5) sqlserver:mssqlserver:jar:1.0 Try downloading the file manually from the project website. Then, install it using the command: mvn install:install-file -DgroupId=sqlserver -DartifactId=mssqlserver -Dversion=1.0 -Dpackaging=jar -Dfile=/path/to/file Alternatively, if you host your own repository you can deploy the file there: mvn deploy:deploy-file -DgroupId=sqlserver -DartifactId=mssqlserver -Dversion=1.0 -Dpackaging=jar -Dfile=/path/to/file -Durl=[url] -DrepositoryId=[id] Path to dependency: 1) com.herbalife.webapp:herbalife:war:1.0-SNAPSHOT 2) sqlserver:mssqlserver:jar:1.0 6) sqlserver:msutil:jar:1.0 Try downloading the file manually from the project website. Then, install it using the command: mvn install:install-file -DgroupId=sqlserver -DartifactId=msutil -Dversion=1.0 -Dpackaging=jar -Dfile=/path/to/file Alternatively, if you host your own repository you can deploy the file there: mvn deploy:deploy-file -DgroupId=sqlserver -DartifactId=msutil -Dversion=1.0 -Dpackaging=jar -Dfile=/path/to/file -Durl=[url] -DrepositoryId=[id] Path to dependency: 1) com.herbalife.webapp:herbalife:war:1.0-SNAPSHOT 2) sqlserver:msutil:jar:1.0 7) opensymphony:jsonplugin:jar:0[1].16-1.5 Try downloading the file manually from the project website. Then, install it using the command: mvn install:install-file -DgroupId=opensymphony -DartifactId=jsonplugin -Dversion=0[1].16-1.5 -Dpackaging=jar -Dfile=/path/to/file Alternatively, if you host your own repository you can deploy the file there: mvn deploy:deploy-file -DgroupId=opensymphony -DartifactId=jsonplugin -Dversion=0[1].16-1.5 -Dpackaging=jar -Dfile=/path/to/file -Durl=[url] -DrepositoryId=[id] Path to dependency: 1) com.herbalife.webapp:herbalife:war:1.0-SNAPSHOT 2) opensymphony:jsonplugin:jar:0[1].16-1.5 ---------- 7 required artifacts are missing. for artifact: com.herbalife.webapp:herbalife:war:1.0-SNAPSHOT from the specified remote repositories: central (http://repo1.maven.org/maven2) Group-Id: com.herbalife.webapp Artifact-Id: herbalife Version: 1.0-SNAPSHOT From file: D:\workspace\herbal-report\pom.xml [INFO] ------------------------------------------------------------------------ [INFO] For more information, run with the -e flag [INFO] ------------------------------------------------------------------------ [INFO] BUILD FAILED [INFO] ------------------------------------------------------------------------ [INFO] Total time: 13 seconds [INFO] Finished at: Fri Nov 20 13:49:19 CST 2009 [INFO] Final Memory: 2M/11M [INFO] ------------------------------------------------------------------------ [/code] [b]问题补充:[/b] D:\Downloads\xwork-2.0.4.jar 默认下载到什么地方了!这么多jar 包要一个一个导吗? 谢谢 [b]问题补充:[/b] 只剩下3 分了! :oops: 没有人知道吗??? [b]问题补充:[/b] 请问? cwx714 私服怎么建?? 我机子上的 repository 库算什么? 有没有参照的例子? 感激不尽! [img]http://dl.iteye.com/upload/attachment/171204/5b564360-105f-3cb7-96cb-4512a932b7e4.jpg[/img] [b]问题补充:[/b] 建私服太麻烦了,用 mvn 命令创建项目时为什么能自动下载对应jar 包,而导入项目时为什么就下载出错?
eclipse新建了maven项目后,执行maven命令出错,求指点
想在maven中加入ojdbc6.jar,于是按这篇博客 http://blog.csdn.net/mr_mlw/article/details/45094193 说的,在eclipse里执行命令 mvninstall:install-file -DgroupId=com.oracle -DartifactId=ojdbc6-Dversion=11.2.0.1.0 -Dpackaging=jar -Dfile=D:\ ojdbc6.jar 我的ojdbs6.jar已放到了d盘根目录,然后eclipse里执行这命令就报错 ![图片说明](https://img-ask.csdn.net/upload/201712/18/1513606542_440497.png) ![图片说明](https://img-ask.csdn.net/upload/201712/18/1513606552_171501.png) 不知什么回事,也不知道eclipse是不是要安装maven插件,windows也要安装maven的,我应该是没做过这些步骤,但是我这个是eclipse官网刚下的最新版的java ee eclipse,在新建project里能新建maven项目,不知是不是与这个有关...... 求指点
java.net.URISyntaxException: Relative path
在我用Maven package以后,运行java -jar target\test-0.0.1-SNAPSHOT.jar时提示有错误: java.net.URISyntaxException: Relative path in absolute URI: java://file:/C:/Users/user/workspace/test/target/test-0.0.1-SNAPSHOT.jar!/lib/fooJDBC-1.0.jar!/ Loaded JDBC driver: com.foo.Driver 这个fooJDBC-1.0.jar是我用mvn install:install-file 命令添加到本地repository的,这样mvn打包的时候就能把这个jar也能打进去. 这个错看起来好象和感叹号有关. 为什么会出现这样的错误?该怎么解决?谢谢.
哪位热心的大神来给看看~maven项目打成的jar包无法运行
第一次打jar包,第一次用maven遇到了问题,抓耳挠腮两天都没解决。 前提:项目在myeclispe里边运行时正常的。maven项目。 遇到问题:第一次打jar是直接export--jar file--然后被告知maven项目是不能这样打的。 然后:使用 run as 里边的先maven clean--再 myeclipse里边的project clean--再run as里边的maven install,然后得到一个很小的jar。 两种打法得到的jar包封装成windows服务的运行的时候都会报出错误,如下图: ************************************ INFO | jvm 1 | 2014/12/14 14:47:27 | WrapperSimpleApp: INFO | jvm 1 | 2014/12/14 14:47:27 | WrapperSimpleApp Error: Encountered an error running main: INFO | jvm 1 | 2014/12/14 14:47:27 | WrapperSimpleApp Error: java.lang.NoClassDefFoundError: org/apache/log4j/PropertyConfigurator INFO | jvm 1 | 2014/12/14 14:47:27 | WrapperSimpleApp Error: at com.ibm.tpc.monitoring.start.Launcher.main(Launcher.java:15) INFO | jvm 1 | 2014/12/14 14:47:27 | WrapperSimpleApp Error: at sun.reflect.NativeMethodAccessorImpl.invoke0(Native Method) INFO | jvm 1 | 2014/12/14 14:47:27 | WrapperSimpleApp Error: at sun.reflect.NativeMethodAccessorImpl.invoke(NativeMethodAccessorImpl.java:57) INFO | jvm 1 | 2014/12/14 14:47:27 | WrapperSimpleApp Error: at sun.reflect.DelegatingMethodAccessorImpl.invoke(DelegatingMethodAccessorImpl.java:43) INFO | jvm 1 | 2014/12/14 14:47:27 | WrapperSimpleApp Error: at java.lang.reflect.Method.invoke(Method.java:606) INFO | jvm 1 | 2014/12/14 14:47:27 | WrapperSimpleApp Error: at org.tanukisoftware.wrapper.WrapperSimpleApp.run(WrapperSimpleApp.java:290) INFO | jvm 1 | 2014/12/14 14:47:27 | WrapperSimpleApp Error: at java.lang.Thread.run(Thread.java:745) INFO | jvm 1 | 2014/12/14 14:47:27 | WrapperSimpleApp Error: Caused by: java.lang.ClassNotFoundException: org.apache.log4j.PropertyConfigurator INFO | jvm 1 | 2014/12/14 14:47:27 | WrapperSimpleApp Error: at java.net.URLClassLoader$1.run(URLClassLoader.java:366) INFO | jvm 1 | 2014/12/14 14:47:27 | WrapperSimpleApp Error: at java.net.URLClassLoader$1.run(URLClassLoader.java:355) INFO | jvm 1 | 2014/12/14 14:47:27 | WrapperSimpleApp Error: at java.security.AccessController.doPrivileged(Native Method) INFO | jvm 1 | 2014/12/14 14:47:27 | WrapperSimpleApp Error: at java.net.URLClassLoader.findClass(URLClassLoader.java:354) INFO | jvm 1 | 2014/12/14 14:47:27 | WrapperSimpleApp Error: at java.lang.ClassLoader.loadClass(ClassLoader.java:425) INFO | jvm 1 | 2014/12/14 14:47:27 | WrapperSimpleApp Error: at sun.misc.Launcher$AppClassLoader.loadClass(Launcher.java:308) INFO | jvm 1 | 2014/12/14 14:47:27 | WrapperSimpleApp Error: at java.lang.ClassLoader.loadClass(ClassLoader.java:358) INFO | jvm 1 | 2014/12/14 14:47:27 | WrapperSimpleApp Error: ... 7 more ******************************************** jar的主程序是这样的: import org.apache.log4j.PropertyConfigurator; import org.springframework.context.ApplicationContext; import org.springframework.context.support.ClassPathXmlApplicationContext; public class Launcher { public static void main(String[] args) { PropertyConfigurator .configure(""); ApplicationContext context = new ClassPathXmlApplicationContext( "spring/BeanLocations.xml");
maven项目编译时jar包冲突相关问题
从开源代码上拷下来一个源码学习,执行mvn clean install时报错: [WARNING] Error injecting: aQute.bnd.maven.plugin.BndMavenPlugin java.lang.NoClassDefFoundError: org/codehaus/plexus/util/Scanner at java.lang.Class.getDeclaredConstructors0(Native Method) at java.lang.Class.privateGetDeclaredConstructors(Class.java:2671) at java.lang.Class.getDeclaredConstructors(Class.java:2020) at com.google.inject.spi.InjectionPoint.forConstructorOf(InjectionPoint.java:245) at com.google.inject.internal.ConstructorBindingImpl.create(ConstructorBindingImpl.java:99) at com.google.inject.internal.InjectorImpl.createUninitializedBinding(InjectorImpl.java:658) at com.google.inject.internal.InjectorImpl.createJustInTimeBinding(InjectorImpl.java:882) at com.google.inject.internal.InjectorImpl.createJustInTimeBindingRecursive(InjectorImpl.java:805) at com.google.inject.internal.InjectorImpl.getJustInTimeBinding(InjectorImpl.java:282) at com.google.inject.internal.InjectorImpl.getBindingOrThrow(InjectorImpl.java:214) at com.google.inject.internal.InjectorImpl.getProviderOrThrow(InjectorImpl.java:1006) at com.google.inject.internal.InjectorImpl.getProvider(InjectorImpl.java:1038) at com.google.inject.internal.InjectorImpl.getProvider(InjectorImpl.java:1001) at com.google.inject.internal.InjectorImpl.getInstance(InjectorImpl.java:1051) at org.eclipse.sisu.space.AbstractDeferredClass.get(AbstractDeferredClass.java:48) at com.google.inject.internal.ProviderInternalFactory.provision(ProviderInternalFactory.java:81) at com.google.inject.internal.InternalFactoryToInitializableAdapter.provision(InternalFactoryToInitializableAdapter.java:53) at com.google.inject.internal.ProviderInternalFactory$1.call(ProviderInternalFactory.java:65) at com.google.inject.internal.ProvisionListenerStackCallback$Provision.provision(ProvisionListenerStackCallback.java:115) ........ Caused by: java.lang.ClassNotFoundException: org.codehaus.plexus.util.Scanner ........ [INFO] ------------------------------------------------------------------------ [INFO] BUILD FAILURE [INFO] ------------------------------------------------------------------------ [INFO] Total time: 4.616 s [INFO] Finished at: 2017-11-20T15:08:13+08:00 [INFO] Final Memory: 17M/201M [INFO] ------------------------------------------------------------------------ [ERROR] Failed to execute goal biz.aQute.bnd:bnd-maven-plugin:3.1.0:bnd-process (default) on project gson: Execution default of goal biz.aQute.bnd:bnd-maven-plugin:3.1.0:bnd-process failed: A required class was missing while executing biz.aQute.bnd:bnd-maven-plugin:3.1.0:bnd-process: org/codehaus/plexus/util/Scanner [ERROR] ----------------------------------------------------- [ERROR] realm = plugin>biz.aQute.bnd:bnd-maven-plugin:3.1.0 [ERROR] strategy = org.codehaus.plexus.classworlds.strategy.SelfFirstStrategy [ERROR] urls[0] = file:/Users/dasouche/.m2/repository/biz/aQute/bnd/bnd-maven-plugin/3.1.0/bnd-maven-plugin-3.1.0.jar [ERROR] urls[1] = file:/Users/dasouche/.m2/repository/org/sonatype/plexus/plexus-build-api/0.0.7/plexus-build-api-0.0.7.jar [ERROR] urls[2] = file:/Users/dasouche/.m2/repository/biz/aQute/bnd/biz.aQute.bndlib/3.1.0/biz.aQute.bndlib-3.1.0.jar [ERROR] urls[3] = file:/Users/dasouche/.m2/repository/org/codehaus/plexus/plexus-utils/1.1/plexus-utils-1.1.jar [ERROR] Number of foreign imports: 1 [ERROR] import: Entry[import from realm ClassRealm[maven.api, parent: null]] [ERROR] [ERROR] ----------------------------------------------------- [ERROR] : org.codehaus.plexus.util.Scanner [ERROR] -> [Help 1] [ERROR] [ERROR] To see the full stack trace of the errors, re-run Maven with the -e switch. [ERROR] Re-run Maven using the -X switch to enable full debug logging. [ERROR] [ERROR] For more information about the errors and possible solutions, please read the following articles: [ERROR] [Help 1] http://cwiki.apache.org/confluence/display/MAVEN/PluginContainerException 在项目的pom.xml文件中添加jar包依赖明确版本号: <dependency> <groupId>org.codehaus.plexus</groupId> <artifactId>plexus-utils</artifactId> <version>3.0.5</version> </dependency> 依然报上面的错误。 请问各位大神这个是什么问题,怎么解决?
maven项目导入到Eclipse中红色叹号!
最近看一个开源CMS系统Magnolia。 环境: Ubuntu14,Eclipse4.4 for j2ee,jdk1.6,tomcat6,maven2.2.1 按照文档,写了一个小项目。用maven。在命令行创建的项目结构大概: myProject ----myProject-webapp ----myTemplateModule 下面两个是上面的module。 在命令行中已经clean install成功。 但是导入到Eclipse中myProject-webapp项目的图标上有红色感叹号。 ![CSDN移动问答][1] 网上说是jar引用问题。我在buildpath》library中没有发现有问题的jar啊,也尝试过order and export,sellect all。打开.classpath里面貌似也没有引用什么jar啊。内容如下:.classpath. 另外,myProject项目上还有个红叉,其中的一个文件引用的某个类,Eclipse说找不到,可是我在library中都找到这个类了。 ![CSDN移动问答][2] 后来,我不管这个红色提醒,就把myProject-webapp部署在tomcat上面了。运行错误: 2014-9-4 18:25:42 org.apache.catalina.startup.TldConfig tldScanJar 严重: Exception processing JAR at resource path /home/user/.m2/repository/com/vaadin/vaadin-shared/7.1.7/vaadin-shared-7.1.7.jar in context /myProject-webapp java.util.zip.ZipException: error in opening zip file at java.util.zip.ZipFile.open(Native Method) at java.util.zip.ZipFile.<init>(ZipFile.java:127) at java.util.jar.JarFile.<init>(JarFile.java:136) at java.util.jar.JarFile.<init>(JarFile.java:100) at org.apache.catalina.startup.TldConfig.tldScanJar(TldConfig.java:393) at org.apache.catalina.startup.TldConfig.execute(TldConfig.java:320) at org.apache.catalina.startup.TldConfig.lifecycleEvent(TldConfig.java:688) at org.apache.catalina.util.LifecycleSupport.fireLifecycleEvent(LifecycleSupport.java:142) at org.apache.catalina.core.StandardContext.start(StandardContext.java:4616) at org.apache.catalina.core.ContainerBase.start(ContainerBase.java:1057) at org.apache.catalina.core.StandardHost.start(StandardHost.java:822) at org.apache.catalina.core.ContainerBase.start(ContainerBase.java:1057) at org.apache.catalina.core.StandardEngine.start(StandardEngine.java:463) at org.apache.catalina.core.StandardService.start(StandardService.java:525) at org.apache.catalina.core.StandardServer.start(StandardServer.java:754) at org.apache.catalina.startup.Catalina.start(Catalina.java:595) at sun.reflect.NativeMethodAccessorImpl.invoke0(Native Method) at sun.reflect.NativeMethodAccessorImpl.invoke(NativeMethodAccessorImpl.java:39) at sun.reflect.DelegatingMethodAccessorImpl.invoke(DelegatingMethodAccessorImpl.java:25) at java.lang.reflect.Method.invoke(Method.java:597) at org.apache.catalina.startup.Bootstrap.start(Bootstrap.java:289) at org.apache.catalina.startup.Bootstrap.main(Bootstrap.java:414) 2014-9-4 18:25:42 org.apache.catalina.startup.TldConfig tldScanJar 严重: Exception processing JAR at resource path /home/user/.m2/repository/org/jsoup/jsoup/1.6.3/jsoup-1.6.3.jar in context /myProject-webapp ............ ......... **附件:** .classpath <?xml version="1.0" encoding="UTF-8"?> <classpath> <classpathentry kind="src" output="target/classes" path="src/main/java"> <attributes> <attribute name="optional" value="true"/> <attribute name="maven.pomderived" value="true"/> </attributes> </classpathentry> <classpathentry kind="src" output="target/test-classes" path="src/test/java"> <attributes> <attribute name="optional" value="true"/> <attribute name="maven.pomderived" value="true"/> </attributes> </classpathentry> <classpathentry exported="true" kind="con" path="org.eclipse.m2e.MAVEN2_CLASSPATH_CONTAINER"> <attributes> <attribute name="maven.pomderived" value="true"/> <attribute name="org.eclipse.jst.component.dependency" value="/WEB-INF/lib"/> </attributes> </classpathentry> <classpathentry kind="con" path="org.eclipse.jst.server.core.container/org.eclipse.jst.server.tomcat.runtimeTarget/Apache Tomcat v6.0"> <attributes> <attribute name="owner.project.facets" value="jst.web"/> </attributes> </classpathentry> <classpathentry kind="con" path="org.eclipse.jdt.launching.JRE_CONTAINER/org.eclipse.jdt.internal.debug.ui.launcher.StandardVMType/jdk1.6.0_45"> <attributes> <attribute name="owner.project.facets" value="java"/> </attributes> </classpathentry> <classpathentry kind="output" path="target/classes"/> </classpath> [1]: http://my.csdn.net/my/album/detail/1784229 [2]: http://my.csdn.net/my/album/detail/1784231
关于MAVEN配置ORACLE数据库的问题
我安装的是MAVEN3.2.3。然后在CMD中,输入 mvn install:install-file -DgroupId=com.oracle -DartifactId=ojdbc6 -Dversion=11.2.0.1.0 -Dpackaging=jar -Dfile=E:\app\admin\product\11.2.0\dbhome_1\jdbc\lib\ojdbc6.jar BUILD SUCCESS。 我再回到MAVEN仓库中看,也确实是有了这个JAR包。 但是跑后台的时候,就是找不到这个驱动。已经困扰两天了。实属无奈。希望大神们帮帮忙。 org.mybatis.spring.MyBatisSystemException: nested exception is org.apache.ibatis.exceptions.PersistenceException: ### Error querying database. Cause: org.springframework.jdbc.CannotGetJdbcConnectionException: Could not get JDBC Connection; nested exception is org.apache.commons.dbcp.SQLNestedException: Cannot load JDBC driver class 'oracle.jdbc.OracleDrive' ### The error may exist in file [C:\Users\admin\Desktop\MUDAO\mudao\target\classes\com\cn\mudao\mapping\UserMapper.xml] ### The error may involve com.cn.mudao.dao.IUserDao.selectByPrimaryKey ### The error occurred while executing a query ### Cause: org.springframework.jdbc.CannotGetJdbcConnectionException: Could not get JDBC Connection; nested exception is org.apache.commons.dbcp.SQLNestedException: Cannot load JDBC driver class 'oracle.jdbc.OracleDrive' at org.mybatis.spring.MyBatisExceptionTranslator.translateExceptionIfPossible(MyBatisExceptionTranslator.java:75) at org.mybatis.spring.SqlSessionTemplate$SqlSessionInterceptor.invoke(SqlSessionTemplate.java:371) at com.sun.proxy.$Proxy16.selectOne(Unknown Source) at org.mybatis.spring.SqlSessionTemplate.selectOne(SqlSessionTemplate.java:163) at org.apache.ibatis.binding.MapperMethod.execute(MapperMethod.java:68) at org.apache.ibatis.binding.MapperProxy.invoke(MapperProxy.java:52) at com.sun.proxy.$Proxy17.selectByPrimaryKey(Unknown Source) at com.cn.mudao.service.impl.UserServiceImpl.getUserById(UserServiceImpl.java:18) at org.zsl.testmybatis.TestMyBatis.test1(TestMyBatis.java:35) at sun.reflect.NativeMethodAccessorImpl.invoke0(Native Method) at sun.reflect.NativeMethodAccessorImpl.invoke(NativeMethodAccessorImpl.java:57) at sun.reflect.DelegatingMethodAccessorImpl.invoke(DelegatingMethodAccessorImpl.java:43) at java.lang.reflect.Method.invoke(Method.java:606) at org.junit.runners.model.FrameworkMethod$1.runReflectiveCall(FrameworkMethod.java:47) at org.junit.internal.runners.model.ReflectiveCallable.run(ReflectiveCallable.java:12) at org.junit.runners.model.FrameworkMethod.invokeExplosively(FrameworkMethod.java:44) at org.junit.internal.runners.statements.InvokeMethod.evaluate(InvokeMethod.java:17) at org.springframework.test.context.junit4.statements.RunBeforeTestMethodCallbacks.evaluate(RunBeforeTestMethodCallbacks.java:74) at org.springframework.test.context.junit4.statements.RunAfterTestMethodCallbacks.evaluate(RunAfterTestMethodCallbacks.java:83) at org.springframework.test.context.junit4.statements.SpringRepeat.evaluate(SpringRepeat.java:72) at org.springframework.test.context.junit4.SpringJUnit4ClassRunner.runChild(SpringJUnit4ClassRunner.java:232) at org.springframework.test.context.junit4.SpringJUnit4ClassRunner.runChild(SpringJUnit4ClassRunner.java:89) at org.junit.runners.ParentRunner$3.run(ParentRunner.java:238) at org.junit.runners.ParentRunner$1.schedule(ParentRunner.java:63) at org.junit.runners.ParentRunner.runChildren(ParentRunner.java:236) at org.junit.runners.ParentRunner.access$000(ParentRunner.java:53) at org.junit.runners.ParentRunner$2.evaluate(ParentRunner.java:229) at org.springframework.test.context.junit4.statements.RunBeforeTestClassCallbacks.evaluate(RunBeforeTestClassCallbacks.java:61) at org.springframework.test.context.junit4.statements.RunAfterTestClassCallbacks.evaluate(RunAfterTestClassCallbacks.java:71) at org.junit.runners.ParentRunner.run(ParentRunner.java:309) at org.springframework.test.context.junit4.SpringJUnit4ClassRunner.run(SpringJUnit4ClassRunner.java:175) at org.eclipse.jdt.internal.junit4.runner.JUnit4TestReference.run(JUnit4TestReference.java:50) at org.eclipse.jdt.internal.junit.runner.TestExecution.run(TestExecution.java:38) at org.eclipse.jdt.internal.junit.runner.RemoteTestRunner.runTests(RemoteTestRunner.java:467) at org.eclipse.jdt.internal.junit.runner.RemoteTestRunner.runTests(RemoteTestRunner.java:683) at org.eclipse.jdt.internal.junit.runner.RemoteTestRunner.run(RemoteTestRunner.java:390) at org.eclipse.jdt.internal.junit.runner.RemoteTestRunner.main(RemoteTestRunner.java:197) Caused by: org.apache.ibatis.exceptions.PersistenceException: ### Error querying database. Cause: org.springframework.jdbc.CannotGetJdbcConnectionException: Could not get JDBC Connection; nested exception is org.apache.commons.dbcp.SQLNestedException: Cannot load JDBC driver class 'oracle.jdbc.OracleDrive' ### The error may exist in file [C:\Users\admin\Desktop\MUDAO\mudao\target\classes\com\cn\mudao\mapping\UserMapper.xml] ### The error may involve com.cn.mudao.dao.IUserDao.selectByPrimaryKey ### The error occurred while executing a query ### Cause: org.springframework.jdbc.CannotGetJdbcConnectionException: Could not get JDBC Connection; nested exception is org.apache.commons.dbcp.SQLNestedException: Cannot load JDBC driver class 'oracle.jdbc.OracleDrive' at org.apache.ibatis.exceptions.ExceptionFactory.wrapException(ExceptionFactory.java:26) at org.apache.ibatis.session.defaults.DefaultSqlSession.selectList(DefaultSqlSession.java:111) at org.apache.ibatis.session.defaults.DefaultSqlSession.selectList(DefaultSqlSession.java:102) at org.apache.ibatis.session.defaults.DefaultSqlSession.selectOne(DefaultSqlSession.java:66) at sun.reflect.NativeMethodAccessorImpl.invoke0(Native Method) at sun.reflect.NativeMethodAccessorImpl.invoke(NativeMethodAccessorImpl.java:57) at sun.reflect.DelegatingMethodAccessorImpl.invoke(DelegatingMethodAccessorImpl.java:43) at java.lang.reflect.Method.invoke(Method.java:606) at org.mybatis.spring.SqlSessionTemplate$SqlSessionInterceptor.invoke(SqlSessionTemplate.java:358) ... 35 more Caused by: org.springframework.jdbc.CannotGetJdbcConnectionException: Could not get JDBC Connection; nested exception is org.apache.commons.dbcp.SQLNestedException: Cannot load JDBC driver class 'oracle.jdbc.OracleDrive' at org.springframework.jdbc.datasource.DataSourceUtils.getConnection(DataSourceUtils.java:80) at org.mybatis.spring.transaction.SpringManagedTransaction.openConnection(SpringManagedTransaction.java:81) at org.mybatis.spring.transaction.SpringManagedTransaction.getConnection(SpringManagedTransaction.java:67) at org.apache.ibatis.executor.BaseExecutor.getConnection(BaseExecutor.java:279) at org.apache.ibatis.executor.SimpleExecutor.prepareStatement(SimpleExecutor.java:72) at org.apache.ibatis.executor.SimpleExecutor.doQuery(SimpleExecutor.java:59) at org.apache.ibatis.executor.BaseExecutor.queryFromDatabase(BaseExecutor.java:267) at org.apache.ibatis.executor.BaseExecutor.query(BaseExecutor.java:137) at org.apache.ibatis.executor.CachingExecutor.query(CachingExecutor.java:96) at org.apache.ibatis.executor.CachingExecutor.query(CachingExecutor.java:77) at org.apache.ibatis.session.defaults.DefaultSqlSession.selectList(DefaultSqlSession.java:108) ... 42 more Caused by: org.apache.commons.dbcp.SQLNestedException: Cannot load JDBC driver class 'oracle.jdbc.OracleDrive' at org.apache.commons.dbcp.BasicDataSource.createDataSource(BasicDataSource.java:1136) at org.apache.commons.dbcp.BasicDataSource.getConnection(BasicDataSource.java:880) at org.springframework.jdbc.datasource.DataSourceUtils.doGetConnection(DataSourceUtils.java:111) at org.springframework.jdbc.datasource.DataSourceUtils.getConnection(DataSourceUtils.java:77) ... 52 more Caused by: java.lang.ClassNotFoundException: oracle.jdbc.OracleDrive at java.net.URLClassLoader$1.run(URLClassLoader.java:366) at java.net.URLClassLoader$1.run(URLClassLoader.java:355) at java.security.AccessController.doPrivileged(Native Method) at java.net.URLClassLoader.findClass(URLClassLoader.java:354) at java.lang.ClassLoader.loadClass(ClassLoader.java:424) at sun.misc.Launcher$AppClassLoader.loadClass(Launcher.java:308) at java.lang.ClassLoader.loadClass(ClassLoader.java:357) at java.lang.Class.forName0(Native Method) at java.lang.Class.forName(Class.java:190) at org.apache.commons.dbcp.BasicDataSource.createDataSource(BasicDataSource.java:1130) ... 55 more
maven ear包的问题!
From file: /home/zx/workspace/adboard2009/adboard-chn-ear/pom.xml Reason: Cannot copy a directory: /home/zx/workspace/adboard2009/adboard-core/entity-jar/target/classes; Did you package/install com.ericsson.adboard:entity-jar:jar:3.0.0-alpha:compile? 原POM如下 <project xmlns="http://maven.apache.org/POM/4.0.0" xmlns:xsi="http://www.w3.org/2001/XMLSchema-instance" xsi:schemaLocation="http://maven.apache.org/POM/4.0.0 http://maven.apache.org/xsd/maven-4.0.0.xsd"> <modelVersion>4.0.0</modelVersion> <parent> <groupId>com.ericsson.adboard</groupId> <artifactId>adboard</artifactId> <version>3.0.0-alpha</version> </parent> <artifactId>adboard-chn-ear</artifactId> <packaging>ear</packaging> <name>Adboard China EAR</name> <dependencies> <dependency> <groupId>com.ericsson.adboard</groupId> <artifactId>entity-jar</artifactId> <version>3.0.0-alpha</version> <type>jar</type> </dependency> </dependencies> <build> <plugins> <plugin> <groupId>org.apache.maven.plugins</groupId> <artifactId>maven-ear-plugin</artifactId> <configuration> <modules> <jarModule> <groupId>com.ericsson.adboard</groupId> <artifactId>entity-jar</artifactId> <bundleDir>lib</bundleDir> </jarModule> </modules> </configuration> </plugin> </plugins> </build> </project>
请问:在SSM框架中,引入了oracle的jar包 ,依赖是添加成功了的,但是使用时报异常
请问:在SSM框架中,引入了oracle的jar包 ,依赖是添加成功了的,但是使用mybatis-generator:generate时报异常 这是报错代码 [INFO] Scanning for projects... [INFO] [INFO] ------------------------------------------------------------------------ [INFO] Building ssm Maven Webapp 1.0-SNAPSHOT [INFO] ------------------------------------------------------------------------ [INFO] [INFO] --- mybatis-generator-maven-plugin:1.3.0:generate (default-cli) @ ssm --- [INFO] ------------------------------------------------------------------------ [INFO] BUILD FAILURE [INFO] ------------------------------------------------------------------------ [INFO] Total time: 0.562 s [INFO] Finished at: 2017-09-08T09:46:14+08:00 java.lang.RuntimeException: Exception getting JDBC Driver at org.mybatis.generator.internal.db.ConnectionFactory.getDriver(ConnectionFactory.java:84) at org.mybatis.generator.internal.db.ConnectionFactory.getConnection(ConnectionFactory.java:53) at org.mybatis.generator.config.Context.getConnection(Context.java:487) at org.mybatis.generator.config.Context.introspectTables(Context.java:396) at org.mybatis.generator.api.MyBatisGenerator.generate(MyBatisGenerator.java:222) at org.mybatis.generator.maven.MyBatisGeneratorMojo.execute(MyBatisGeneratorMojo.java:184) at org.apache.maven.plugin.DefaultBuildPluginManager.executeMojo(DefaultBuildPluginManager.java:134) at org.apache.maven.lifecycle.internal.MojoExecutor.execute(MojoExecutor.java:207) at org.apache.maven.lifecycle.internal.MojoExecutor.execute(MojoExecutor.java:153) at org.apache.maven.lifecycle.internal.MojoExecutor.execute(MojoExecutor.java:145) at org.apache.maven.lifecycle.internal.LifecycleModuleBuilder.buildProject(LifecycleModuleBuilder.java:116) at org.apache.maven.lifecycle.internal.LifecycleModuleBuilder.buildProject(LifecycleModuleBuilder.java:80) at org.apache.maven.lifecycle.internal.builder.singlethreaded.SingleThreadedBuilder.build(SingleThreadedBuilder.java:51) at org.apache.maven.lifecycle.internal.LifecycleStarter.execute(LifecycleStarter.java:128) at org.apache.maven.DefaultMaven.doExecute(DefaultMaven.java:307) at org.apache.maven.DefaultMaven.doExecute(DefaultMaven.java:193) at org.apache.maven.DefaultMaven.execute(DefaultMaven.java:106) at org.apache.maven.cli.MavenCli.execute(MavenCli.java:863) at org.apache.maven.cli.MavenCli.doMain(MavenCli.java:288) at org.apache.maven.cli.MavenCli.main(MavenCli.java:199) at sun.reflect.NativeMethodAccessorImpl.invoke0(Native Method) at sun.reflect.NativeMethodAccessorImpl.invoke(NativeMethodAccessorImpl.java:62) at sun.reflect.DelegatingMethodAccessorImpl.invoke(DelegatingMethodAccessorImpl.java:43) at java.lang.reflect.Method.invoke(Method.java:498) at org.codehaus.plexus.classworlds.launcher.Launcher.launchEnhanced(Launcher.java:289) at org.codehaus.plexus.classworlds.launcher.Launcher.launch(Launcher.java:229) at org.codehaus.plexus.classworlds.launcher.Launcher.mainWithExitCode(Launcher.java:415) at org.codehaus.plexus.classworlds.launcher.Launcher.main(Launcher.java:356) Caused by: java.lang.**_ClassNotFoundException: oracle.jdbc.driver.OracleDriver_** at org.codehaus.plexus.classworlds.strategy.SelfFirstStrategy.loadClass(SelfFirstStrategy.java:50) at org.codehaus.plexus.classworlds.realm.ClassRealm.unsynchronizedLoadClass(ClassRealm.java:271) at org.codehaus.plexus.classworlds.realm.ClassRealm.loadClass(ClassRealm.java:247) at org.codehaus.plexus.classworlds.realm.ClassRealm.loadClass(ClassRealm.java:239) at java.lang.Class.forName0(Native Method) at java.lang.Class.forName(Class.java:264) at org.mybatis.generator.internal.ObjectFactory.externalClassForName(ObjectFactory.java:89) at org.mybatis.generator.internal.db.ConnectionFactory.getDriver(ConnectionFactory.java:81) ... 27 more [INFO] Final Memory: 9M/77M [INFO] ------------------------------------------------------------------------ [ERROR] Failed to execute goal org.mybatis.generator:mybatis-generator-maven-plugin:1.3.0:generate (default-cli) on project ssm: Exception getting JDBC Driver -> [Help 1] [ERROR] [ERROR] To see the full stack trace of the errors, re-run Maven with the -e switch. [ERROR] Re-run Maven using the -X switch to enable full debug logging. [ERROR] [ERROR] For more information about the errors and possible solutions, please read the following articles: [ERROR] [Help 1] http://cwiki.apache.org/confluence/display/MAVEN/MojoExecutionException 这是pom文件配置 <project xmlns="http://maven.apache.org/POM/4.0.0" xmlns:xsi="http://www.w3.org/2001/XMLSchema-instance" xsi:schemaLocation="http://maven.apache.org/POM/4.0.0 http://maven.apache.org/maven-v4_0_0.xsd"> <modelVersion>4.0.0</modelVersion> <groupId>com.chinasofti.ssmdemo</groupId> <artifactId>ssm</artifactId> <packaging>war</packaging> <version>1.0-SNAPSHOT</version> <name>ssm Maven Webapp</name> <url>http://maven.apache.org</url> <properties> <aspectj.version>1.8.9</aspectj.version> <jackson.version>1.9.13</jackson.version> <spring.version>4.3.4.RELEASE</spring.version> </properties> <dependencies> <!-- mvn install:install-file -DgroupId=com.oracle -DartifactId=ojdbc6 -Dversion=11.2.0.1.0 -Dpackaging=jar -Dfile=ojdbc6.jar --> <dependency> <groupId>com.oracle</groupId> <artifactId>ojdbc6</artifactId> <version>11.2.0.1.0</version> </dependency> <dependency> <groupId>junit</groupId> <artifactId>junit</artifactId> <version>3.8.1</version> <scope>test</scope> </dependency> <!-- servlet API --> <dependency> <groupId>javax.servlet</groupId> <artifactId>javax.servlet-api</artifactId> <version>3.1.0</version> </dependency> <!-- jstl֧�� --> <dependency> <groupId>javax.servlet</groupId> <artifactId>jstl</artifactId> <version>1.1.2</version> <type>jar</type> </dependency> <dependency> <groupId>taglibs</groupId> <artifactId>standard</artifactId> <version>1.1.2</version> <type>jar</type> </dependency> <!-- spring --> <dependency> <groupId>org.springframework</groupId> <artifactId>spring-webmvc</artifactId> <version>${spring.version}</version> </dependency> <dependency> <groupId>org.springframework</groupId> <artifactId>spring-orm</artifactId> <version>${spring.version}</version> </dependency> <!-- aspectj --> <dependency> <groupId>org.aspectj</groupId> <artifactId>aspectjrt</artifactId> <version>${aspectj.version}</version> </dependency> <dependency> <groupId>org.aspectj</groupId> <artifactId>aspectjweaver</artifactId> <version>${aspectj.version}</version> </dependency> <!-- jackson --> <dependency> <groupId>com.fasterxml.jackson.core</groupId> <artifactId>jackson-core</artifactId> <version>2.7.5</version> </dependency> <dependency> <groupId>com.fasterxml.jackson.core</groupId> <artifactId>jackson-databind</artifactId> <version>2.7.5</version> </dependency> <dependency> <groupId>com.fasterxml.jackson.core</groupId> <artifactId>jackson-annotations</artifactId> <version>2.7.5</version> </dependency> <dependency> <groupId>org.hibernate</groupId> <artifactId>hibernate-validator</artifactId> <version>5.3.4.Final</version> </dependency> <!-- �ļ��ϴ� --> <dependency> <groupId>commons-fileupload</groupId> <artifactId>commons-fileupload</artifactId> <version>1.3.3</version> </dependency> <!-- �־û� --> <dependency> <groupId>org.mybatis</groupId> <artifactId>mybatis</artifactId> <version>3.4.2</version> </dependency> <dependency> <groupId>org.mybatis</groupId> <artifactId>mybatis-spring</artifactId> <version>1.3.1</version> </dependency> <dependency> <groupId>mysql</groupId> <artifactId>mysql-connector-java</artifactId> <version>5.1.38</version> </dependency> <dependency> <groupId>commons-dbcp</groupId> <artifactId>commons-dbcp</artifactId> <version>1.4</version> </dependency> </dependencies> <build> <finalName>ssm</finalName> <plugins> <plugin> <groupId>org.apache.maven.plugins</groupId> <artifactId>maven-compiler-plugin</artifactId> <version>3.6.0</version> <configuration> <source>8</source> <target>8</target> <encoding>UTF-8</encoding> </configuration> </plugin> <plugin> <groupId>org.mybatis.generator</groupId> <artifactId>mybatis-generator-maven-plugin</artifactId> <version>1.3.0</version> <dependencies> <dependency> <groupId>mysql</groupId> <artifactId>mysql-connector-java</artifactId> <version>5.1.38</version> </dependency> </dependencies> </plugin> <plugin> <groupId>org.apache.maven.plugins</groupId> <artifactId>maven-dependency-plugin</artifactId> <executions> <execution> <id>copy-dependencies</id> <goals> <goal>copy-dependencies</goal> </goals> <configuration> <excludeArtifactIds>servlet-api,jsp-api</excludeArtifactIds> <outputDirectory>web/WEB-INF/lib</outputDirectory> <overWriteReleases>false</overWriteReleases> <overWriteSnapshots>true</overWriteSnapshots> </configuration> </execution> </executions> </plugin> </plugins> </build> </project> maven库是添加了oracl的jar包的![图片说明](https://img-ask.csdn.net/upload/201709/08/1504835578_584970.png)
springboot +shiro项目打成jar或war包后shiroFilter报错,无法创建bean shiroFilter
在STS上正常运行,mvnclean 和install后打成的jar包和war包都报错,报错内容如下: ``` org.springframework.beans.factory.BeanCreationException: Error creating bean with name 'shiroFilter' defined in class path resource [com/livinglibrary/config/ShiroConfig.class]: BeanPostProcessor before instantiation of bean failed; nested exception is org.springframework.beans.factory.UnsatisfiedDependencyException: Error creating bean with name 'authorizationAttributeSourceAdvisor' defined in class path resource [com/livinglibrary/config/ShiroConfig.class]: Unsatisfied dependency expressed through method 'authorizationAttributeSourceAdvisor' parameter 0; nested exception is org.springframework.beans.factory.BeanCreationException: Error creating bean with name 'securityManager' defined in class path resource [com/livinglibrary/config/ShiroConfig.class]: Bean instantiation via factory method failed; nested exception is org.springframework.beans.BeanInstantiationException: Failed to instantiate [org.apache.shiro.mgt.SecurityManager]: Factory method 'securityManager' threw exception; nested exception is org.springframework.beans.factory.BeanCreationException: Error creating bean with name 'myShiroRealm': Injection of resource dependencies failed; nested exception is org.springframework.beans.factory.BeanCreationException: Error creating bean with name 'shiroService': Injection of resource dependencies failed; nested exception is org.springframework.beans.factory.UnsatisfiedDependencyException: Error creating bean with name 'userMapper' defined in URL [jar:file:/F:/SpringBootProjects/livinglibrary/target/livinglibrary-0.0.1-SNAPSHOT.jar!/BOOT-INF/classes!/com/livinglibrary/mapper/UserMapper.class]: Unsatisfied dependency expressed through bean property 'sqlSessionFactory'; nested exception is org.springframework.beans.factory.UnsatisfiedDependencyException: Error creating bean with name 'org.mybatis.spring.boot.autoconfigure.MybatisAutoConfiguration': Unsatisfied dependency expressed through constructor parameter 0; nested exception is org.springframework.beans.factory.BeanCreationException: Error creating bean with name 'mybatis-org.mybatis.spring.boot.autoconfigure.MybatisProperties': Initialization of bean failed; nested exception is java.lang.NoClassDefFoundError: javax/xml/bind/ValidationException at org.springframework.beans.factory.support.AbstractAutowireCapableBeanFactory.createBean(AbstractAutowireCapableBeanFactory.java:478) ~[spring-beans-4.3.3.RELEASE.jar!/:4.3.3.RELEASE] at org.springframework.beans.factory.support.AbstractBeanFactory$1.getObject(AbstractBeanFactory.java:306) ~[spring-beans-4.3.3.RELEASE.jar!/:4.3.3.RELEASE] at org.springframework.beans.factory.support.DefaultSingletonBeanRegistry.getSingleton(DefaultSingletonBeanRegistry.java:230) ~[spring-beans-4.3.3.RELEASE.jar!/:4.3.3.RELEASE] at org.springframework.beans.factory.support.AbstractBeanFactory.doGetBean(AbstractBeanFactory.java:302) ~[spring-beans-4.3.3.RELEASE.jar!/:4.3.3.RELEASE] at org.springframework.beans.factory.support.AbstractBeanFactory.getBean(AbstractBeanFactory.java:202) ~[spring-beans-4.3.3.RELEASE.jar!/:4.3.3.RELEASE] at org.springframework.context.support.PostProcessorRegistrationDelegate.registerBeanPostProcessors(PostProcessorRegistrationDelegate.java:240) ~[spring-context-4.3.3.RELEASE.jar!/:4.3.3.RELEASE] at org.springframework.context.support.AbstractApplicationContext.registerBeanPostProcessors(AbstractApplicationContext.java:697) ~[spring-context-4.3.3.RELEASE.jar!/:4.3.3.RELEASE] at org.springframework.context.support.AbstractApplicationContext.refresh(AbstractApplicationContext.java:526) ~[spring-context-4.3.3.RELEASE.jar!/:4.3.3.RELEASE] at org.springframework.boot.context.embedded.EmbeddedWebApplicationContext.refresh(EmbeddedWebApplicationContext.java:122) ~[spring-boot-1.4.1.RELEASE.jar!/:1.4.1.RELEASE] at org.springframework.boot.SpringApplication.refresh(SpringApplication.java:761) [spring-boot-1.4.1.RELEASE.jar!/:1.4.1.RELEASE] at org.springframework.boot.SpringApplication.refreshContext(SpringApplication.java:371) [spring-boot-1.4.1.RELEASE.jar!/:1.4.1.RELEASE] at org.springframework.boot.SpringApplication.run(SpringApplication.java:315) [spring-boot-1.4.1.RELEASE.jar!/:1.4.1.RELEASE] at org.springframework.boot.SpringApplication.run(SpringApplication.java:1186) [spring-boot-1.4.1.RELEASE.jar!/:1.4.1.RELEASE] at org.springframework.boot.SpringApplication.run(SpringApplication.java:1175) [spring-boot-1.4.1.RELEASE.jar!/:1.4.1.RELEASE] at com.livinglibrary.App.main(App.java:65) [classes!/:0.0.1-SNAPSHOT] at java.base/jdk.internal.reflect.NativeMethodAccessorImpl.invoke0(Native Method) ~[na:na] at java.base/jdk.internal.reflect.NativeMethodAccessorImpl.invoke(Unknown Source) ~[na:na] at java.base/jdk.internal.reflect.DelegatingMethodAccessorImpl.invoke(Unknown Source) ~[na:na] at java.base/java.lang.reflect.Method.invoke(Unknown Source) ~[na:na] at org.springframework.boot.loader.MainMethodRunner.run(MainMethodRunner.java:48) [livinglibrary-0.0.1-SNAPSHOT.jar:0.0.1-SNAPSHOT] at org.springframework.boot.loader.Launcher.launch(Launcher.java:87) [livinglibrary-0.0.1-SNAPSHOT.jar:0.0.1-SNAPSHOT] at org.springframework.boot.loader.Launcher.launch(Launcher.java:50) [livinglibrary-0.0.1-SNAPSHOT.jar:0.0.1-SNAPSHOT] at org.springframework.boot.loader.JarLauncher.main(JarLauncher.java:58) [livinglibrary-0.0.1-SNAPSHOT.jar:0.0.1-SNAPSHOT] Caused by: org.springframework.beans.factory.UnsatisfiedDependencyException: Error creating bean with name 'authorizationAttributeSourceAdvisor' defined in class path resource [com/livinglibrary/config/ShiroConfig.class]: Unsatisfied dependency expressed through method 'authorizationAttributeSourceAdvisor' parameter 0; nested exception is org.springframework.beans.factory.BeanCreationException: Error creating bean with name 'securityManager' defined in class path resource [com/livinglibrary/config/ShiroConfig.class]: Bean instantiation via factory method failed; nested exception is org.springframework.beans.BeanInstantiationException: Failed to instantiate [org.apache.shiro.mgt.SecurityManager]: Factory method 'securityManager' threw exception; nested exception is org.springframework.beans.factory.BeanCreationException: Error creating bean with name 'myShiroRealm': Injection of resource dependencies failed; nested exception is org.springframework.beans.factory.BeanCreationException: Error creating bean with name 'shiroService': Injection of resource dependencies failed; nested exception is org.springframework.beans.factory.UnsatisfiedDependencyException: Error creating bean with name 'userMapper' defined in URL [jar:file:/F:/SpringBootProjects/livinglibrary/target/livinglibrary-0.0.1-SNAPSHOT.jar!/BOOT-INF/classes!/com/livinglibrary/mapper/UserMapper.class]: Unsatisfied dependency expressed through bean property 'sqlSessionFactory'; nested exception is org.springframework.beans.factory.UnsatisfiedDependencyException: Error creating bean with name 'org.mybatis.spring.boot.autoconfigure.MybatisAutoConfiguration': Unsatisfied dependency expressed through constructor parameter 0; nested exception is org.springframework.beans.factory.BeanCreationException: Error creating bean with name 'mybatis-org.mybatis.spring.boot.autoconfigure.MybatisProperties': Initialization of bean failed; nested exception is java.lang.NoClassDefFoundError: javax/xml/bind/ValidationException at org.springframework.beans.factory.support.ConstructorResolver.createArgumentArray(ConstructorResolver.java:749) ~[spring-beans-4.3.3.RELEASE.jar!/:4.3.3.RELEASE] at org.springframework.beans.factory.support.ConstructorResolver.instantiateUsingFactoryMethod(ConstructorResolver.java:467) ~[spring-beans-4.3.3.RELEASE.jar!/:4.3.3.RELEASE] at org.springframework.beans.factory.support.AbstractAutowireCapableBeanFactory.instantiateUsingFactoryMethod(AbstractAutowireCapableBeanFactory.java:1128) ~[spring-beans-4.3.3.RELEASE.jar!/:4.3.3.RELEASE] at org.springframework.beans.factory.support.AbstractAutowireCapableBeanFactory.createBeanInstance(AbstractAutowireCapableBeanFactory.java:1023) ~[spring-beans-4.3.3.RELEASE.jar!/:4.3.3.RELEASE] at org.springframework.beans.factory.support.AbstractAutowireCapableBeanFactory.doCreateBean(AbstractAutowireCapableBeanFactory.java:510) ~[spring-beans-4.3.3.RELEASE.jar!/:4.3.3.RELEASE] at org.springframework.beans.factory.support.AbstractAutowireCapableBeanFactory.createBean(AbstractAutowireCapableBeanFactory.java:482) ~[spring-beans-4.3.3.RELEASE.jar!/:4.3.3.RELEASE] at org.springframework.beans.factory.support.AbstractBeanFactory$1.getObject(AbstractBeanFactory.java:306) ~[spring-beans-4.3.3.RELEASE.jar!/:4.3.3.RELEASE] at org.springframework.beans.factory.support.DefaultSingletonBeanRegistry.getSingleton(DefaultSingletonBeanRegistry.java:230) ~[spring-beans-4.3.3.RELEASE.jar!/:4.3.3.RELEASE] at org.springframework.beans.factory.support.AbstractBeanFactory.doGetBean(AbstractBeanFactory.java:302) ~[spring-beans-4.3.3.RELEASE.jar!/:4.3.3.RELEASE] at org.springframework.beans.factory.support.AbstractBeanFactory.getBean(AbstractBeanFactory.java:202) ~[spring-beans-4.3.3.RELEASE.jar!/:4.3.3.RELEASE] at org.springframework.aop.framework.autoproxy.BeanFactoryAdvisorRetrievalHelper.findAdvisorBeans(BeanFactoryAdvisorRetrievalHelper.java:92) ~[spring-aop-4.3.3.RELEASE.jar!/:4.3.3.RELEASE] at org.springframework.aop.framework.autoproxy.AbstractAdvisorAutoProxyCreator.findCandidateAdvisors(AbstractAdvisorAutoProxyCreator.java:101) ~[spring-aop-4.3.3.RELEASE.jar!/:4.3.3.RELEASE] at org.springframework.aop.aspectj.annotation.AnnotationAwareAspectJAutoProxyCreator.findCandidateAdvisors(AnnotationAwareAspectJAutoProxyCreator.java:85) ~[spring-aop-4.3.3.RELEASE.jar!/:4.3.3.RELEASE] at org.springframework.aop.aspectj.autoproxy.AspectJAwareAdvisorAutoProxyCreator.shouldSkip(AspectJAwareAdvisorAutoProxyCreator.java:103) ~[spring-aop-4.3.3.RELEASE.jar!/:4.3.3.RELEASE] at org.springframework.aop.framework.autoproxy.AbstractAutoProxyCreator.postProcessBeforeInstantiation(AbstractAutoProxyCreator.java:249) ~[spring-aop-4.3.3.RELEASE.jar!/:4.3.3.RELEASE] at org.springframework.beans.factory.support.AbstractAutowireCapableBeanFactory.applyBeanPostProcessorsBeforeInstantiation(AbstractAutowireCapableBeanFactory.java:993) ~[spring-beans-4.3.3.RELEASE.jar!/:4.3.3.RELEASE] at org.springframework.beans.factory.support.AbstractAutowireCapableBeanFactory.resolveBeforeInstantiation(AbstractAutowireCapableBeanFactory.java:964) ~[spring-beans-4.3.3.RELEASE.jar!/:4.3.3.RELEASE] at org.springframework.beans.factory.support.AbstractAutowireCapableBeanFactory.createBean(AbstractAutowireCapableBeanFactory.java:472) ~[spring-beans-4.3.3.RELEASE.jar!/:4.3.3.RELEASE] ... 22 common frames omitted Caused by: org.springframework.beans.factory.BeanCreationException: Error creating bean with name 'securityManager' defined in class path resource [com/livinglibrary/config/ShiroConfig.class]: Bean instantiation via factory method failed; nested exception is org.springframework.beans.BeanInstantiationException: Failed to instantiate [org.apache.shiro.mgt.SecurityManager]: Factory method 'securityManager' threw exception; nested exception is org.springframework.beans.factory.BeanCreationException: Error creating bean with name 'myShiroRealm': Injection of resource dependencies failed; nested exception is org.springframework.beans.factory.BeanCreationException: Error creating bean with name 'shiroService': Injection of resource dependencies failed; nested exception is org.springframework.beans.factory.UnsatisfiedDependencyException: Error creating bean with name 'userMapper' defined in URL [jar:file:/F:/SpringBootProjects/livinglibrary/target/livinglibrary-0.0.1-SNAPSHOT.jar!/BOOT-INF/classes!/com/livinglibrary/mapper/UserMapper.class]: Unsatisfied dependency expressed through bean property 'sqlSessionFactory'; nested exception is org.springframework.beans.factory.UnsatisfiedDependencyException: Error creating bean with name 'org.mybatis.spring.boot.autoconfigure.MybatisAutoConfiguration': Unsatisfied dependency expressed through constructor parameter 0; nested exception is org.springframework.beans.factory.BeanCreationException: Error creating bean with name 'mybatis-org.mybatis.spring.boot.autoconfigure.MybatisProperties': Initialization of bean failed; nested exception is java.lang.NoClassDefFoundError: javax/xml/bind/ValidationException at org.springframework.beans.factory.support.ConstructorResolver.instantiateUsingFactoryMethod(ConstructorResolver.java:599) ~[spring-beans-4.3.3.RELEASE.jar!/:4.3.3.RELEASE] at org.springframework.beans.factory.support.AbstractAutowireCapableBeanFactory.instantiateUsingFactoryMethod(AbstractAutowireCapableBeanFactory.java:1128) ~[spring-beans-4.3.3.RELEASE.jar!/:4.3.3.RELEASE] at org.springframework.beans.factory.support.AbstractAutowireCapableBeanFactory.createBeanInstance(AbstractAutowireCapableBeanFactory.java:1023) ~[spring-beans-4.3.3.RELEASE.jar!/:4.3.3.RELEASE] at org.springframework.beans.factory.support.AbstractAutowireCapableBeanFactory.doCreateBean(AbstractAutowireCapableBeanFactory.java:510) ~[spring-beans-4.3.3.RELEASE.jar!/:4.3.3.RELEASE] at org.springframework.beans.factory.support.AbstractAutowireCapableBeanFactory.createBean(AbstractAutowireCapableBeanFactory.java:482) ~[spring-beans-4.3.3.RELEASE.jar!/:4.3.3.RELEASE] at org.springframework.beans.factory.support.AbstractBeanFactory$1.getObject(AbstractBeanFactory.java:306) ~[spring-beans-4.3.3.RELEASE.jar!/:4.3.3.RELEASE] at org.springframework.beans.factory.support.DefaultSingletonBeanRegistry.getSingleton(DefaultSingletonBeanRegistry.java:230) ~[spring-beans-4.3.3.RELEASE.jar!/:4.3.3.RELEASE] at org.springframework.beans.factory.support.AbstractBeanFactory.doGetBean(AbstractBeanFactory.java:302) ~[spring-beans-4.3.3.RELEASE.jar!/:4.3.3.RELEASE] at org.springframework.beans.factory.support.AbstractBeanFactory.getBean(AbstractBeanFactory.java:202) ~[spring-beans-4.3.3.RELEASE.jar!/:4.3.3.RELEASE] at org.springframework.beans.factory.config.DependencyDescriptor.resolveCandidate(DependencyDescriptor.java:207) ~[spring-beans-4.3.3.RELEASE.jar!/:4.3.3.RELEASE] at org.springframework.beans.factory.support.DefaultListableBeanFactory.doResolveDependency(DefaultListableBeanFactory.java:1128) ~[spring-beans-4.3.3.RELEASE.jar!/:4.3.3.RELEASE] at org.springframework.beans.factory.support.DefaultListableBeanFactory.resolveDependency(DefaultListableBeanFactory.java:1056) ~[spring-beans-4.3.3.RELEASE.jar!/:4.3.3.RELEASE] at org.springframework.beans.factory.support.ConstructorResolver.resolveAutowiredArgument(ConstructorResolver.java:835) ~[spring-beans-4.3.3.RELEASE.jar!/:4.3.3.RELEASE] at org.springframework.beans.factory.support.ConstructorResolver.createArgumentArray(ConstructorResolver.java:741) ~[spring-beans-4.3.3.RELEASE.jar!/:4.3.3.RELEASE] ... 39 common frames omitted Caused by: org.springframework.beans.BeanInstantiationException: Failed to instantiate [org.apache.shiro.mgt.SecurityManager]: Factory method 'securityManager' threw exception; nested exception is org.springframework.beans.factory.BeanCreationException: Error creating bean with name 'myShiroRealm': Injection of resource dependencies failed; nested exception is org.springframework.beans.factory.BeanCreationException: Error creating bean with name 'shiroService': Injection of resource dependencies failed; nested exception is org.springframework.beans.factory.UnsatisfiedDependencyException: Error creating bean with name 'userMapper' defined in URL [jar:file:/F:/SpringBootProjects/livinglibrary/target/livinglibrary-0.0.1-SNAPSHOT.jar!/BOOT-INF/classes!/com/livinglibrary/mapper/UserMapper.class]: Unsatisfied dependency expressed through bean property 'sqlSessionFactory'; nested exception is org.springframework.beans.factory.UnsatisfiedDependencyException: Error creating bean with name 'org.mybatis.spring.boot.autoconfigure.MybatisAutoConfiguration': Unsatisfied dependency expressed through constructor parameter 0; nested exception is org.springframework.beans.factory.BeanCreationException: Error creating bean with name 'mybatis-org.mybatis.spring.boot.autoconfigure.MybatisProperties': Initialization of bean failed; nested exception is java.lang.NoClassDefFoundError: javax/xml/bind/ValidationException at org.springframework.beans.factory.support.SimpleInstantiationStrategy.instantiate(SimpleInstantiationStrategy.java:189) ~[spring-beans-4.3.3.RELEASE.jar!/:4.3.3.RELEASE] at org.springframework.beans.factory.support.ConstructorResolver.instantiateUsingFactoryMethod(ConstructorResolver.java:588) ~[spring-beans-4.3.3.RELEASE.jar!/:4.3.3.RELEASE] ... 52 common frames omitted Caused by: org.springframework.beans.factory.BeanCreationException: Error creating bean with name 'myShiroRealm': Injection of resource dependencies failed; nested exception is org.springframework.beans.factory.BeanCreationException: Error creating bean with name 'shiroService': Injection of resource dependencies failed; nested exception is org.springframework.beans.factory.UnsatisfiedDependencyException: Error creating bean with name 'userMapper' defined in URL [jar:file:/F:/SpringBootProjects/livinglibrary/target/livinglibrary-0.0.1-SNAPSHOT.jar!/BOOT-INF/classes!/com/livinglibrary/mapper/UserMapper.class]: Unsatisfied dependency expressed through bean property 'sqlSessionFactory'; nested exception is org.springframework.beans.factory.UnsatisfiedDependencyException: Error creating bean with name 'org.mybatis.spring.boot.autoconfigure.MybatisAutoConfiguration': Unsatisfied dependency expressed through constructor parameter 0; nested exception is org.springframework.beans.factory.BeanCreationException: Error creating bean with name 'mybatis-org.mybatis.spring.boot.autoconfigure.MybatisProperties': Initialization of bean failed; nested exception is java.lang.NoClassDefFoundError: javax/xml/bind/ValidationException at org.springframework.context.annotation.CommonAnnotationBeanPostProcessor.postProcessPropertyValues(CommonAnnotationBeanPostProcessor.java:321) ~[spring-context-4.3.3.RELEASE.jar!/:4.3.3.RELEASE] at org.springframework.beans.factory.support.AbstractAutowireCapableBeanFactory.populateBean(AbstractAutowireCapableBeanFactory.java:1219) ~[spring-beans-4.3.3.RELEASE.jar!/:4.3.3.RELEASE] at org.springframework.beans.factory.support.AbstractAutowireCapableBeanFactory.doCreateBean(AbstractAutowireCapableBeanFactory.java:543) ~[spring-beans-4.3.3.RELEASE.jar!/:4.3.3.RELEASE] at org.springframework.beans.factory.support.AbstractAutowireCapableBeanFactory.createBean(AbstractAutowireCapableBeanFactory.java:482) ~[spring-beans-4.3.3.RELEASE.jar!/:4.3.3.RELEASE] at org.springframework.beans.factory.support.AbstractBeanFactory$1.getObject(AbstractBeanFactory.java:306) ~[spring-beans-4.3.3.RELEASE.jar!/:4.3.3.RELEASE] at org.springframework.beans.factory.support.DefaultSingletonBeanRegistry.getSingleton(DefaultSingletonBeanRegistry.java:230) ~[spring-beans-4.3.3.RELEASE.jar!/:4.3.3.RELEASE] at org.springframework.beans.factory.support.AbstractBeanFactory.doGetBean(AbstractBeanFactory.java:302) ~[spring-beans-4.3.3.RELEASE.jar!/:4.3.3.RELEASE] at org.springframework.beans.factory.support.AbstractBeanFactory.getBean(AbstractBeanFactory.java:197) ~[spring-beans-4.3.3.RELEASE.jar!/:4.3.3.RELEASE] at org.springframework.context.annotation.ConfigurationClassEnhancer$BeanMethodInterceptor.intercept(ConfigurationClassEnhancer.java:381) ~[spring-context-4.3.3.RELEASE.jar!/:4.3.3.RELEASE] at com.livinglibrary.config.ShiroConfig$$EnhancerBySpringCGLIB$$6346f6e4.myShiroRealm(<generated>) ~[classes!/:0.0.1-SNAPSHOT] at com.livinglibrary.config.ShiroConfig.securityManager(ShiroConfig.java:89) ~[classes!/:0.0.1-SNAPSHOT] at com.livinglibrary.config.ShiroConfig$$EnhancerBySpringCGLIB$$6346f6e4.CGLIB$securityManager$0(<generated>) ~[classes!/:0.0.1-SNAPSHOT] at com.livinglibrary.config.ShiroConfig$$EnhancerBySpringCGLIB$$6346f6e4$$FastClassBySpringCGLIB$$5d683da7.invoke(<generated>) ~[classes!/:0.0.1-SNAPSHOT] at org.springframework.cglib.proxy.MethodProxy.invokeSuper(MethodProxy.java:228) ~[spring-core-4.3.3.RELEASE.jar!/:4.3.3.RELEASE] at org.springframework.context.annotation.ConfigurationClassEnhancer$BeanMethodInterceptor.intercept(ConfigurationClassEnhancer.java:356) ~[spring-context-4.3.3.RELEASE.jar!/:4.3.3.RELEASE] at com.livinglibrary.config.ShiroConfig$$EnhancerBySpringCGLIB$$6346f6e4.securityManager(<generated>) ~[classes!/:0.0.1-SNAPSHOT] at java.base/jdk.internal.reflect.NativeMethodAccessorImpl.invoke0(Native Method) ~[na:na] at java.base/jdk.internal.reflect.NativeMethodAccessorImpl.invoke(Unknown Source) ~[na:na] at java.base/jdk.internal.reflect.DelegatingMethodAccessorImpl.invoke(Unknown Source) ~[na:na] at java.base/java.lang.reflect.Method.invoke(Unknown Source) ~[na:na] at org.springframework.beans.factory.support.SimpleInstantiationStrategy.instantiate(SimpleInstantiationStrategy.java:162) ~[spring-beans-4.3.3.RELEASE.jar!/:4.3.3.RELEASE] ... 53 common frames omitted Caused by: org.springframework.beans.factory.BeanCreationException: Error creating bean with name 'shiroService': Injection of resource dependencies failed; nested exception is org.springframework.beans.factory.UnsatisfiedDependencyException: Error creating bean with name 'userMapper' defined in URL [jar:file:/F:/SpringBootProjects/livinglibrary/target/livinglibrary-0.0.1-SNAPSHOT.jar!/BOOT-INF/classes!/com/livinglibrary/mapper/UserMapper.class]: Unsatisfied dependency expressed through bean property 'sqlSessionFactory'; nested exception is org.springframework.beans.factory.UnsatisfiedDependencyException: Error creating bean with name 'org.mybatis.spring.boot.autoconfigure.MybatisAutoConfiguration': Unsatisfied dependency expressed through constructor parameter 0; nested exception is org.springframework.beans.factory.BeanCreationException: Error creating bean with name 'mybatis-org.mybatis.spring.boot.autoconfigure.MybatisProperties': Initialization of bean failed; nested exception is java.lang.NoClassDefFoundError: javax/xml/bind/ValidationException at org.springframework.context.annotation.CommonAnnotationBeanPostProcessor.postProcessPropertyValues(CommonAnnotationBeanPostProcessor.java:321) ~[spring-context-4.3.3.RELEASE.jar!/:4.3.3.RELEASE] at org.springframework.beans.factory.support.AbstractAutowireCapableBeanFactory.populateBean(AbstractAutowireCapableBeanFactory.java:1219) ~[spring-beans-4.3.3.RELEASE.jar!/:4.3.3.RELEASE] at org.springframework.beans.factory.support.AbstractAutowireCapableBeanFactory.doCreateBean(AbstractAutowireCapableBeanFactory.java:543) ~[spring-beans-4.3.3.RELEASE.jar!/:4.3.3.RELEASE] at org.springframework.beans.factory.support.AbstractAutowireCapableBeanFactory.createBean(AbstractAutowireCapableBeanFactory.java:482) ~[spring-beans-4.3.3.RELEASE.jar!/:4.3.3.RELEASE] at org.springframework.beans.factory.support.AbstractBeanFactory$1.getObject(AbstractBeanFactory.java:306) ~[spring-beans-4.3.3.RELEASE.jar!/:4.3.3.RELEASE] at org.springframework.beans.factory.support.DefaultSingletonBeanRegistry.getSingleton(DefaultSingletonBeanRegistry.java:230) ~[spring-beans-4.3.3.RELEASE.jar!/:4.3.3.RELEASE] at org.springframework.beans.factory.support.AbstractBeanFactory.doGetBean(AbstractBeanFactory.java:302) ~[spring-beans-4.3.3.RELEASE.jar!/:4.3.3.RELEASE] at org.springframework.beans.factory.support.AbstractBeanFactory.getBean(AbstractBeanFactory.java:202) ~[spring-beans-4.3.3.RELEASE.jar!/:4.3.3.RELEASE] at org.springframework.context.annotation.CommonAnnotationBeanPostProcessor.autowireResource(CommonAnnotationBeanPostProcessor.java:522) ~[spring-context-4.3.3.RELEASE.jar!/:4.3.3.RELEASE] at org.springframework.context.annotation.CommonAnnotationBeanPostProcessor.getResource(CommonAnnotationBeanPostProcessor.java:496) ~[spring-context-4.3.3.RELEASE.jar!/:4.3.3.RELEASE] at org.springframework.context.annotation.CommonAnnotationBeanPostProcessor$ResourceElement.getResourceToInject(CommonAnnotationBeanPostProcessor.java:627) ~[spring-context-4.3.3.RELEASE.jar!/:4.3.3.RELEASE] at org.springframework.beans.factory.annotation.InjectionMetadata$InjectedElement.inject(InjectionMetadata.java:169) ~[spring-beans-4.3.3.RELEASE.jar!/:4.3.3.RELEASE] at org.springframework.beans.factory.annotation.InjectionMetadata.inject(InjectionMetadata.java:88) ~[spring-beans-4.3.3.RELEASE.jar!/:4.3.3.RELEASE] at org.springframework.context.annotation.CommonAnnotationBeanPostProcessor.postProcessPropertyValues(CommonAnnotationBeanPostProcessor.java:318) ~[spring-context-4.3.3.RELEASE.jar!/:4.3.3.RELEASE] ... 73 common frames omitted Caused by: org.springframework.beans.factory.UnsatisfiedDependencyException: Error creating bean with name 'userMapper' defined in URL [jar:file:/F:/SpringBootProjects/livinglibrary/target/livinglibrary-0.0.1-SNAPSHOT.jar!/BOOT-INF/classes!/com/livinglibrary/mapper/UserMapper.class]: Unsatisfied dependency expressed through bean property 'sqlSessionFactory'; nested exception is org.springframework.beans.factory.UnsatisfiedDependencyException: Error creating bean with name 'org.mybatis.spring.boot.autoconfigure.MybatisAutoConfiguration': Unsatisfied dependency expressed through constructor parameter 0; nested exception is org.springframework.beans.factory.BeanCreationException: Error creating bean with name 'mybatis-org.mybatis.spring.boot.autoconfigure.MybatisProperties': Initialization of bean failed; nested exception is java.lang.NoClassDefFoundError: javax/xml/bind/ValidationException at org.springframework.beans.factory.support.AbstractAutowireCapableBeanFactory.autowireByType(AbstractAutowireCapableBeanFactory.java:1312) ~[spring-beans-4.3.3.RELEASE.jar!/:4.3.3.RELEASE] at org.springframework.beans.factory.support.AbstractAutowireCapableBeanFactory.populateBean(AbstractAutowireCapableBeanFactory.java:1204) ~[spring-beans-4.3.3.RELEASE.jar!/:4.3.3.RELEASE] at org.springframework.beans.factory.support.AbstractAutowireCapableBeanFactory.doCreateBean(AbstractAutowireCapableBeanFactory.java:543) ~[spring-beans-4.3.3.RELEASE.jar!/:4.3.3.RELEASE] at org.springframework.beans.factory.support.AbstractAutowireCapableBeanFactory.createBean(AbstractAutowireCapableBeanFactory.java:482) ~[spring-beans-4.3.3.RELEASE.jar!/:4.3.3.RELEASE] at org.springframework.beans.factory.support.AbstractBeanFactory$1.getObject(AbstractBeanFactory.java:306) ~[spring-beans-4.3.3.RELEASE.jar!/:4.3.3.RELEASE] at org.springframework.beans.factory.support.DefaultSingletonBeanRegistry.getSingleton(DefaultSingletonBeanRegistry.java:230) ~[spring-beans-4.3.3.RELEASE.jar!/:4.3.3.RELEASE] at org.springframework.beans.factory.support.AbstractBeanFactory.doGetBean(AbstractBeanFactory.java:302) ~[spring-beans-4.3.3.RELEASE.jar!/:4.3.3.RELEASE] at org.springframework.beans.factory.support.AbstractBeanFactory.getBean(AbstractBeanFactory.java:202) ~[spring-beans-4.3.3.RELEASE.jar!/:4.3.3.RELEASE] at org.springframework.context.annotation.CommonAnnotationBeanPostProcessor.autowireResource(CommonAnnotationBeanPostProcessor.java:522) ~[spring-context-4.3.3.RELEASE.jar!/:4.3.3.RELEASE] at org.springframework.context.annotation.CommonAnnotationBeanPostProcessor.getResource(CommonAnnotationBeanPostProcessor.java:496) ~[spring-context-4.3.3.RELEASE.jar!/:4.3.3.RELEASE] at org.springframework.context.annotation.CommonAnnotationBeanPostProcessor$ResourceElement.getResourceToInject(CommonAnnotationBeanPostProcessor.java:627) ~[spring-context-4.3.3.RELEASE.jar!/:4.3.3.RELEASE] at org.springframework.beans.factory.annotation.InjectionMetadata$InjectedElement.inject(InjectionMetadata.java:169) ~[spring-beans-4.3.3.RELEASE.jar!/:4.3.3.RELEASE] at org.springframework.beans.factory.annotation.InjectionMetadata.inject(InjectionMetadata.java:88) ~[spring-beans-4.3.3.RELEASE.jar!/:4.3.3.RELEASE] at org.springframework.context.annotation.CommonAnnotationBeanPostProcessor.postProcessPropertyValues(CommonAnnotationBeanPostProcessor.java:318) ~[spring-context-4.3.3.RELEASE.jar!/:4.3.3.RELEASE] ... 86 common frames omitted Caused by: org.springframework.beans.factory.UnsatisfiedDependencyException: Error creating bean with name 'org.mybatis.spring.boot.autoconfigure.MybatisAutoConfiguration': Unsatisfied dependency expressed through constructor parameter 0; nested exception is org.springframework.beans.factory.BeanCreationException: Error creating bean with name 'mybatis-org.mybatis.spring.boot.autoconfigure.MybatisProperties': Initialization of bean failed; nested exception is java.lang.NoClassDefFoundError: javax/xml/bind/ValidationException at org.springframework.beans.factory.support.ConstructorResolver.createArgumentArray(ConstructorResolver.java:749) ~[spring-beans-4.3.3.RELEASE.jar!/:4.3.3.RELEASE] at org.springframework.beans.factory.support.ConstructorResolver.autowireConstructor(ConstructorResolver.java:189) ~[spring-beans-4.3.3.RELEASE.jar!/:4.3.3.RELEASE] at org.springframework.beans.factory.support.AbstractAutowireCapableBeanFactory.autowireConstructor(AbstractAutowireCapableBeanFactory.java:1148) ~[spring-beans-4.3.3.RELEASE.jar!/:4.3.3.RELEASE] at org.springframework.beans.factory.support.AbstractAutowireCapableBeanFactory.createBeanInstance(AbstractAutowireCapableBeanFactory.java:1051) ~[spring-beans-4.3.3.RELEASE.jar!/:4.3.3.RELEASE] at org.springframework.beans.factory.support.AbstractAutowireCapableBeanFactory.doCreateBean(AbstractAutowireCapableBeanFactory.java:510) ~[spring-beans-4.3.3.RELEASE.jar!/:4.3.3.RELEASE] at org.springframework.beans.factory.support.AbstractAutowireCapableBeanFactory.createBean(AbstractAutowireCapableBeanFactory.java:482) ~[spring-beans-4.3.3.RELEASE.jar!/:4.3.3.RELEASE] at org.springframework.beans.factory.support.AbstractBeanFactory$1.getObject(AbstractBeanFactory.java:306) ~[spring-beans-4.3.3.RELEASE.jar!/:4.3.3.RELEASE] at org.springframework.beans.factory.support.DefaultSingletonBeanRegistry.getSingleton(DefaultSingletonBeanRegistry.java:230) ~[spring-beans-4.3.3.RELEASE.jar!/:4.3.3.RELEASE] at org.springframework.beans.factory.support.AbstractBeanFactory.doGetBean(AbstractBeanFactory.java:302) ~[spring-beans-4.3.3.RELEASE.jar!/:4.3.3.RELEASE] at org.springframework.beans.factory.support.AbstractBeanFactory.getBean(AbstractBeanFactory.java:197) ~[spring-beans-4.3.3.RELEASE.jar!/:4.3.3.RELEASE] at org.springframework.beans.factory.support.ConstructorResolver.instantiateUsingFactoryMethod(ConstructorResolver.java:372) ~[spring-beans-4.3.3.RELEASE.jar!/:4.3.3.RELEASE] at org.springframework.beans.factory.support.AbstractAutowireCapableBeanFactory.instantiateUsingFactoryMethod(AbstractAutowireCapableBeanFactory.java:1128) ~[spring-beans-4.3.3.RELEASE.jar!/:4.3.3.RELEASE] at org.springframework.beans.factory.support.AbstractAutowireCapableBeanFactory.createBeanInstance(AbstractAutowireCapableBeanFactory.java:1023) ~[spring-beans-4.3.3.RELEASE.jar!/:4.3.3.RELEASE] at org.springframework.beans.factory.support.AbstractAutowireCapableBeanFactory.doCreateBean(AbstractAutowireCapableBeanFactory.java:510) ~[spring-beans-4.3.3.RELEASE.jar!/:4.3.3.RELEASE] at org.springframework.beans.factory.support.AbstractAutowireCapableBeanFactory.createBean(AbstractAutowireCapableBeanFactory.java:482) ~[spring-beans-4.3.3.RELEASE.jar!/:4.3.3.RELEASE] at org.springframework.beans.factory.support.AbstractBeanFactory$1.getObject(AbstractBeanFactory.java:306) ~[spring-beans-4.3.3.RELEASE.jar!/:4.3.3.RELEASE] at org.springframework.beans.factory.support.DefaultSingletonBeanRegistry.getSingleton(DefaultSingletonBeanRegistry.java:230) ~[spring-beans-4.3.3.RELEASE.jar!/:4.3.3.RELEASE] at org.springframework.beans.factory.support.AbstractBeanFactory.doGetBean(AbstractBeanFactory.java:302) ~[spring-beans-4.3.3.RELEASE.jar!/:4.3.3.RELEASE] at org.springframework.beans.factory.support.AbstractBeanFactory.getBean(AbstractBeanFactory.java:202) ~[spring-beans-4.3.3.RELEASE.jar!/:4.3.3.RELEASE] at org.springframework.beans.factory.config.DependencyDescriptor.resolveCandidate(DependencyDescriptor.java:207) ~[spring-beans-4.3.3.RELEASE.jar!/:4.3.3.RELEASE] at org.springframework.beans.factory.support.DefaultListableBeanFactory.doResolveDependency(DefaultListableBeanFactory.java:1128) ~[spring-beans-4.3.3.RELEASE.jar!/:4.3.3.RELEASE] at org.springframework.beans.factory.support.DefaultListableBeanFactory.resolveDependency(DefaultListableBeanFactory.java:1056) ~[spring-beans-4.3.3.RELEASE.jar!/:4.3.3.RELEASE] at org.springframework.beans.factory.support.AbstractAutowireCapableBeanFactory.autowireByType(AbstractAutowireCapableBeanFactory.java:1297) ~[spring-beans-4.3.3.RELEASE.jar!/:4.3.3.RELEASE] ... 99 common frames omitted Caused by: org.springframework.beans.factory.BeanCreationException: Error creating bean with name 'mybatis-org.mybatis.spring.boot.autoconfigure.MybatisProperties': Initialization of bean failed; nested exception is java.lang.NoClassDefFoundError: javax/xml/bind/ValidationException at org.springframework.beans.factory.support.AbstractAutowireCapableBeanFactory.doCreateBean(AbstractAutowireCapableBeanFactory.java:553) ~[spring-beans-4.3.3.RELEASE.jar!/:4.3.3.RELEASE] at org.springframework.beans.factory.support.AbstractAutowireCapableBeanFactory.createBean(AbstractAutowireCapableBeanFactory.java:482) ~[spring-beans-4.3.3.RELEASE.jar!/:4.3.3.RELEASE] at org.springframework.beans.factory.support.AbstractBeanFactory$1.getObject(AbstractBeanFactory.java:306) ~[spring-beans-4.3.3.RELEASE.jar!/:4.3.3.RELEASE] at org.springframework.beans.factory.support.DefaultSingletonBeanRegistry.getSingleton(DefaultSingletonBeanRegistry.java:230) ~[spring-beans-4.3.3.RELEASE.jar!/:4.3.3.RELEASE] at org.springframework.beans.factory.support.AbstractBeanFactory.doGetBean(AbstractBeanFactory.java:302) ~[spring-beans-4.3.3.RELEASE.jar!/:4.3.3.RELEASE] at org.springframework.beans.factory.support.AbstractBeanFactory.getBean(AbstractBeanFactory.java:202) ~[spring-beans-4.3.3.RELEASE.jar!/:4.3.3.RELEASE] at org.springframework.beans.factory.config.DependencyDescriptor.resolveCandidate(DependencyDescriptor.java:207) ~[spring-beans-4.3.3.RELEASE.jar!/:4.3.3.RELEASE] at org.springframework.beans.factory.support.DefaultListableBeanFactory.doResolveDependency(DefaultListableBeanFactory.java:1128) ~[spring-beans-4.3.3.RELEASE.jar!/:4.3.3.RELEASE] at org.springframework.beans.factory.support.DefaultListableBeanFactory.resolveDependency(DefaultListableBeanFactory.java:1056) ~[spring-beans-4.3.3.RELEASE.jar!/:4.3.3.RELEASE] at org.springframework.beans.factory.support.ConstructorResolver.resolveAutowiredArgument(ConstructorResolver.java:835) ~[spring-beans-4.3.3.RELEASE.jar!/:4.3.3.RELEASE] at org.springframework.beans.factory.support.ConstructorResolver.createArgumentArray(ConstructorResolver.java:741) ~[spring-beans-4.3.3.RELEASE.jar!/:4.3.3.RELEASE] ... 121 common frames omitted Caused by: java.lang.NoClassDefFoundError: javax/xml/bind/ValidationException at org.hibernate.validator.internal.engine.ConfigurationImpl.<init>(ConfigurationImpl.java:129) ~[hibernate-validator-5.2.4.Final.jar!/:5.2.4.Final] at org.hibernate.validator.internal.engine.ConfigurationImpl.<init>(ConfigurationImpl.java:96) ~[hibernate-validator-5.2.4.Final.jar!/:5.2.4.Final] at org.hibernate.validator.HibernateValidator.createGenericConfiguration(HibernateValidator.java:31) ~[hibernate-validator-5.2.4.Final.jar!/:5.2.4.Final] at javax.validation.Validation$GenericBootstrapImpl.configure(Validation.java:276) ~[validation-api-1.1.0.Final.jar!/:na] at org.springframework.validation.beanvalidation.LocalValidatorFactoryBean.afterPropertiesSet(LocalValidatorFactoryBean.java:248) ~[spring-context-4.3.3.RELEASE.jar!/:4.3.3.RELEASE] at org.springframework.boot.context.properties.ConfigurationPropertiesBindingPostProcessor$LocalValidatorFactory.run(ConfigurationPropertiesBindingPostProcessor.java:452) ~[spring-boot-1.4.1.RELEASE.jar!/:1.4.1.RELEASE] at org.springframework.boot.context.properties.ConfigurationPropertiesBindingPostProcessor.getValidator(ConfigurationPropertiesBindingPostProcessor.java:386) ~[spring-boot-1.4.1.RELEASE.jar!/:1.4.1.RELEASE] at org.springframework.boot.context.properties.ConfigurationPropertiesBindingPostProcessor.determineValidator(ConfigurationPropertiesBindingPostProcessor.java:369) ~[spring-boot-1.4.1.RELEASE.jar!/:1.4.1.RELEASE] at org.springframework.boot.context.properties.ConfigurationPropertiesBindingPostProcessor.postProcessBeforeInitialization(ConfigurationPropertiesBindingPostProcessor.java:331) ~[spring-boot-1.4.1.RELEASE.jar!/:1.4.1.RELEASE] at org.springframework.boot.context.properties.ConfigurationPropertiesBindingPostProcessor.postProcessBeforeInitialization(ConfigurationPropertiesBindingPostProcessor.java:302) ~[spring-boot-1.4.1.RELEASE.jar!/:1.4.1.RELEASE] at org.springframework.beans.factory.support.AbstractAutowireCapableBeanFactory.applyBeanPostProcessorsBeforeInitialization(AbstractAutowireCapableBeanFactory.java:408) ~[spring-beans-4.3.3.RELEASE.jar!/:4.3.3.RELEASE] at org.springframework.beans.factory.support.AbstractAutowireCapableBeanFactory.initializeBean(AbstractAutowireCapableBeanFactory.java:1575) ~[spring-beans-4.3.3.RELEASE.jar!/:4.3.3.RELEASE] at org.springframework.beans.factory.support.AbstractAutowireCapableBeanFactory.doCreateBean(AbstractAutowireCapableBeanFactory.java:545) ~[spring-beans-4.3.3.RELEASE.jar!/:4.3.3.RELEASE] ... 131 common frames omitted Caused by: java.lang.ClassNotFoundException: javax.xml.bind.ValidationException at java.base/java.net.URLClassLoader.findClass(Unknown Source) ~[na:na] at java.base/java.lang.ClassLoader.loadClass(Unknown Source) ~[na:na] at org.springframework.boot.loader.LaunchedURLClassLoader.loadClass(LaunchedURLClassLoader.java:89) ~[livinglibrary-0.0.1-SNAPSHOT.jar:0.0.1-SNAPSHOT] at java.base/java.lang.ClassLoader.loadClass(Unknown Source) ~[na:na] ... 144 common frames omitted ``` 困扰了好几天了,这几天急着要,求救!!!
大学四年自学走来,这些私藏的实用工具/学习网站我贡献出来了
大学四年,看课本是不可能一直看课本的了,对于学习,特别是自学,善于搜索网上的一些资源来辅助,还是非常有必要的,下面我就把这几年私藏的各种资源,网站贡献出来给你们。主要有:电子书搜索、实用工具、在线视频学习网站、非视频学习网站、软件下载、面试/求职必备网站。 注意:文中提到的所有资源,文末我都给你整理好了,你们只管拿去,如果觉得不错,转发、分享就是最大的支持了。 一、电子书搜索 对于大部分程序员...
【JSON解析】浅谈JSONObject的使用
简介 在程序开发过程中,在参数传递,函数返回值等方面,越来越多的使用JSON。JSON(JavaScript Object Notation)是一种轻量级的数据交换格式,同时也易于机器解析和生成、易于理解、阅读和撰写,而且Json采用完全独立于语言的文本格式,这使得Json成为理想的数据交换语言。 JSON建构于两种结构: “名称/值”对的集合(A Collection of name/va...
卸载 x 雷某度!GitHub 标星 1.5w+,从此我只用这款全能高速下载工具!
作者 | Rocky0429 来源 | Python空间 大家好,我是 Rocky0429,一个喜欢在网上收集各种资源的蒟蒻… 网上资源眼花缭乱,下载的方式也同样千奇百怪,比如 BT 下载,磁力链接,网盘资源等等等等,下个资源可真不容易,不一样的方式要用不同的下载软件,因此某比较有名的 x 雷和某度网盘成了我经常使用的工具。 作为一个没有钱的穷鬼,某度网盘几十 kb 的下载速度让我...
2019年还剩1天,我从外包公司离职了
这日子过的可真快啊,2019年还剩1天,外包公司干了不到3个月,我离职了
我一个37岁的程序员朋友
周末了,人一旦没有点事情干,心里就瞎想,而且跟几个老男人坐在一起,更容易瞎想,我自己现在也是 30 岁了,也是无时无刻在担心自己的职业生涯,担心丢掉工作没有收入,担心身体机能下降,担心突...
计算机网络的核心概念
这是《计算机网络》系列文章的第二篇文章 我们第一篇文章讲述了计算机网络的基本概念,互联网的基本名词,什么是协议以及几种接入网以及网络传输的物理媒体,那么本篇文章我们来探讨一下网络核心、交换网络、时延、丢包、吞吐量以及计算机网络的协议层次和网络攻击。 网络核心 网络的核心是由因特网端系统和链路构成的网状网络,下面这幅图正确的表达了这一点 那么在不同的 ISP 和本地以及家庭网络是如何交换信息的呢?...
python自动下载图片
近日闲来无事,总有一种无形的力量萦绕在朕身边,让朕精神涣散,昏昏欲睡。 可是,像朕这么有职业操守的社畜怎么能在上班期间睡瞌睡呢,我不禁陷入了沉思。。。。 突然旁边的IOS同事问:‘嘿,兄弟,我发现一个网站的图片很有意思啊,能不能帮我保存下来提升我的开发灵感?’ 作为一个坚强的社畜怎么能说自己不行呢,当时朕就不假思索的答应:‘oh, It’s simple. Wait for me for a ...
一名大专同学的四个问题
【前言】   收到一封来信,赶上各种事情拖了几日,利用今天要放下工作的时机,做个回复。   2020年到了,就以这一封信,作为开年标志吧。 【正文】   您好,我是一名现在有很多困惑的大二学生。有一些问题想要向您请教。   先说一下我的基本情况,高考失利,不想复读,来到广州一所大专读计算机应用技术专业。学校是偏艺术类的,计算机专业没有实验室更不用说工作室了。而且学校的学风也不好。但我很想在计算机领...
复习一周,京东+百度一面,不小心都拿了Offer
京东和百度一面都问了啥,面试官百般刁难,可惜我全会。
Java 14 都快来了,为什么还有这么多人固守Java 8?
从Java 9开始,Java版本的发布就让人眼花缭乱了。每隔6个月,都会冒出一个新版本出来,Java 10 , Java 11, Java 12, Java 13, 到2020年3月份,...
达摩院十大科技趋势发布:2020 非同小可!
【CSDN编者按】1月2日,阿里巴巴发布《达摩院2020十大科技趋势》,十大科技趋势分别是:人工智能从感知智能向认知智能演进;计算存储一体化突破AI算力瓶颈;工业互联网的超融合;机器间大规模协作成为可能;模块化降低芯片设计门槛;规模化生产级区块链应用将走入大众;量子计算进入攻坚期;新材料推动半导体器件革新;保护数据隐私的AI技术将加速落地;云成为IT技术创新的中心 。 新的画卷,正在徐徐展开。...
轻松搭建基于 SpringBoot + Vue 的 Web 商城应用
首先介绍下在本文出现的几个比较重要的概念: 函数计算(Function Compute): 函数计算是一个事件驱动的服务,通过函数计算,用户无需管理服务器等运行情况,只需编写代码并上传。函数计算准备计算资源,并以弹性伸缩的方式运行用户代码,而用户只需根据实际代码运行所消耗的资源进行付费。Fun: Fun 是一个用于支持 Serverless 应用部署的工具,能帮助您便捷地管理函数计算、API ...
讲真,这两个IDE插件,可以让你写出质量杠杠的代码
周末躺在床上看《拯救大兵瑞恩》 周末在闲逛的时候,发现了两个优秀的 IDE 插件,据说可以提高代码的质量,我就安装了一下,试了试以后发现,确实很不错,就推荐给大家。 01、Alibaba Java 代码规范插件 《阿里巴巴 Java 开发手册》,相信大家都不会感到陌生,其 IDEA 插件的下载次数据说达到了 80 万次,我今天又贡献了一次。嘿嘿。 该项目的插件地址: https://github....
Python+OpenCV实时图像处理
目录 1、导入库文件 2、设计GUI 3、调用摄像头 4、实时图像处理 4.1、阈值二值化 4.2、边缘检测 4.3、轮廓检测 4.4、高斯滤波 4.5、色彩转换 4.6、调节对比度 5、退出系统 初学OpenCV图像处理的小伙伴肯定对什么高斯函数、滤波处理、阈值二值化等特性非常头疼,这里给各位分享一个小项目,可通过摄像头实时动态查看各类图像处理的特点,也可对各位调参、测试...
2020年一线城市程序员工资大调查
人才需求 一线城市共发布岗位38115个,招聘120827人。 其中 beijing 22805 guangzhou 25081 shanghai 39614 shenzhen 33327 工资分布 2020年中国一线城市程序员的平均工资为16285元,工资中位数为14583元,其中95%的人的工资位于5000到20000元之间。 和往年数据比较: yea...
为什么猝死的都是程序员,基本上不见产品经理猝死呢?
相信大家时不时听到程序员猝死的消息,但是基本上听不到产品经理猝死的消息,这是为什么呢? 我们先百度搜一下:程序员猝死,出现将近700多万条搜索结果: 搜索一下:产品经理猝死,只有400万条的搜索结果,从搜索结果数量上来看,程序员猝死的搜索结果就比产品经理猝死的搜索结果高了一倍,而且从下图可以看到,首页里面的五条搜索结果,其实只有两条才是符合条件。 所以程序员猝死的概率真的比产品经理大,并不是错...
害怕面试被问HashMap?这一篇就搞定了!
声明:本文以jdk1.8为主! 搞定HashMap 作为一个Java从业者,面试的时候肯定会被问到过HashMap,因为对于HashMap来说,可以说是Java集合中的精髓了,如果你觉得自己对它掌握的还不够好,我想今天这篇文章会非常适合你,至少,看了今天这篇文章,以后不怕面试被问HashMap了 其实在我学习HashMap的过程中,我个人觉得HashMap还是挺复杂的,如果真的想把它搞得明明白...
毕业5年,我问遍了身边的大佬,总结了他们的学习方法
我问了身边10个大佬,总结了他们的学习方法,原来成功都是有迹可循的。
程序员如何通过造轮子走向人生巅峰?
前言:你所做的事情,也许暂时看不到成果。但不要灰心,你不是没有成长,而是在扎根。 程序员圈经常流行的一句话:“不要重复造轮子”。在计算机领域,我们将封装好的组件、库,叫做轮子。因为它可以拿来直接用,直接塞进我们的项目中,就能实现对应的功能。 有些同学会问,人家都已经做好了,你再来重新弄一遍,有什么意义?这不是在浪费时间吗。 殊不知,造轮子是一种学习方式,能快速进步,造得好,是自己超强能力的表...
推荐10个堪称神器的学习网站
每天都会收到很多读者的私信,问我:“二哥,有什么推荐的学习网站吗?最近很浮躁,手头的一些网站都看烦了,想看看二哥这里有什么新鲜货。” 今天一早做了个恶梦,梦到被老板辞退了。虽然说在我们公司,只有我辞退老板的份,没有老板辞退我这一说,但是还是被吓得 4 点多都起来了。(主要是因为我掌握着公司所有的核心源码,哈哈哈) 既然 4 点多起来,就得好好利用起来。于是我就挑选了 10 个堪称神器的学习网站,推...
这些软件太强了,Windows必装!尤其程序员!
Windows可谓是大多数人的生产力工具,集娱乐办公于一体,虽然在程序员这个群体中都说苹果是信仰,但是大部分不都是从Windows过来的,而且现在依然有很多的程序员用Windows。 所以,今天我就把我私藏的Windows必装的软件分享给大家,如果有一个你没有用过甚至没有听过,那你就赚了????,这可都是提升你幸福感的高效率生产力工具哦! 走起!???? NO、1 ScreenToGif 屏幕,摄像头和白板...
阿里面试一个ArrayList我都能跟面试官扯半小时
我是真的没想到,面试官会这样问我ArrayList。
曾经优秀的人,怎么就突然不优秀了。
职场上有很多辛酸事,很多合伙人出局的故事,很多技术骨干被裁员的故事。说来模板都类似,曾经是名校毕业,曾经是优秀员工,曾经被领导表扬,曾经业绩突出,然而突然有一天,因为种种原因,被裁员了,...
大学四年因为知道了这32个网站,我成了别人眼中的大神!
依稀记得,毕业那天,我们导员发给我毕业证的时候对我说“你可是咱们系的风云人物啊”,哎呀,别提当时多开心啦????,嗯,我们导员是所有导员中最帅的一个,真的???? 不过,导员说的是实话,很多人都叫我大神的,为啥,因为我知道这32个网站啊,你说强不强????,这次是绝对的干货,看好啦,走起来! PS:每个网站都是学计算机混互联网必须知道的,真的牛杯,我就不过多介绍了,大家自行探索,觉得没用的,尽管留言吐槽吧???? 社...
良心推荐,我珍藏的一些Chrome插件
上次搬家的时候,发了一个朋友圈,附带的照片中不小心暴露了自己的 Chrome 浏览器插件之多,于是就有小伙伴评论说分享一下我觉得还不错的浏览器插件。 我下面就把我日常工作和学习中经常用到的一些 Chrome 浏览器插件分享给大家,随便一个都能提高你的“生活品质”和工作效率。 Markdown Here Markdown Here 可以让你更愉快的写邮件,由于支持 Markdown 直接转电子邮...
看完这篇HTTP,跟面试官扯皮就没问题了
我是一名程序员,我的主要编程语言是 Java,我更是一名 Web 开发人员,所以我必须要了解 HTTP,所以本篇文章就来带你从 HTTP 入门到进阶,看完让你有一种恍然大悟、醍醐灌顶的感觉。 最初在有网络之前,我们的电脑都是单机的,单机系统是孤立的,我还记得 05 年前那会儿家里有个电脑,想打电脑游戏还得两个人在一个电脑上玩儿,及其不方便。我就想为什么家里人不让上网,我的同学 xxx 家里有网,每...
史上最全的IDEA快捷键总结
现在Idea成了主流开发工具,这篇博客对其使用的快捷键做了总结,希望对大家的开发工作有所帮助。
阿里程序员写了一个新手都写不出的低级bug,被骂惨了。
这种新手都不会范的错,居然被一个工作好几年的小伙子写出来,差点被当场开除了。
谁是华为扫地僧?
是的,华为也有扫地僧!2020年2月11-12日,“养在深闺人不知”的华为2012实验室扫地僧们,将在华为开发者大会2020(Cloud)上,和大家见面。到时,你可以和扫地僧们,吃一个洋...
Idea 中最常用的10款插件(提高开发效率),一定要学会使用!
学习使用一些插件,可以提高开发效率。对于我们开发人员很有帮助。这篇博客介绍了开发中使用的插件。
AI 没让人类失业,搞 AI 的人先失业了
最近和几个 AI 领域的大佬闲聊 根据他们讲的消息和段子 改编出下面这个故事 如有雷同 都是巧合 1. 老王创业失败,被限制高消费 “这里写我跑路的消息实在太夸张了。” 王葱葱哼笑一下,把消息分享给群里。 阿杰也看了消息,笑了笑。在座几位也都笑了。 王葱葱是个有名的人物,21岁那年以全额奖学金进入 KMU 攻读人工智能博士,累计发表论文 40 余篇,个人技术博客更是成为深度学习领域内风向标。 ...
2020年,冯唐49岁:我给20、30岁IT职场年轻人的建议
点击“技术领导力”关注∆每天早上8:30推送 作者|Mr.K 编辑| Emma 来源|技术领导力(ID:jishulingdaoli) 前天的推文《冯唐:职场人35岁以后,方法论比经验重要》,收到了不少读者的反馈,觉得挺受启发。其实,冯唐写了不少关于职场方面的文章,都挺不错的。可惜大家只记住了“春风十里不如你”、“如何避免成为油腻腻的中年人”等不那么正经的文章。 本文整理了冯...
最全最强!世界大学计算机专业排名总结!
我正在参与CSDN200进20,希望得到您的支持,扫码续投票5次。感谢您! (为表示感谢,您投票后私信我,我把我总结的人工智能手推笔记和思维导图发送给您,感谢!) 目录 泰晤士高等教育世界大学排名 QS 世界大学排名 US News 世界大学排名 世界大学学术排名(Academic Ranking of World Universities) 泰晤士高等教育世界大学排名 中国共...
作为一名大学生,如何在B站上快乐的学习?
B站是个宝,谁用谁知道???? 作为一名大学生,你必须掌握的一项能力就是自学能力,很多看起来很牛X的人,你可以了解下,人家私底下一定是花大量的时间自学的,你可能会说,我也想学习啊,可是嘞,该学习啥嘞,不怕告诉你,互联网时代,最不缺的就是学习资源,最宝贵的是啥? 你可能会说是时间,不,不是时间,而是你的注意力,懂了吧! 那么,你说学习资源多,我咋不知道,那今天我就告诉你一个你必须知道的学习的地方,人称...
立即提问