maven中一直提示缺少maven-resources-plugin-2.6的问题

我在netbeans中新建了一个maven工程,请问为什么每次编译后,都显示缺少maven-resources-plugin-2.6的错误?.m2中的依赖包里明明有这个jar包,而且我在工程里也反复添加好几次了,但是一运行程序,就会出现缺少这个jar的错误。

2个回答

wing_zyy
wing_zyy 谢谢你的信息,我看了这两篇文章,我的本地仓库中是有这个jar包,并且pom.xml也写入了dependecy的信息。windows运行也是提示同样的错误。但是我本地的仓库是有这个jar包的。
大约 4 年之前 回复

更新 maven project (不是简单的f5,是与本地库更新)好像是ctrl shif f5

wing_zyy
wing_zyy 谢谢你的回答!我选定工程,按ctrl shif f5没反应,错误还是存在。错误中提示缺少MavenFilteringException这个类,但是这个类在filtering的jar包里有。而错误总是提示在执行maven-resources-plugin中的这个类时失败。请问你知道这是什么原因么?
大约 4 年之前 回复
Csdn user default icon
上传中...
上传图片
插入图片
抄袭、复制答案,以达到刷声望分或其他目的的行为,在CSDN问答是严格禁止的,一经发现立刻封号。是时候展现真正的技术了!
其他相关推荐
新建maven环境,没有junit:jar:3.8.1 ,但是maven自己是依赖这个版本的
新建了maven环境 打包的时候报Failed to execute goal org.apache.maven.plugins:maven-resources-plugin:2.6:resources (default-resources) on project wostore: Execution default-resources of goal org.apache.maven.plugins:maven-resources-plugin:2.6:resources failed: Plugin org.apache.maven.plugins:maven-resources-plugin:2.6 or one of its dependencies could not be resolved: Failure to find junit:junit:jar:3.8.1 in http://repo.maven.apache.org/maven2 was cached in the local repository, resolution will not be reattempted until the update interval of central has elapsed or updates are forced -> [Help 1] 这是他自己需要的依赖,但是发现现在maven自己已经不能提供这个版本了,真奇怪
eclipse的maven导入时报错
第一次装maven,按步骤是装好了。导入第一个maven项目就报错了,求大神不吝赐教! 以下是错误提示 Errors occurred during the build. Errors running builder 'Maven Project Builder' on project 'jeecg'. Could not calculate build plan: Plugin org.apache.maven.plugins:maven-resources-plugin:2.6 or one of its dependencies could not be resolved: Cannot access central (https://repo.maven.apache.org/maven2) in offline mode and the artifact org.apache.maven.plugins:maven-resources-plugin:jar:2.6 has not been downloaded from it before. Plugin org.apache.maven.plugins:maven-resources-plugin:2.6 or one of its dependencies could not be resolved: Cannot access central (https://repo.maven.apache.org/maven2) in offline mode and the artifact org.apache.maven.plugins:maven-resources-plugin:jar:2.6 has not been downloaded from it before. Could not calculate build plan: Plugin org.apache.maven.plugins:maven-resources-plugin:2.6 or one of its dependencies could not be resolved: Cannot access central (https://repo.maven.apache.org/maven2) in offline mode and the artifact org.apache.maven.plugins:maven-resources-plugin:jar:2.6 has not been downloaded from it before. Plugin org.apache.maven.plugins:maven-resources-plugin:2.6 or one of its dependencies could not be resolved: Cannot access central (https://repo.maven.apache.org/maven2) in offline mode and the artifact org.apache.maven.plugins:maven-resources-plugin:jar:2.6 has not been downloaded from it before.
maven在没有网络的环境下开发
开发的电脑没有网络环境,但是可以拷贝东西,我想在这台电脑上使用maven进行开发, 于是我搭建了nexus,但是在新建maven项目的时候一直报如下错误,手动在nexus导了 maven-resources-plugins 2.6也还是没有。错误信息如下:Could not calculate build plan: Plugin org.apache.maven.plugins:maven-resources-plugin:2.6 or one of its dependencies could not be resolved: Failed to read artifact descriptor for org.apache.maven.plugins:maven-resources-plugin:jar:2.6 Plugin org.apache.maven.plugins:maven-resources-plugin:2.6 or one of its dependencies could not be resolved: Failed to read artifact descriptor for org.apache.maven.plugins:maven-resources-plugin:jar:2.6 求大神解答,感激不尽!
关于maven下载jar报错问题,本地仓库有相关jar包
Could not calculate build plan: Plugin org.apache.maven.plugins:maven-resources-plugin:2.6 or one of its dependencies could not be resolved: Failed to read artifact descriptor for org.apache.maven.plugins:maven-resources-plugin:jar:2.6 Plugin org.apache.maven.plugins:maven-resources-plugin:2.6 or one of its dependencies could not be resolved: Failed to read artifact descriptor for org.apache.maven.plugins:maven-resources-plugin:jar:2.6 (已经删除响应jar包并且重新maven update 但是依然会弹出报错窗口)
怎么查看maven的pom.xml是否成功下载了所需jar包
## 如题,pom.xml动不动就要报错,不知道是不是因为没有成功下载jar的原因? ![图片说明](https://img-ask.csdn.net/upload/201606/23/1466666764_888875.jpg) Multiple annotations found at this line: - Missing artifact org.apache.maven:maven-artifact:jar:2.0.6:compile - Missing artifact org.apache.maven.shared:maven-filtering:jar:1.0-beta-4:compile - Missing artifact org.apache.maven:maven-profile:jar:2.0.6:compile - Missing artifact org.apache.maven.reporting:maven-reporting-api:jar: 2.0.6:compile - Missing artifact org.apache.maven:maven-plugin-descriptor:jar:2.0.6:compile - Missing artifact org.apache.maven.wagon:wagon-ssh:jar:1.0-beta-2:runtime - Missing artifact org.apache.maven.wagon:wagon-ssh-external:jar:1.0- beta-2:runtime - Missing artifact org.apache.maven:maven-artifact-manager:jar:2.0.6:compile - Missing artifact org.apache.maven:maven-plugin-registry:jar:2.0.6:compile - Missing artifact org.apache.maven:maven-project:jar:2.0.6:compile - Missing artifact org.apache.maven:maven-plugin-api:jar:2.0.6:compile - Missing artifact org.codehaus.plexus:plexus-utils:jar:2.0.5:compile - Missing artifact com.jcraft:jsch:jar:0.1.27:runtime - Missing artifact commons-cli:commons-cli:jar:1.0:compile - Missing artifact org.apache.maven.wagon:wagon-ssh-common:jar:1.0- beta-2:runtime - Missing artifact org.codehaus.plexus:plexus-interactivity-api:jar:1.0- alpha-4:compile - Missing artifact org.wisdom-framework:mysql-connector-java:jar:5.1.34_1:compile - Failed to read artifact descriptor for org.wisdom-framework:abstract-jdbc- driver:jar:0.5 - Missing artifact org.apache.maven.wagon:wagon-file:jar:1.0-beta-2:runtime - Missing artifact org.sonatype.plexus:plexus-build-api:jar:0.0.4:compile - Missing artifact classworlds:classworlds:jar:1.1:compile - Missing artifact org.apache.maven.plugins:maven-resources-plugin:jar: 2.4.3:compile - Missing artifact org.apache.felix:org.apache.felix.ipojo.annotations:jar: 1.12.1:compile - Missing artifact org.codehaus.plexus:plexus-interpolation:jar:1.13:compile - Missing artifact org.apache.maven.wagon:wagon-provider-api:jar:1.0- beta-2:compile - Missing artifact org.apache.maven:maven-monitor:jar:2.0.6:compile - Missing artifact xml-apis:xml-apis:jar:1.0.b2:runtime - Missing artifact org.apache.maven.wagon:wagon-http-shared:jar:1.0- beta-2:runtime - Missing artifact jtidy:jtidy:jar:4aug2000r7-dev:runtime - Missing artifact org.apache.maven:maven-core:jar:2.0.6:compile - Missing artifact org.apache.maven:maven-settings:jar:2.0.6:compile - Missing artifact org.apache.maven:maven-model:jar:2.0.6:compile - Missing artifact org.apache.maven.doxia:doxia-sink-api:jar:1.0-alpha-7:compile - Missing artifact org.apache.maven.wagon:wagon-http-lightweight:jar:1.0- beta-2:runtime - Missing artifact org.apache.maven:maven-repository-metadata:jar:2.0.6:compile - Missing artifact org.apache.maven:maven-error-diagnostics:jar:2.0.6:compile - Missing artifact org.codehaus.plexus:plexus-container-default:jar:1.0-alpha-9- stable-1:compile - Missing artifact junit:junit:jar:3.8.1:test - Missing artifact org.apache.maven:maven-plugin-parameter-documenter:jar: 2.0.6:compile
eclipse创建maven工程时报错
使用的是官方的Eclipse中自带的m2e插件,创建maven项目时就弹出个错误 ![图片说明](https://img-ask.csdn.net/upload/201507/15/1436949464_186734.png) 在pom.xml文件那会显示个红X,提示如下: Multiple annotations found at this line: - Plugin execution not covered by lifecycle configuration: org.apache.maven.plugins:maven-compiler-plugin:3.1:testCompile (execution: default-testCompile, phase: test- compile) - Execution default-resources of goal org.apache.maven.plugins:maven-resources-plugin:2.6:resources failed: Plugin org.apache.maven.plugins:maven-resources-plugin:2.6 or one of its dependencies could not be resolved: The following artifacts could not be resolved: org.apache.maven:maven-plugin-api:jar:2.0.6, org.apache.maven:maven- project:jar:2.0.6, org.apache.maven:maven-profile:jar:2.0.6, org.apache.maven:maven-artifact-manager:jar:2.0.6, org.apache.maven:maven-plugin-registry:jar:2.0.6, org.apache.maven:maven-core:jar:2.0.6, org.apache.maven:maven-plugin-parameter-documenter:jar:2.0.6, org.apache.maven:maven-repository-metadata:jar:2.0.6, org.apache.maven:maven-error-diagnostics:jar:2.0.6, org.apache.maven:maven-plugin-descriptor:jar:2.0.6, org.apache.maven:maven-artifact:jar:2.0.6, org.apache.maven:maven- settings:jar:2.0.6, org.apache.maven:maven-model:jar:2.0.6, org.apache.maven:maven-monitor:jar:2.0.6, org.codehaus.plexus:plexus-container-default:jar:1.0-alpha-9-stable-1: Failure to transfer org.apache.maven:maven-plugin-api:jar:2.0.6 from https://repo.maven.apache.org/maven2 was cached in the local repository, resolution will not be reattempted until the update interval of central has elapsed or updates are forced. Original error: Could not transfer artifact org.apache.maven:maven-plugin-api:jar:2.0.6 from/to central (https://repo.maven.apache.org/maven2): The operation was cancelled. (org.apache.maven.plugins:maven-resources-plugin:2.6:resources:default-resources:process-resources) org.apache.maven.plugin.PluginExecutionException: Execution default-resources of goal org.apache.maven.plugins:maven-resources-plugin:2.6:resources failed: Plugin org.apache.maven.plugins:maven-resources-plugin:2.6 or one of its dependencies could not be resolved: The following artifacts could not be resolved: org.apache.maven:maven- plugin-api:jar:2.0.6, org.apache.maven:maven-project:jar:2.0.6, org.apache.maven:maven-profile:jar:2.0.6, org.apache.maven:maven-artifact-manager:jar:2.0.6, org.apache.maven:maven-plugin-registry:jar:2.0.6, org.apache.maven:maven-core:jar:2.0.6, org.apache.maven:maven-plugin-parameter-documenter:jar:2.0.6, org.apache.maven:maven-repository-metadata:jar:2.0.6, org.apache.maven:maven-error-diagnostics:jar:2.0.6, org.apache.maven:maven-plugin-descriptor:jar:2.0.6, org.apache.maven:maven-artifact:jar:2.0.6, org.apache.maven:maven-settings:jar:2.0.6, org.apache.maven:maven-model:jar:2.0.6, org.apache.maven:maven-monitor:jar:2.0.6, org.codehaus.plexus:plexus-container-default:jar:1.0-alpha-9-stable-1: Failure to transfer org.apache.maven:maven-plugin-api:jar:2.0.6 from https://repo.maven.apache.org/ maven2 was cached in the local repository, resolution will not be reattempted until the update interval of central has elapsed or updates are forced. Original error: Could not transfer artifact org.apache.maven:maven-plugin-api:jar:2.0.6 from/to central (https://repo.maven.apache.org/maven2): The operation was cancelled. at org.apache.maven.plugin.DefaultBuildPluginManager.executeMojo(DefaultBuildPluginManager.java:106) at org.eclipse.m2e.core.internal.embedder.MavenImpl.execute(MavenImpl.java:331) at org.eclipse.m2e.core.internal.embedder.MavenImpl$11.call(MavenImpl.java:1362) at org.eclipse.m2e.core.internal.embedder.MavenImpl$11.call(MavenImpl.java:1) at org.eclipse.m2e.core.internal.embedder.MavenExecutionContext.executeBare(MavenExecutionContext.java:176) at org.eclipse.m2e.core.internal.embedder.MavenExecutionContext.execute(MavenExecutionContext.java:112) at org.eclipse.m2e.core.internal.embedder.MavenImpl.execute(MavenImpl.java:1360) at org.eclipse.m2e.core.project.configurator.MojoExecutionBuildParticipant.build(MojoExecutionBuildParticipant.java:52) at org.eclipse.m2e.core.internal.builder.MavenBuilderImpl.build(MavenBuilderImpl.java:137) at org.eclipse.m2e.core.internal.builder.MavenBuilder$1.method(MavenBuilder.java:172) at org.eclipse.m2e.core.internal.builder.MavenBuilder$1.method(MavenBuilder.java:1) at org.eclipse.m2e.core.internal.builder.MavenBuilder$BuildMethod$1$1.call(MavenBuilder.java: 115) at org.eclipse.m2e.core.internal.embedder.MavenExecutionContext.executeBare(MavenExecutionContext.java:176) at org.eclipse.m2e.core.internal.embedder.MavenExecutionContext.execute(MavenExecutionContext.java:112) at org.eclipse.m2e.core.internal.builder.MavenBuilder$BuildMethod $1.call(MavenBuilder.java:105) at org.eclipse.m2e.core.internal.embedder.MavenExecutionContext.executeBare(MavenExecutionContext.java:176) at org.eclipse.m2e.core.internal.embedder.MavenExecutionContext.execute(MavenExecutionContext.java:151) at org.eclipse.m2e.core.internal.embedder.MavenExecutionContext.execute(MavenExecutionContext.java:99) at org.eclipse.m2e.core.internal.builder.MavenBuilder $BuildMethod.execute(MavenBuilder.java:86) at org.eclipse.m2e.core.internal.builder.MavenBuilder.build(MavenBuilder.java:200) at org.eclipse.core.internal.events.BuildManager $2.run(BuildManager.java:734) at org.eclipse.core.runtime.SafeRunner.run(SafeRunner.java:42) at org.eclipse.core.internal.events.BuildManager.basicBuild(BuildManager.java:205) at org.eclipse.core.internal.events.BuildManager.basicBuild(BuildManager.java:245) at org.eclipse.core.internal.events.BuildManager$1.run(BuildManager.java:300) at org.eclipse.core.runtime.SafeRunner.run(SafeRunner.java:42) at org.eclipse.core.internal.events.BuildManager.basicBuild(BuildManager.java:303) at org.eclipse.core.internal.events.BuildManager.basicBuildLoop(BuildManager.java:359) at org.eclipse.core.internal.events.BuildManager.build(BuildManager.java:382) at org.eclipse.core.internal.events.AutoBuildJob.doBuild(AutoBuildJob.java:144) at org.eclipse.core.internal.events.AutoBuildJob.run(AutoBuildJob.java:235) at org.eclipse.core.internal.jobs.Worker.run(Worker.java:55) Caused by: org.apache.maven.plugin.PluginResolutionException: Plugin org.apache.maven.plugins:maven-resources- plugin:2.6 or one of its dependencies could not be resolved: The following artifacts could not be resolved: org.apache.maven:maven-plugin-api:jar:2.0.6, org.apache.maven:maven- project:jar:2.0.6, org.apache.maven:maven-profile:jar:2.0.6, 请问如何解决?谢谢 ----- 本机安装的maven是3.2.2 eclipse是4.5 m2e是1.2 ----- 最后也不知道什么原因,重新下了eclipse就没有问题了
pom中parent标签提示错误问题resources和testResources
小白(没接触过maven和spring)想要尝试spring boot,在Mac系统下的Eclipse(Java9)安装了STS和maven,创建spring starter project,但是在pom文件中的parent标签总是报错说: Multiple annotations found at this line: - Plugin execution not covered by lifecycle configuration: org.apache.maven.plugins:maven-resources-plugin:2.6:testResources (execution: default-testResources, phase: process-test-resources) - Plugin execution not covered by lifecycle configuration: org.apache.maven.plugins:maven-resources-plugin:2.6:resources (execution: default-resources, phase: process-resources) ![图片说明](https://img-ask.csdn.net/upload/201711/17/1510907444_326249.png) 求各位大神指点下
maven问题。jar包下载不下来。
项目一下载jar包就报这个错误,而且这个jar包本身是在.m2的文件夹下是存在的,不知道为什么就报错,删除重新下载也不行,整个文件夹删除下载也不行,设置强制下载也不行,我现在都无语了,maven 不知道是怎么回事,是不是重装系统的问题啊,我的配置没问题啊,在cmd下查看版本号环境变量也没问题: C:\Users\dl>mvn -v Apache Maven 3.3.9 (bb52d8502b132ec0a5a3f4c09453c07478323dc5; 2015-11-11T00:41:47+08:00) Maven home: C:\apache-maven-3.3.9\bin\.. Java version: 1.7.0_79, vendor: Oracle Corporation Java home: C:\Program Files\Java\jdk1.7.0_79\jre Default locale: zh_CN, platform encoding: GBK OS name: "windows 8.1", version: "6.3", arch: "amd64", family: "windows" **在cmd下用 mvn help:system 命令可以下载jar包,而且很快,eclipe下右键update就不行,运行一会九堡下边的错误.** 还有就是jar下载特别特别慢,基本上是下载不下来,重装之前不这样啊,下载一会就 报边的错误。.m2文件夹下全是sha1..properties 文件,就是下载不下来jar包,自己下载,放进去也不管用,照样重新下载。 报的下面的错误 Errors occurred during the build. Errors running builder 'Maven Project Builder' on project 'plate-prototype'. Could not calculate build plan: Plugin org.apache.maven.plugins:maven-resources-plugin:2.6 or one of its dependencies could not be resolved: Failed to read artifact descriptor for org.apache.maven.plugins:maven-resources-plugin:jar:2.6 Plugin org.apache.maven.plugins:maven-resources-plugin:2.6 or one of its dependencies could not be resolved: Failed to read artifact descriptor for org.apache.maven.plugins:maven-resources-plugin:jar:2.6 Could not calculate build plan: Plugin org.apache.maven.plugins:maven-resources-plugin:2.6 or one of its dependencies could not be resolved: Failed to read artifact descriptor for org.apache.maven.plugins:maven-resources-plugin:jar:2.6
maven项目不能编译,老是报下面这个错误
[INFO] Scanning for projects... [INFO] [INFO] ------------------------------------------------------------------------ [INFO] Building spring-mvc-study Maven Webapp 1.0-SNAPSHOT [INFO] ------------------------------------------------------------------------ [INFO] [INFO] --- maven-resources-plugin:2.6:resources (default-resources) @ spring-mvc-study --- [WARNING] Error injecting: org.apache.maven.plugin.resources.ResourcesMojo java.lang.NoClassDefFoundError: org/apache/maven/shared/filtering/MavenFilteringException at java.lang.Class.getDeclaredConstructors0(Native Method) at java.lang.Class.privateGetDeclaredConstructors(Class.java:2493) at java.lang.Class.getDeclaredConstructors(Class.java:1901) at com.google.inject.spi.InjectionPoint.forConstructorOf(InjectionPoint.java:245) at com.google.inject.internal.ConstructorBindingImpl.create(ConstructorBindingImpl.java:99) at com.google.inject.internal.InjectorImpl.createUninitializedBinding(InjectorImpl.java:657) at com.google.inject.internal.InjectorImpl.createJustInTimeBinding(InjectorImpl.java:875) at com.google.inject.internal.InjectorImpl.createJustInTimeBindingRecursive(InjectorImpl.java:798) at com.google.inject.internal.InjectorImpl.getJustInTimeBinding(InjectorImpl.java:281) at com.google.inject.internal.InjectorImpl.getBindingOrThrow(InjectorImpl.java:213) at com.google.inject.internal.InjectorImpl.getProviderOrThrow(InjectorImpl.java:998) at com.google.inject.internal.InjectorImpl.getProvider(InjectorImpl.java:1031) at com.google.inject.internal.InjectorImpl.getProvider(InjectorImpl.java:994) at com.google.inject.internal.InjectorImpl.getInstance(InjectorImpl.java:1044) at org.eclipse.sisu.space.AbstractDeferredClass.get(AbstractDeferredClass.java:48) at com.google.inject.internal.ProviderInternalFactory.provision(ProviderInternalFactory.java:86) at com.google.inject.internal.InternalFactoryToInitializableAdapter.provision(InternalFactoryToInitializableAdapter.java:54) at com.google.inject.internal.ProviderInternalFactory$1.call(ProviderInternalFactory.java:70) at com.google.inject.internal.ProvisionListenerStackCallback$Provision.provision(ProvisionListenerStackCallback.java:115) at org.eclipse.sisu.bean.BeanScheduler$Activator.onProvision(BeanScheduler.java:176) at com.google.inject.internal.ProvisionListenerStackCallback$Provision.provision(ProvisionListenerStackCallback.java:126) at com.google.inject.internal.ProvisionListenerStackCallback.provision(ProvisionListenerStackCallback.java:68) at com.google.inject.internal.ProviderInternalFactory.circularGet(ProviderInternalFactory.java:68) at com.google.inject.internal.InternalFactoryToInitializableAdapter.get(InternalFactoryToInitializableAdapter.java:46) at com.google.inject.internal.InjectorImpl$2$1.call(InjectorImpl.java:1009) at com.google.inject.internal.InjectorImpl.callInContext(InjectorImpl.java:1059) at com.google.inject.internal.InjectorImpl$2.get(InjectorImpl.java:1005) at com.google.inject.internal.SingletonScope$1.get(SingletonScope.java:36) at org.eclipse.sisu.inject.LazyBeanEntry.getValue(LazyBeanEntry.java:81) at org.eclipse.sisu.plexus.LazyPlexusBean.getValue(LazyPlexusBean.java:51) at org.codehaus.plexus.DefaultPlexusContainer.lookup(DefaultPlexusContainer.java:263) at org.codehaus.plexus.DefaultPlexusContainer.lookup(DefaultPlexusContainer.java:255) at org.apache.maven.plugin.internal.DefaultMavenPluginManager.getConfiguredMojo(DefaultMavenPluginManager.java:543) at org.apache.maven.plugin.DefaultBuildPluginManager.executeMojo(DefaultBuildPluginManager.java:121) at org.apache.maven.lifecycle.internal.MojoExecutor.execute(MojoExecutor.java:208) at org.apache.maven.lifecycle.internal.MojoExecutor.execute(MojoExecutor.java:153) at org.apache.maven.lifecycle.internal.MojoExecutor.execute(MojoExecutor.java:145) at org.apache.maven.lifecycle.internal.LifecycleModuleBuilder.buildProject(LifecycleModuleBuilder.java:116) at org.apache.maven.lifecycle.internal.LifecycleModuleBuilder.buildProject(LifecycleModuleBuilder.java:80) at org.apache.maven.lifecycle.internal.builder.singlethreaded.SingleThreadedBuilder.build(SingleThreadedBuilder.java:51) at org.apache.maven.lifecycle.internal.LifecycleStarter.execute(LifecycleStarter.java:128) at org.apache.maven.DefaultMaven.doExecute(DefaultMaven.java:307) at org.apache.maven.DefaultMaven.doExecute(DefaultMaven.java:193) at org.apache.maven.DefaultMaven.execute(DefaultMaven.java:106) at org.apache.maven.cli.MavenCli.execute(MavenCli.java:862) at org.apache.maven.cli.MavenCli.doMain(MavenCli.java:286) at org.apache.maven.cli.MavenCli.main(MavenCli.java:197) at sun.reflect.NativeMethodAccessorImpl.invoke0(Native Method) at sun.reflect.NativeMethodAccessorImpl.invoke(NativeMethodAccessorImpl.java:57) at sun.reflect.DelegatingMethodAccessorImpl.invoke(DelegatingMethodAccessorImpl.java:43) at java.lang.reflect.Method.invoke(Method.java:606) at org.codehaus.plexus.classworlds.launcher.Launcher.launchEnhanced(Launcher.java:289) at org.codehaus.plexus.classworlds.launcher.Launcher.launch(Launcher.java:229) at org.codehaus.plexus.classworlds.launcher.Launcher.mainWithExitCode(Launcher.java:415) at org.codehaus.plexus.classworlds.launcher.Launcher.main(Launcher.java:356) at org.codehaus.classworlds.Launcher.main(Launcher.java:47) Caused by: java.lang.ClassNotFoundException: org.apache.maven.shared.filtering.MavenFilteringException at org.codehaus.plexus.classworlds.strategy.SelfFirstStrategy.loadClass(SelfFirstStrategy.java:50) at org.codehaus.plexus.classworlds.realm.ClassRealm.unsynchronizedLoadClass(ClassRealm.java:271) at org.codehaus.plexus.classworlds.realm.ClassRealm.loadClass(ClassRealm.java:247) at org.codehaus.plexus.classworlds.realm.ClassRealm.loadClass(ClassRealm.java:239) ... 56 more [INFO] ------------------------------------------------------------------------ [INFO] BUILD FAILURE [INFO] ------------------------------------------------------------------------ [INFO] Total time: 0.955 s [INFO] Finished at: 2015-08-24T11:16:53+08:00 [INFO] Final Memory: 8M/102M [INFO] ------------------------------------------------------------------------ [ERROR] Failed to execute goal org.apache.maven.plugins:maven-resources-plugin:2.6:resources (default-resources) on project spring-mvc-study: Execution default-resources of goal org.apache.maven.plugins:maven-resources-plugin:2.6:resources failed: A required class was missing while executing org.apache.maven.plugins:maven-resources-plugin:2.6:resources: org/apache/maven/shared/filtering/MavenFilteringException [ERROR] ----------------------------------------------------- [ERROR] realm = plugin>org.apache.maven.plugins:maven-resources-plugin:2.6 [ERROR] strategy = org.codehaus.plexus.classworlds.strategy.SelfFirstStrategy [ERROR] urls[0] = file:/D:/program%20Files/maven/apache-maven-3.3.1/maven-local/org/apache/maven/plugins/maven-resources-plugin/2.6/maven-resources-plugin-2.6.jar [ERROR] urls[1] = file:/D:/program%20Files/maven/apache-maven-3.3.1/maven-local/org/apache/maven/reporting/maven-reporting-api/2.0.6/maven-reporting-api-2.0.6.jar [ERROR] urls[2] = file:/D:/program%20Files/maven/apache-maven-3.3.1/maven-local/org/apache/maven/doxia/doxia-sink-api/1.0-alpha-7/doxia-sink-api-1.0-alpha-7.jar [ERROR] urls[3] = file:/D:/program%20Files/maven/apache-maven-3.3.1/maven-local/commons-cli/commons-cli/1.0/commons-cli-1.0.jar [ERROR] urls[4] = file:/D:/program%20Files/maven/apache-maven-3.3.1/maven-local/org/codehaus/plexus/plexus-interactivity-api/1.0-alpha-4/plexus-interactivity-api-1.0-alpha-4.jar [ERROR] urls[5] = file:/D:/program%20Files/maven/apache-maven-3.3.1/maven-local/junit/junit/3.8.1/junit-3.8.1.jar [ERROR] urls[6] = file:/D:/program%20Files/maven/apache-maven-3.3.1/maven-local/org/codehaus/plexus/plexus-utils/2.0.5/plexus-utils-2.0.5.jar [ERROR] urls[7] = file:/D:/program%20Files/maven/apache-maven-3.3.1/maven-local/org/apache/maven/shared/maven-filtering/1.1/maven-filtering-1.1.jar [ERROR] urls[8] = file:/D:/program%20Files/maven/apache-maven-3.3.1/maven-local/org/sonatype/plexus/plexus-build-api/0.0.4/plexus-build-api-0.0.4.jar [ERROR] urls[9] = file:/D:/program%20Files/maven/apache-maven-3.3.1/maven-local/org/codehaus/plexus/plexus-interpolation/1.13/plexus-interpolation-1.13.jar [ERROR] Number of foreign imports: 1 [ERROR] import: Entry[import from realm ClassRealm[maven.api, parent: null]] [ERROR] [ERROR] -----------------------------------------------------: org.apache.maven.shared.filtering.MavenFilteringException [ERROR] -> [Help 1] [ERROR] [ERROR] To see the full stack trace of the errors, re-run Maven with the -e switch. [ERROR] Re-run Maven using the -X switch to enable full debug logging. [ERROR] [ERROR] For more information about the errors and possible solutions, please read the following articles: [ERROR] [Help 1] http://cwiki.apache.org/confluence/display/MAVEN/PluginContainerException
jpress mvn package失败,求大神指导
报错代码如下: [INFO] Scanning for projects... [WARNING] [WARNING] Some problems were encountered while building the effective model for io.jpress:codegen:jar:1.0 [WARNING] 'version' contains an expression but should be a constant. @ io.jpress:parent:${jpress.version}, D:\Program Files\jpress\pom.xml, line 10, column 14 [WARNING] 'build.plugins.plugin.version' for org.apache.maven.plugins:maven-compiler-plugin is missing. @ io.jpress:parent:${jpress.version}, D:\Program Files\jpress\pom.xml, line 146, column 21 [WARNING] [WARNING] Some problems were encountered while building the effective model for io.jpress:jpress-commons:jar:1.0 [WARNING] 'build.plugins.plugin.version' for org.apache.maven.plugins:maven-compiler-plugin is missing. @ io.jpress:parent:${jpress.version}, D:\Program Files\jpress\pom.xml, line 146, column 21 [WARNING] [WARNING] Some problems were encountered while building the effective model for io.jpress:jpress-core:jar:1.0 [WARNING] 'build.plugins.plugin.version' for org.apache.maven.plugins:maven-compiler-plugin is missing. @ io.jpress:jpress-core:[unknown-version], D:\Program Files\jpress\jpress-core\pom.xml, line 55, column 21 [WARNING] [WARNING] Some problems were encountered while building the effective model for io.jpress:jpress-web:jar:1.0 [WARNING] 'build.plugins.plugin.version' for org.apache.maven.plugins:maven-compiler-plugin is missing. @ io.jpress:parent:${jpress.version}, D:\Program Files\jpress\pom.xml, line 146, column 21 [WARNING] [WARNING] Some problems were encountered while building the effective model for io.jpress:jpress-service-api:jar:1.0 [WARNING] 'build.plugins.plugin.version' for org.apache.maven.plugins:maven-compiler-plugin is missing. @ io.jpress:parent:${jpress.version}, D:\Program Files\jpress\pom.xml, line 146, column 21 [WARNING] [WARNING] Some problems were encountered while building the effective model for io.jpress:jpress-service-provider:jar:1.0 [WARNING] 'build.plugins.plugin.version' for org.apache.maven.plugins:maven-compiler-plugin is missing. @ io.jpress:parent:${jpress.version}, D:\Program Files\jpress\pom.xml, line 146, column 21 [WARNING] [WARNING] Some problems were encountered while building the effective model for io.jpress:jpress-model:jar:1.0 [WARNING] 'build.plugins.plugin.version' for org.apache.maven.plugins:maven-compiler-plugin is missing. @ io.jpress:parent:${jpress.version}, D:\Program Files\jpress\pom.xml, line 146, column 21 [WARNING] [WARNING] Some problems were encountered while building the effective model for io.jpress:jpress-template:jar:1.0 [WARNING] 'build.plugins.plugin.version' for org.apache.maven.plugins:maven-compiler-plugin is missing. @ io.jpress:parent:${jpress.version}, D:\Program Files\jpress\pom.xml, line 146, column 21 [WARNING] [WARNING] Some problems were encountered while building the effective model for io.jpress:module-article-model:jar:1.0 [WARNING] 'build.plugins.plugin.version' for org.apache.maven.plugins:maven-compiler-plugin is missing. @ io.jpress:parent:${jpress.version}, D:\Program Files\jpress\pom.xml, line 146, column 21 [WARNING] [WARNING] Some problems were encountered while building the effective model for io.jpress:module-article-web:jar:1.0 [WARNING] 'build.plugins.plugin.version' for org.apache.maven.plugins:maven-compiler-plugin is missing. @ io.jpress:parent:${jpress.version}, D:\Program Files\jpress\pom.xml, line 146, column 21 [WARNING] [WARNING] Some problems were encountered while building the effective model for io.jpress:module-article-service-api:jar:1.0 [WARNING] 'build.plugins.plugin.version' for org.apache.maven.plugins:maven-compiler-plugin is missing. @ io.jpress:parent:${jpress.version}, D:\Program Files\jpress\pom.xml, line 146, column 21 [WARNING] [WARNING] Some problems were encountered while building the effective model for io.jpress:module-article-service-provider:jar:1.0 [WARNING] 'build.plugins.plugin.version' for org.apache.maven.plugins:maven-compiler-plugin is missing. @ io.jpress:parent:${jpress.version}, D:\Program Files\jpress\pom.xml, line 146, column 21 [WARNING] [WARNING] Some problems were encountered while building the effective model for io.jpress:module-article:pom:1.0 [WARNING] 'build.plugins.plugin.version' for org.apache.maven.plugins:maven-compiler-plugin is missing. @ io.jpress:parent:${jpress.version}, D:\Program Files\jpress\pom.xml, line 146, column 21 [WARNING] [WARNING] Some problems were encountered while building the effective model for io.jpress:module-page-model:jar:1.0 [WARNING] 'build.plugins.plugin.version' for org.apache.maven.plugins:maven-compiler-plugin is missing. @ io.jpress:parent:${jpress.version}, D:\Program Files\jpress\pom.xml, line 146, column 21 [WARNING] [WARNING] Some problems were encountered while building the effective model for io.jpress:module-page-web:jar:1.0 [WARNING] 'build.plugins.plugin.version' for org.apache.maven.plugins:maven-compiler-plugin is missing. @ io.jpress:parent:${jpress.version}, D:\Program Files\jpress\pom.xml, line 146, column 21 [WARNING] [WARNING] Some problems were encountered while building the effective model for io.jpress:module-page-service-api:jar:1.0 [WARNING] 'build.plugins.plugin.version' for org.apache.maven.plugins:maven-compiler-plugin is missing. @ io.jpress:parent:${jpress.version}, D:\Program Files\jpress\pom.xml, line 146, column 21 [WARNING] [WARNING] Some problems were encountered while building the effective model for io.jpress:module-page-service-provider:jar:1.0 [WARNING] 'build.plugins.plugin.version' for org.apache.maven.plugins:maven-compiler-plugin is missing. @ io.jpress:parent:${jpress.version}, D:\Program Files\jpress\pom.xml, line 146, column 21 [WARNING] [WARNING] Some problems were encountered while building the effective model for io.jpress:module-page:pom:1.0 [WARNING] 'build.plugins.plugin.version' for org.apache.maven.plugins:maven-compiler-plugin is missing. @ io.jpress:parent:${jpress.version}, D:\Program Files\jpress\pom.xml, line 146, column 21 [WARNING] [WARNING] Some problems were encountered while building the effective model for io.jpress:starter:jar:1.0 [WARNING] 'build.plugins.plugin.(groupId:artifactId)' must be unique but found duplicate declaration of plugin org.apache.maven.plugins:maven-remote-resources-plugin @ io.jpress:starter:[unknown-version], D:\Program Files\jpress\starter\pom.xml, line 203, column 21 [WARNING] 'build.plugins.plugin.version' for org.apache.maven.plugins:maven-compiler-plugin is missing. @ io.jpress:starter:[unknown-version], D:\Program Files\jpress\starter\pom.xml, line 142, column 21 [WARNING] [WARNING] Some problems were encountered while building the effective model for io.jpress:starter-tomcat:war:1.0 [WARNING] 'build.plugins.plugin.version' for org.apache.maven.plugins:maven-compiler-plugin is missing. @ io.jpress:starter-tomcat:[unknown-version], D:\Program Files\jpress\starter-tomcat\pom.xml, line 164, column 21 [WARNING] 'build.plugins.plugin.version' for org.apache.maven.plugins:maven-war-plugin is missing. @ io.jpress:starter-tomcat:[unknown-version], D:\Program Files\jpress\starter-tomcat\pom.xml, line 221, column 21 [WARNING] [WARNING] Some problems were encountered while building the effective model for io.jpress:parent:pom:1.0 [WARNING] 'version' contains an expression but should be a constant. @ io.jpress:parent:${jpress.version}, D:\Program Files\jpress\pom.xml, line 10, column 14 [WARNING] 'build.plugins.plugin.version' for org.apache.maven.plugins:maven-compiler-plugin is missing. @ io.jpress:parent:${jpress.version}, D:\Program Files\jpress\pom.xml, line 146, column 21 [WARNING] [WARNING] It is highly recommended to fix these problems because they threaten the stability of your build. [WARNING] [WARNING] For this reason, future Maven versions might no longer support building such malformed projects. [WARNING] [INFO] ------------------------------------------------------------------------ [INFO] Reactor Build Order: [INFO] [INFO] parent [pom] [INFO] codegen [jar] [INFO] jpress-commons [jar] [INFO] jpress-model [jar] [INFO] jpress-service-api [jar] [INFO] jpress-core [jar] [INFO] jpress-web [jar] [INFO] jpress-service-provider [jar] [INFO] jpress-template [jar] [INFO] module-article [pom] [INFO] module-article-model [jar] [INFO] module-article-service-api [jar] [INFO] module-article-service-provider [jar] [INFO] module-article-web [jar] [INFO] module-page [pom] [INFO] module-page-model [jar] [INFO] module-page-service-api [jar] [INFO] module-page-service-provider [jar] [INFO] module-page-web [jar] [INFO] starter [jar] [INFO] starter-tomcat [war] [INFO] [INFO] --------------------------< io.jpress:parent >-------------------------- [INFO] Building parent 1.0 [1/21] [INFO] --------------------------------[ pom ]--------------------------------- [INFO] [INFO] -------------------------< io.jpress:codegen >-------------------------- [INFO] Building codegen 1.0 [2/21] [INFO] --------------------------------[ jar ]--------------------------------- [INFO] [INFO] --- maven-resources-plugin:2.6:resources (default-resources) @ codegen --- [WARNING] Using platform encoding (GBK actually) to copy filtered resources, i.e. build is platform dependent! [INFO] Copying 9 resources [INFO] skip non existing resourceDirectory D:\Program Files\jpress\codegen\src\main\resources [INFO] [INFO] --- maven-compiler-plugin:3.1:compile (default-compile) @ codegen --- [INFO] Changes detected - recompiling the module! [INFO] Compiling 7 source files to D:\Program Files\jpress\codegen\target\classes [INFO] ------------------------------------------------------------- [ERROR] COMPILATION ERROR : [INFO] ------------------------------------------------------------- [ERROR] No compiler is provided in this environment. Perhaps you are running on a JRE rather than a JDK? [INFO] 1 error [INFO] ------------------------------------------------------------- [INFO] ------------------------------------------------------------------------ [INFO] Reactor Summary: [INFO] [INFO] parent 1.0 ......................................... SUCCESS [ 0.228 s] [INFO] codegen ............................................ FAILURE [ 4.318 s] [INFO] jpress-commons ..................................... SKIPPED [INFO] jpress-model ....................................... SKIPPED [INFO] jpress-service-api ................................. SKIPPED [INFO] jpress-core ........................................ SKIPPED [INFO] jpress-web ......................................... SKIPPED [INFO] jpress-service-provider ............................ SKIPPED [INFO] jpress-template .................................... SKIPPED [INFO] module-article ..................................... SKIPPED [INFO] module-article-model ............................... SKIPPED [INFO] module-article-service-api ......................... SKIPPED [INFO] module-article-service-provider .................... SKIPPED [INFO] module-article-web ................................. SKIPPED [INFO] module-page ........................................ SKIPPED [INFO] module-page-model .................................. SKIPPED [INFO] module-page-service-api ............................ SKIPPED [INFO] module-page-service-provider ....................... SKIPPED [INFO] module-page-web .................................... SKIPPED [INFO] starter ............................................ SKIPPED [INFO] starter-tomcat 1.0 ................................. SKIPPED [INFO] ------------------------------------------------------------------------ [INFO] BUILD FAILURE [INFO] ------------------------------------------------------------------------ [INFO] Total time: 6.688 s [INFO] Finished at: 2018-10-27T17:50:59+08:00 [INFO] ------------------------------------------------------------------------ [ERROR] Failed to execute goal org.apache.maven.plugins:maven-compiler-plugin:3.1:compile (default-compile) on project codegen: Compilation failure [ERROR] No compiler is provided in this environment. Perhaps you are running on a JRE rather than a JDK? [ERROR] [ERROR] -> [Help 1] [ERROR] [ERROR] To see the full stack trace of the errors, re-run Maven with the -e switch. [ERROR] Re-run Maven using the -X switch to enable full debug logging. [ERROR] [ERROR] For more information about the errors and possible solutions, please read the following articles: [ERROR] [Help 1] http://cwiki.apache.org/confluence/display/MAVEN/MojoFailureException [ERROR] [ERROR] After correcting the problems, you can resume the build with the command [ERROR] mvn <goals> -rf :codegen mvn -version运行正常: Apache Maven 3.5.4 (1edded0938998edf8bf061f1ceb3cfdeccf443fe; 2018-06-18T02:33:14+08:00) Maven home: D:\Program Files\Apache\maven3.5.4\bin\.. Java version: 1.8.0_141, vendor: Oracle Corporation, runtime: C:\Program Files\Java\jre1.8.0_141 Default locale: zh_CN, platform encoding: GBK OS name: "windows 10", version: "10.0", arch: "amd64", family: "windows" 阿里云镜像配置没问题: <mirrors> <!-- mirror | Specifies a repository mirror site to use instead of a given repository. The repository that | this mirror serves has an ID that matches the mirrorOf element of this mirror. IDs are used | for inheritance and direct lookup purposes, and must be unique across the set of mirrors. | <mirror> <id>mirrorId</id> <mirrorOf>repositoryId</mirrorOf> <name>Human Readable Name for this Mirror.</name> <url>http://my.repository.com/repo/path</url> </mirror> --> <mirror> <id>alimaven</id> <name>aliyun maven</name> <url>http://maven.aliyun.com/nexus/content/groups/public/</url> <mirrorOf>central</mirrorOf> </mirror> </mirrors>
刚从svn检出的项目 ,转换成maven项目后报错
Failure to transfer org.apache.maven.plugins:maven-resources-plugin:pom:2.6 from https://repo.maven.apache.org/maven2 was cached in the local repository, resolution will not be reattempted until the update interval of central has elapsed or updates are forced. Original error: Could not transfer artifact org.apache.maven.plugins:maven-resources-plugin:pom:2.6 from/to central (https://repo.maven.apache.org/maven2): The operation was cancelled.
Maven项目SSM整合后,tomcat可启动,但localhost:8080/无法访问
[INFO] Scanning for projects... [INFO] ------------------------------------------------------------------------ [INFO] Reactor Build Order: [INFO] [INFO] taotao-manager [INFO] taotao-manager-pojo [INFO] taotao-manager-dao [INFO] taotao-manager-service [INFO] taotao-manager-web [INFO] [INFO] ------------------------------------------------------------------------ [INFO] Building taotao-manager 0.0.1-SNAPSHOT [INFO] ------------------------------------------------------------------------ [INFO] [INFO] --- maven-clean-plugin:2.5:clean (default-clean) @ taotao-manager --- [INFO] [INFO] >>> tomcat7-maven-plugin:2.2:run (default-cli) > process-classes @ taotao-manager >>> [INFO] [INFO] <<< tomcat7-maven-plugin:2.2:run (default-cli) < process-classes @ taotao-manager <<< [INFO] [INFO] [INFO] --- tomcat7-maven-plugin:2.2:run (default-cli) @ taotao-manager --- [INFO] Skipping non-war project [INFO] [INFO] ------------------------------------------------------------------------ [INFO] Building taotao-manager-pojo 0.0.1-SNAPSHOT [INFO] ------------------------------------------------------------------------ [INFO] [INFO] --- maven-clean-plugin:2.5:clean (default-clean) @ taotao-manager-pojo --- [INFO] Deleting E:\jdkandjre\workspace\taotao-manager\taotao-manager-pojo\target [INFO] [INFO] >>> tomcat7-maven-plugin:2.2:run (default-cli) > process-classes @ taotao-manager-pojo >>> [INFO] [INFO] --- maven-resources-plugin:2.7:resources (default-resources) @ taotao-manager-pojo --- [INFO] Using 'UTF-8' encoding to copy filtered resources. [INFO] Copying 0 resource [INFO] [INFO] --- maven-compiler-plugin:3.2:compile (default-compile) @ taotao-manager-pojo --- [INFO] Changes detected - recompiling the module! [INFO] Compiling 22 source files to E:\jdkandjre\workspace\taotao-manager\taotao-manager-pojo\target\classes [INFO] [INFO] <<< tomcat7-maven-plugin:2.2:run (default-cli) < process-classes @ taotao-manager-pojo <<< [INFO] [INFO] [INFO] --- tomcat7-maven-plugin:2.2:run (default-cli) @ taotao-manager-pojo --- [INFO] Skipping non-war project [INFO] [INFO] ------------------------------------------------------------------------ [INFO] Building taotao-manager-dao 0.0.1-SNAPSHOT [INFO] ------------------------------------------------------------------------ [INFO] [INFO] --- maven-clean-plugin:2.5:clean (default-clean) @ taotao-manager-dao --- [INFO] Deleting E:\jdkandjre\workspace\taotao-manager\taotao-manager-dao\target [INFO] [INFO] >>> tomcat7-maven-plugin:2.2:run (default-cli) > process-classes @ taotao-manager-dao >>> [INFO] [INFO] --- maven-resources-plugin:2.7:resources (default-resources) @ taotao-manager-dao --- [INFO] Using 'UTF-8' encoding to copy filtered resources. [INFO] Copying 11 resources [INFO] [INFO] --- maven-compiler-plugin:3.2:compile (default-compile) @ taotao-manager-dao --- [INFO] Changes detected - recompiling the module! [INFO] Compiling 11 source files to E:\jdkandjre\workspace\taotao-manager\taotao-manager-dao\target\classes [INFO] [INFO] <<< tomcat7-maven-plugin:2.2:run (default-cli) < process-classes @ taotao-manager-dao <<< [INFO] [INFO] [INFO] --- tomcat7-maven-plugin:2.2:run (default-cli) @ taotao-manager-dao --- [INFO] Skipping non-war project [INFO] [INFO] ------------------------------------------------------------------------ [INFO] Building taotao-manager-service 0.0.1-SNAPSHOT [INFO] ------------------------------------------------------------------------ [INFO] [INFO] --- maven-clean-plugin:2.5:clean (default-clean) @ taotao-manager-service --- [INFO] Deleting E:\jdkandjre\workspace\taotao-manager\taotao-manager-service\target [INFO] [INFO] >>> tomcat7-maven-plugin:2.2:run (default-cli) > process-classes @ taotao-manager-service >>> [INFO] [INFO] --- maven-resources-plugin:2.7:resources (default-resources) @ taotao-manager-service --- [INFO] Using 'UTF-8' encoding to copy filtered resources. [INFO] Copying 0 resource [INFO] [INFO] --- maven-compiler-plugin:3.2:compile (default-compile) @ taotao-manager-service --- [INFO] Changes detected - recompiling the module! [INFO] Compiling 2 source files to E:\jdkandjre\workspace\taotao-manager\taotao-manager-service\target\classes [INFO] [INFO] <<< tomcat7-maven-plugin:2.2:run (default-cli) < process-classes @ taotao-manager-service <<< [INFO] [INFO] [INFO] --- tomcat7-maven-plugin:2.2:run (default-cli) @ taotao-manager-service --- [INFO] Skipping non-war project [INFO] [INFO] ------------------------------------------------------------------------ [INFO] Building taotao-manager-web 0.0.1-SNAPSHOT [INFO] ------------------------------------------------------------------------ [INFO] [INFO] --- maven-clean-plugin:2.5:clean (default-clean) @ taotao-manager-web --- [INFO] Deleting E:\jdkandjre\workspace\taotao-manager\taotao-manager-web\target [INFO] [INFO] >>> tomcat7-maven-plugin:2.2:run (default-cli) > process-classes @ taotao-manager-web >>> [INFO] [INFO] --- maven-resources-plugin:2.7:resources (default-resources) @ taotao-manager-web --- [INFO] Using 'UTF-8' encoding to copy filtered resources. [INFO] Copying 6 resources [INFO] [INFO] --- maven-compiler-plugin:3.2:compile (default-compile) @ taotao-manager-web --- [INFO] Changes detected - recompiling the module! [INFO] Compiling 1 source file to E:\jdkandjre\workspace\taotao-manager\taotao-manager-web\target\classes [INFO] [INFO] <<< tomcat7-maven-plugin:2.2:run (default-cli) < process-classes @ taotao-manager-web <<< [INFO] [INFO] [INFO] --- tomcat7-maven-plugin:2.2:run (default-cli) @ taotao-manager-web --- [INFO] Running war on http://localhost:8080/ [INFO] Creating Tomcat server configuration at E:\jdkandjre\workspace\taotao-manager\taotao-manager-web\target\tomcat [INFO] create webapp with contextPath: 十二月 08, 2017 8:56:30 上午 org.apache.coyote.AbstractProtocol init 信息: Initializing ProtocolHandler ["http-bio-8080"] 十二月 08, 2017 8:56:30 上午 org.apache.catalina.core.StandardService startInternal 信息: Starting service Tomcat 十二月 08, 2017 8:56:30 上午 org.apache.catalina.core.StandardEngine startInternal 信息: Starting Servlet Engine: Apache Tomcat/7.0.47 十二月 08, 2017 8:56:32 上午 org.apache.catalina.core.ApplicationContext log 信息: No Spring WebApplicationInitializer types detected on classpath 十二月 08, 2017 8:56:32 上午 org.apache.catalina.core.ApplicationContext log 信息: Initializing Spring root WebApplicationContext log4j:WARN No appenders could be found for logger (org.springframework.web.context.ContextLoader). log4j:WARN Please initialize the log4j system properly. log4j:WARN See http://logging.apache.org/log4j/1.2/faq.html#noconfig for more info. 黑马的淘淘商城项目,这以上是控制台消息,浏览器http://localhost:8080/一直画圈,无响应,请问这是怎么回事啊
No provider available from registry ip for service com.zys.store.service.api.HelloServiceApi:1.0.0 on consumer ip use dubbo version 2.6.2
springboot整合zookeeper和dubbo报错 linux上zk版本号是3.4.14 项目用的zk包是3.4.9 dubbo用的是2.6.2 springboot是2.1.6 用main方式先运行store的模块 再运行order的模块 这个时候用浏览器去访问http://localhost:8088/hello?name=zys这个时候控制台就报错No provider available from registry 启动的时候不报错 浏览器访问就报错了 看zk日志有说是HelloServiceApi这个类的节点已经存在 但是我觉得跟这个问题不大 因为运行一次就会创建一个节点 多次的话肯定报节点存在的错 我的linux是虚拟机 并且已经关闭了防火墙 不存在端口跑不通的情况 1. 项目架构是maven的聚合项目![图片说明](https://img-ask.csdn.net/upload/201911/20/1574220333_973372.png) 2. 在zys-store-api写接口 package com.zys.store.service.api; public interface HelloServiceApi { String sayHello(String name); } 3.在zys-store暴露接口 package com.zys.store.service.provider; import com.alibaba.dubbo.config.annotation.Service; import com.zys.store.service.api.HelloServiceApi; @Service( version = "1.0.0", application = "zys-store", protocol = "dubbo", registry = "zys-store-registry" ) public class HelloServiceProvider implements HelloServiceApi{ @Override public String sayHello(String name) { return "hello" + name; } } 下面是zys-store的yml的配置 dubbo: application: id: zys-store name: zys-store qos-port: 22212 qos-enable: true scan: base-packages: com.zys.store.* protocol: id: dubbo name: dubbo port: 12343 registry: id: zys-store-registry address: zookeeper://192.168.146.132:2181?backup=192.168.146.131:2181,192.168.146.133:2181 4.在zys-order调用接口 package com.zys.order.controller; import com.alibaba.dubbo.config.annotation.Reference; import com.zys.store.service.api.HelloServiceApi; import org.springframework.web.bind.annotation.RequestMapping; import org.springframework.web.bind.annotation.RequestParam; import org.springframework.web.bind.annotation.RestController; import javax.annotation.Resource; @RestController public class HelloController { @Reference( version = "1.0.0", application = "zys-order", interfaceName = "com.zys.store.service.api.HelloServiceApi", check = false, timeout = 3000, retries = 0 //读请求3次 写请求不重复 ) private HelloServiceApi helloServiceApi; @RequestMapping("/hello") public String hello(@RequestParam("name") String name){ return helloServiceApi.sayHello(name); } } 下面是zys-order的yml的配置 ```dubbo: application: id: zys-order name: zys-order qos-port: 22211 qos-enable: true qos-accept-foreign-ip: false scan: base-packages: com.zys.order.* protocol: id: dubbo name: dubbo port: 12343 registry: id: zys-order-registry address: zookeeper://192.168.146.132:2181?backup=192.168.146.131:2181,192.168.146.133:2181 store端的启动日志 2019-11-20 10:18:35.426 INFO 50632 --- [ main] a.b.d.c.e.WelcomeLogoApplicationListener : :: Dubbo Spring Boot (v0.2.0) : https://github.com/apache/incubator-dubbo-spring-boot-project :: Dubbo (v2.6.2) : https://github.com/apache/incubator-dubbo :: Google group : dev@dubbo.incubator.apache.org 2019-11-20 10:18:35.430 INFO 50632 --- [ main] e.OverrideDubboConfigApplicationListener : Dubbo Config was overridden by externalized configuration {dubbo.application.id=zys-store, dubbo.application.name=zys-store, dubbo.application.qos-enable=true, dubbo.application.qos-port=22212, dubbo.protocol.id=dubbo, dubbo.protocol.name=dubbo, dubbo.protocol.port=12343, dubbo.registry.address=zookeeper://192.168.146.132:2181?backup=192.168.146.131:2181,192.168.146.133:2181, dubbo.registry.id=zys-store-registry, dubbo.scan.base-packages=com.zys.store.*} . ____ _ __ _ _ /\\ / ___'_ __ _ _(_)_ __ __ _ \ \ \ \ ( ( )\___ | '_ | '_| | '_ \/ _` | \ \ \ \ \\/ ___)| |_)| | | | | || (_| | ) ) ) ) ' |____| .__|_| |_|_| |_\__, | / / / / =========|_|==============|___/=/_/_/_/ :: Spring Boot :: (v2.1.6.RELEASE) 2019-11-20 10:18:35.488 INFO 50632 --- [ main] com.zys.store.ZysStoreApplication : Starting ZysStoreApplication on DESKTOP-O0S84K8 with PID 50632 (D:\ideaworkspace\zys-project\zys-store\target\classes started by Administrator in D:\ideaworkspace\zys-project) 2019-11-20 10:18:35.489 INFO 50632 --- [ main] com.zys.store.ZysStoreApplication : No active profile set, falling back to default profiles: default 2019-11-20 10:18:35.963 WARN 50632 --- [ main] o.m.s.mapper.ClassPathMapperScanner : No MyBatis mapper was found in '[com.zys.store.dao, com.zys.store.mapper]' package. Please check your configuration. 2019-11-20 10:18:36.030 WARN 50632 --- [ main] o.s.boot.actuate.endpoint.EndpointId : Endpoint ID 'dubbo-configs' contains invalid characters, please migrate to a valid format. 2019-11-20 10:18:36.031 WARN 50632 --- [ main] o.s.boot.actuate.endpoint.EndpointId : Endpoint ID 'dubbo-properties' contains invalid characters, please migrate to a valid format. 2019-11-20 10:18:36.031 WARN 50632 --- [ main] o.s.boot.actuate.endpoint.EndpointId : Endpoint ID 'dubbo-references' contains invalid characters, please migrate to a valid format. 2019-11-20 10:18:36.031 WARN 50632 --- [ main] o.s.boot.actuate.endpoint.EndpointId : Endpoint ID 'dubbo-services' contains invalid characters, please migrate to a valid format. 2019-11-20 10:18:36.031 WARN 50632 --- [ main] o.s.boot.actuate.endpoint.EndpointId : Endpoint ID 'dubbo-shutdown' contains invalid characters, please migrate to a valid format. 2019-11-20 10:18:36.037 INFO 50632 --- [ main] .a.d.c.s.c.a.DubboConfigBindingRegistrar : The dubbo config bean definition [name : zys-store, class : com.alibaba.dubbo.config.ApplicationConfig] has been registered. 2019-11-20 10:18:36.037 INFO 50632 --- [ main] .a.d.c.s.c.a.DubboConfigBindingRegistrar : The BeanPostProcessor bean definition [com.alibaba.dubbo.config.spring.beans.factory.annotation.DubboConfigBindingBeanPostProcessor] for dubbo config bean [name : zys-store] has been registered. 2019-11-20 10:18:36.037 INFO 50632 --- [ main] .a.d.c.s.c.a.DubboConfigBindingRegistrar : The dubbo config bean definition [name : zys-store-registry, class : com.alibaba.dubbo.config.RegistryConfig] has been registered. 2019-11-20 10:18:36.037 INFO 50632 --- [ main] .a.d.c.s.c.a.DubboConfigBindingRegistrar : The BeanPostProcessor bean definition [com.alibaba.dubbo.config.spring.beans.factory.annotation.DubboConfigBindingBeanPostProcessor] for dubbo config bean [name : zys-store-registry] has been registered. 2019-11-20 10:18:36.037 INFO 50632 --- [ main] .a.d.c.s.c.a.DubboConfigBindingRegistrar : The dubbo config bean definition [name : dubbo, class : com.alibaba.dubbo.config.ProtocolConfig] has been registered. 2019-11-20 10:18:36.038 INFO 50632 --- [ main] .a.d.c.s.c.a.DubboConfigBindingRegistrar : The BeanPostProcessor bean definition [com.alibaba.dubbo.config.spring.beans.factory.annotation.DubboConfigBindingBeanPostProcessor] for dubbo config bean [name : dubbo] has been registered. 2019-11-20 10:18:36.060 WARN 50632 --- [ main] o.m.s.mapper.ClassPathMapperScanner : No MyBatis mapper was found in '[com.zys.store]' package. Please check your configuration. 2019-11-20 10:18:36.307 INFO 50632 --- [ main] trationDelegate$BeanPostProcessorChecker : Bean 'com.alibaba.boot.dubbo.autoconfigure.DubboAutoConfiguration' of type [com.alibaba.boot.dubbo.autoconfigure.DubboAutoConfiguration$$EnhancerBySpringCGLIB$$437665e0] is not eligible for getting processed by all BeanPostProcessors (for example: not eligible for auto-proxying) 2019-11-20 10:18:36.357 INFO 50632 --- [ main] trationDelegate$BeanPostProcessorChecker : Bean 'relaxedDubboConfigBinder' of type [com.alibaba.boot.dubbo.autoconfigure.RelaxedDubboConfigBinder] is not eligible for getting processed by all BeanPostProcessors (for example: not eligible for auto-proxying) 2019-11-20 10:18:36.364 INFO 50632 --- [ main] trationDelegate$BeanPostProcessorChecker : Bean 'org.springframework.transaction.annotation.ProxyTransactionManagementConfiguration' of type [org.springframework.transaction.annotation.ProxyTransactionManagementConfiguration$$EnhancerBySpringCGLIB$$3474c06e] is not eligible for getting processed by all BeanPostProcessors (for example: not eligible for auto-proxying) 2019-11-20 10:18:36.382 INFO 50632 --- [ main] trationDelegate$BeanPostProcessorChecker : Bean 'relaxedDubboConfigBinder' of type [com.alibaba.boot.dubbo.autoconfigure.RelaxedDubboConfigBinder] is not eligible for getting processed by all BeanPostProcessors (for example: not eligible for auto-proxying) 2019-11-20 10:18:36.383 INFO 50632 --- [ main] trationDelegate$BeanPostProcessorChecker : Bean 'relaxedDubboConfigBinder' of type [com.alibaba.boot.dubbo.autoconfigure.RelaxedDubboConfigBinder] is not eligible for getting processed by all BeanPostProcessors (for example: not eligible for auto-proxying) 2019-11-20 10:18:36.657 INFO 50632 --- [ main] o.s.b.w.embedded.tomcat.TomcatWebServer : Tomcat initialized with port(s): 8089 (http) 2019-11-20 10:18:36.675 INFO 50632 --- [ main] o.apache.catalina.core.StandardService : Starting service [Tomcat] 2019-11-20 10:18:36.675 INFO 50632 --- [ main] org.apache.catalina.core.StandardEngine : Starting Servlet engine: [Apache Tomcat/9.0.21] 2019-11-20 10:18:36.770 INFO 50632 --- [ main] o.a.c.c.C.[Tomcat].[localhost].[/] : Initializing Spring embedded WebApplicationContext 2019-11-20 10:18:36.770 INFO 50632 --- [ main] o.s.web.context.ContextLoader : Root WebApplicationContext: initialization completed in 1249 ms 2019-11-20 10:18:37.038 INFO 50632 --- [ main] .f.a.DubboConfigBindingBeanPostProcessor : The properties of bean [name : dubbo] have been binding by prefix of configuration properties : dubbo.protocol 2019-11-20 10:18:37.568 INFO 50632 --- [ main] o.s.s.concurrent.ThreadPoolTaskExecutor : Initializing ExecutorService 'applicationTaskExecutor' 2019-11-20 10:18:37.744 INFO 50632 --- [ main] .f.a.DubboConfigBindingBeanPostProcessor : The properties of bean [name : zys-store] have been binding by prefix of configuration properties : dubbo.application 2019-11-20 10:18:37.747 INFO 50632 --- [ main] .f.a.DubboConfigBindingBeanPostProcessor : The properties of bean [name : zys-store-registry] have been binding by prefix of configuration properties : dubbo.registry 2019-11-20 10:18:37.816 INFO 50632 --- [ main] com.zaxxer.hikari.HikariDataSource : MyHikariCP - Starting... 2019-11-20 10:18:37.993 INFO 50632 --- [ main] com.zaxxer.hikari.HikariDataSource : MyHikariCP - Start completed. order端的启动日志 ```2019-11-20 10:18:47.233 INFO 48096 --- [ main] a.b.d.c.e.WelcomeLogoApplicationListener : :: Dubbo Spring Boot (v0.2.0) : https://github.com/apache/incubator-dubbo-spring-boot-project :: Dubbo (v2.6.2) : https://github.com/apache/incubator-dubbo :: Google group : dev@dubbo.incubator.apache.org 2019-11-20 10:18:47.239 INFO 48096 --- [ main] e.OverrideDubboConfigApplicationListener : Dubbo Config was overridden by externalized configuration {dubbo.application.id=zys-order, dubbo.application.name=zys-order, dubbo.application.qos-accept-foreign-ip=false, dubbo.application.qos-enable=true, dubbo.application.qos-port=22211, dubbo.protocol.id=dubbo, dubbo.protocol.name=dubbo, dubbo.protocol.port=12343, dubbo.registry.address=zookeeper://192.168.146.132:2181?backup=192.168.146.131:2181,192.168.146.133:2181, dubbo.registry.id=zys-order-registry, dubbo.scan.base-packages=com.zys.order.*} . ____ _ __ _ _ /\\ / ___'_ __ _ _(_)_ __ __ _ \ \ \ \ ( ( )\___ | '_ | '_| | '_ \/ _` | \ \ \ \ \\/ ___)| |_)| | | | | || (_| | ) ) ) ) ' |____| .__|_| |_|_| |_\__, | / / / / =========|_|==============|___/=/_/_/_/ :: Spring Boot :: (v2.1.6.RELEASE) 2019-11-20 10:18:47.301 INFO 48096 --- [ main] com.zys.order.ZysOrderApplication : Starting ZysOrderApplication on DESKTOP-O0S84K8 with PID 48096 (D:\ideaworkspace\zys-project\zys-order\target\classes started by Administrator in D:\ideaworkspace\zys-project) 2019-11-20 10:18:47.302 INFO 48096 --- [ main] com.zys.order.ZysOrderApplication : No active profile set, falling back to default profiles: default 2019-11-20 10:18:47.803 WARN 48096 --- [ main] o.m.s.mapper.ClassPathMapperScanner : No MyBatis mapper was found in '[com.zys.order.dao, com.zys.order.mapper]' package. Please check your configuration. 2019-11-20 10:18:47.868 WARN 48096 --- [ main] o.s.boot.actuate.endpoint.EndpointId : Endpoint ID 'dubbo-configs' contains invalid characters, please migrate to a valid format. 2019-11-20 10:18:47.869 WARN 48096 --- [ main] o.s.boot.actuate.endpoint.EndpointId : Endpoint ID 'dubbo-properties' contains invalid characters, please migrate to a valid format. 2019-11-20 10:18:47.870 WARN 48096 --- [ main] o.s.boot.actuate.endpoint.EndpointId : Endpoint ID 'dubbo-references' contains invalid characters, please migrate to a valid format. 2019-11-20 10:18:47.870 WARN 48096 --- [ main] o.s.boot.actuate.endpoint.EndpointId : Endpoint ID 'dubbo-services' contains invalid characters, please migrate to a valid format. 2019-11-20 10:18:47.870 WARN 48096 --- [ main] o.s.boot.actuate.endpoint.EndpointId : Endpoint ID 'dubbo-shutdown' contains invalid characters, please migrate to a valid format. 2019-11-20 10:18:47.875 INFO 48096 --- [ main] .a.d.c.s.c.a.DubboConfigBindingRegistrar : The dubbo config bean definition [name : zys-order, class : com.alibaba.dubbo.config.ApplicationConfig] has been registered. 2019-11-20 10:18:47.875 INFO 48096 --- [ main] .a.d.c.s.c.a.DubboConfigBindingRegistrar : The BeanPostProcessor bean definition [com.alibaba.dubbo.config.spring.beans.factory.annotation.DubboConfigBindingBeanPostProcessor] for dubbo config bean [name : zys-order] has been registered. 2019-11-20 10:18:47.875 INFO 48096 --- [ main] .a.d.c.s.c.a.DubboConfigBindingRegistrar : The dubbo config bean definition [name : zys-order-registry, class : com.alibaba.dubbo.config.RegistryConfig] has been registered. 2019-11-20 10:18:47.875 INFO 48096 --- [ main] .a.d.c.s.c.a.DubboConfigBindingRegistrar : The BeanPostProcessor bean definition [com.alibaba.dubbo.config.spring.beans.factory.annotation.DubboConfigBindingBeanPostProcessor] for dubbo config bean [name : zys-order-registry] has been registered. 2019-11-20 10:18:47.876 INFO 48096 --- [ main] .a.d.c.s.c.a.DubboConfigBindingRegistrar : The dubbo config bean definition [name : dubbo, class : com.alibaba.dubbo.config.ProtocolConfig] has been registered. 2019-11-20 10:18:47.876 INFO 48096 --- [ main] .a.d.c.s.c.a.DubboConfigBindingRegistrar : The BeanPostProcessor bean definition [com.alibaba.dubbo.config.spring.beans.factory.annotation.DubboConfigBindingBeanPostProcessor] for dubbo config bean [name : dubbo] has been registered. 2019-11-20 10:18:47.894 WARN 48096 --- [ main] o.m.s.mapper.ClassPathMapperScanner : No MyBatis mapper was found in '[com.zys.order]' package. Please check your configuration. 2019-11-20 10:18:48.164 INFO 48096 --- [ main] trationDelegate$BeanPostProcessorChecker : Bean 'com.alibaba.boot.dubbo.autoconfigure.DubboAutoConfiguration' of type [com.alibaba.boot.dubbo.autoconfigure.DubboAutoConfiguration$$EnhancerBySpringCGLIB$$5fbcce96] is not eligible for getting processed by all BeanPostProcessors (for example: not eligible for auto-proxying) 2019-11-20 10:18:48.239 INFO 48096 --- [ main] trationDelegate$BeanPostProcessorChecker : Bean 'org.springframework.transaction.annotation.ProxyTransactionManagementConfiguration' of type [org.springframework.transaction.annotation.ProxyTransactionManagementConfiguration$$EnhancerBySpringCGLIB$$50bb2924] is not eligible for getting processed by all BeanPostProcessors (for example: not eligible for auto-proxying) 2019-11-20 10:18:48.261 INFO 48096 --- [ main] trationDelegate$BeanPostProcessorChecker : Bean 'relaxedDubboConfigBinder' of type [com.alibaba.boot.dubbo.autoconfigure.RelaxedDubboConfigBinder] is not eligible for getting processed by all BeanPostProcessors (for example: not eligible for auto-proxying) 2019-11-20 10:18:48.263 INFO 48096 --- [ main] trationDelegate$BeanPostProcessorChecker : Bean 'relaxedDubboConfigBinder' of type [com.alibaba.boot.dubbo.autoconfigure.RelaxedDubboConfigBinder] is not eligible for getting processed by all BeanPostProcessors (for example: not eligible for auto-proxying) 2019-11-20 10:18:48.264 INFO 48096 --- [ main] trationDelegate$BeanPostProcessorChecker : Bean 'relaxedDubboConfigBinder' of type [com.alibaba.boot.dubbo.autoconfigure.RelaxedDubboConfigBinder] is not eligible for getting processed by all BeanPostProcessors (for example: not eligible for auto-proxying) 2019-11-20 10:18:48.482 INFO 48096 --- [ main] o.s.b.w.embedded.tomcat.TomcatWebServer : Tomcat initialized with port(s): 8088 (http) 2019-11-20 10:18:48.496 INFO 48096 --- [ main] o.apache.catalina.core.StandardService : Starting service [Tomcat] 2019-11-20 10:18:48.496 INFO 48096 --- [ main] org.apache.catalina.core.StandardEngine : Starting Servlet engine: [Apache Tomcat/9.0.21] 2019-11-20 10:18:48.596 INFO 48096 --- [ main] o.a.c.c.C.[Tomcat].[localhost].[/] : Initializing Spring embedded WebApplicationContext 2019-11-20 10:18:48.596 INFO 48096 --- [ main] o.s.web.context.ContextLoader : Root WebApplicationContext: initialization completed in 1268 ms 2019-11-20 10:18:48.847 INFO 48096 --- [ main] .f.a.DubboConfigBindingBeanPostProcessor : The properties of bean [name : dubbo] have been binding by prefix of configuration properties : dubbo.protocol 2019-11-20 10:18:49.338 INFO 48096 --- [ main] .f.a.DubboConfigBindingBeanPostProcessor : The properties of bean [name : zys-order] have been binding by prefix of configuration properties : dubbo.application 2019-11-20 10:18:49.345 INFO 48096 --- [ main] .f.a.DubboConfigBindingBeanPostProcessor : The properties of bean [name : zys-order-registry] have been binding by prefix of configuration properties : dubbo.registry 2019-11-20 10:18:49.919 INFO 48096 --- [ main] o.a.c.f.imps.CuratorFrameworkImpl : Starting 2019-11-20 10:18:58.930 INFO 48096 --- [ main] org.apache.zookeeper.ZooKeeper : Client environment:zookeeper.version=3.4.9-1757313, built on 08/23/2016 06:50 GMT 2019-11-20 10:18:58.930 INFO 48096 --- [ main] org.apache.zookeeper.ZooKeeper : Client environment:host.name=DESKTOP-O0S84K8 2019-11-20 10:18:58.930 INFO 48096 --- [ main] org.apache.zookeeper.ZooKeeper : Client environment:java.version=1.8.0_211 2019-11-20 10:18:58.930 INFO 48096 --- [ main] org.apache.zookeeper.ZooKeeper : Client environment:java.vendor=Oracle Corporation 2019-11-20 10:18:58.930 INFO 48096 --- [ main] org.apache.zookeeper.ZooKeeper : Client environment:java.home=C:\Program Files\Java\jdk1.8.0_211\jre 2019-11-20 10:18:58.930 INFO 48096 --- [ main] org.apache.zookeeper.ZooKeeper : Client environment:java.class.path=C:\Program Files\Java\jdk1.8.0_211\jre\lib\charsets.jar;C:\Program Files\Java\jdk1.8.0_211\jre\lib\deploy.jar;C:\Program Files\Java\jdk1.8.0_211\jre\lib\ext\access-bridge-64.jar;C:\Program Files\Java\jdk1.8.0_211\jre\lib\ext\cldrdata.jar;C:\Program Files\Java\jdk1.8.0_211\jre\lib\ext\dnsns.jar;C:\Program Files\Java\jdk1.8.0_211\jre\lib\ext\jaccess.jar;C:\Program Files\Java\jdk1.8.0_211\jre\lib\ext\jfxrt.jar;C:\Program Files\Java\jdk1.8.0_211\jre\lib\ext\localedata.jar;C:\Program Files\Java\jdk1.8.0_211\jre\lib\ext\nashorn.jar;C:\Program Files\Java\jdk1.8.0_211\jre\lib\ext\sunec.jar;C:\Program Files\Java\jdk1.8.0_211\jre\lib\ext\sunjce_provider.jar;C:\Program Files\Java\jdk1.8.0_211\jre\lib\ext\sunmscapi.jar;C:\Program Files\Java\jdk1.8.0_211\jre\lib\ext\sunpkcs11.jar;C:\Program Files\Java\jdk1.8.0_211\jre\lib\ext\zipfs.jar;C:\Program Files\Java\jdk1.8.0_211\jre\lib\javaws.jar;C:\Program Files\Java\jdk1.8.0_211\jre\lib\jce.jar;C:\Program Files\Java\jdk1.8.0_211\jre\lib\jfr.jar;C:\Program Files\Java\jdk1.8.0_211\jre\lib\jfxswt.jar;C:\Program Files\Java\jdk1.8.0_211\jre\lib\jsse.jar;C:\Program Files\Java\jdk1.8.0_211\jre\lib\management-agent.jar;C:\Program Files\Java\jdk1.8.0_211\jre\lib\plugin.jar;C:\Program Files\Java\jdk1.8.0_211\jre\lib\resources.jar;C:\Program Files\Java\jdk1.8.0_211\jre\lib\rt.jar;D:\ideaworkspace\zys-project\zys-order\target\classes;D:\repository\org\springframework\boot\spring-boot-starter-web\2.1.6.RELEASE\spring-boot-starter-web-2.1.6.RELEASE.jar;D:\repository\org\springframework\boot\spring-boot-starter-json\2.1.6.RELEASE\spring-boot-starter-json-2.1.6.RELEASE.jar;D:\repository\com\fasterxml\jackson\core\jackson-databind\2.9.9\jackson-databind-2.9.9.jar;D:\repository\com\fasterxml\jackson\datatype\jackson-datatype-jdk8\2.9.9\jackson-datatype-jdk8-2.9.9.jar;D:\repository\com\fasterxml\jackson\datatype\jackson-datatype-jsr310\2.9.9\jackson-datatype-jsr310-2.9.9.jar;D:\repository\com\fasterxml\jackson\module\jackson-module-parameter-names\2.9.9\jackson-module-parameter-names-2.9.9.jar;D:\repository\org\springframework\boot\spring-boot-starter-tomcat\2.1.6.RELEASE\spring-boot-starter-tomcat-2.1.6.RELEASE.jar;D:\repository\org\apache\tomcat\embed\tomcat-embed-core\9.0.21\tomcat-embed-core-9.0.21.jar;D:\repository\org\apache\tomcat\embed\tomcat-embed-el\9.0.21\tomcat-embed-el-9.0.21.jar;D:\repository\org\apache\tomcat\embed\tomcat-embed-websocket\9.0.21\tomcat-embed-websocket-9.0.21.jar;D:\repository\org\hibernate\validator\hibernate-validator\6.0.17.Final\hibernate-validator-6.0.17.Final.jar;D:\repository\javax\validation\validation-api\2.0.1.Final\validation-api-2.0.1.Final.jar;D:\repository\org\jboss\logging\jboss-logging\3.3.2.Final\jboss-logging-3.3.2.Final.jar;D:\repository\com\fasterxml\classmate\1.4.0\classmate-1.4.0.jar;D:\repository\org\springframework\spring-web\5.1.8.RELEASE\spring-web-5.1.8.RELEASE.jar;D:\repository\org\springframework\spring-beans\5.1.8.RELEASE\spring-beans-5.1.8.RELEASE.jar;D:\repository\org\springframework\spring-webmvc\5.1.8.RELEASE\spring-webmvc-5.1.8.RELEASE.jar;D:\repository\org\springframework\spring-aop\5.1.8.RELEASE\spring-aop-5.1.8.RELEASE.jar;D:\repository\org\springframework\spring-context\5.1.8.RELEASE\spring-context-5.1.8.RELEASE.jar;D:\repository\org\springframework\spring-expression\5.1.8.RELEASE\spring-expression-5.1.8.RELEASE.jar;D:\repository\org\springframework\boot\spring-boot-starter-actuator\2.1.6.RELEASE\spring-boot-starter-actuator-2.1.6.RELEASE.jar;D:\repository\org\springframework\boot\spring-boot-actuator-autoconfigure\2.1.6.RELEASE\spring-boot-actuator-autoconfigure-2.1.6.RELEASE.jar;D:\repository\org\springframework\boot\spring-boot-actuator\2.1.6.RELEASE\spring-boot-actuator-2.1.6.RELEASE.jar;D:\repository\io\micrometer\micrometer-core\1.1.5\micrometer-core-1.1.5.jar;D:\repository\org\latencyutils\LatencyUtils\2.0.3\LatencyUtils-2.0.3.jar;D:\repository\org\springframework\spring-core\5.1.8.RELEASE\spring-core-5.1.8.RELEASE.jar;D:\repository\org\springframework\spring-jcl\5.1.8.RELEASE\spring-jcl-5.1.8.RELEASE.jar;D:\repository\org\springframework\boot\spring-boot-starter-jdbc\2.1.6.RELEASE\spring-boot-starter-jdbc-2.1.6.RELEASE.jar;D:\repository\com\zaxxer\HikariCP\3.2.0\HikariCP-3.2.0.jar;D:\repository\org\springframework\spring-jdbc\5.1.8.RELEASE\spring-jdbc-5.1.8.RELEASE.jar;D:\repository\org\springframework\spring-tx\5.1.8.RELEASE\spring-tx-5.1.8.RELEASE.jar;D:\repository\com\baomidou\mybatis-plus-boot-starter\3.1.1\mybatis-plus-boot-starter-3.1.1.jar;D:\repository\com\baomidou\mybatis-plus\3.1.1\mybatis-plus-3.1.1.jar;D:\repository\com\baomidou\mybatis-plus-extension\3.1.1\mybatis-plus-extension-3.1.1.jar;D:\repository\com\baomidou\mybatis-plus-core\3.1.1\mybatis-plus-core-3.1.1.jar;D:\repository\com\baomidou\mybatis-plus-annotation\3.1.1\mybatis-plus-annotation-3.1.1.jar;D:\repository\com\github\jsqlparser\jsqlparser\1.2\jsqlparser-1.2.jar;D:\repository\org\mybatis\mybatis\3.5.1\mybatis-3.5.1.jar;D:\repository\org\mybatis\mybatis-spring\2.0.1\mybatis-spring-2.0.1.jar;D:\repository\org\springframework\boot\spring-boot-autoconfigure\2.1.6.RELEASE\spring-boot-autoconfigure-2.1.6.RELEASE.jar;D:\repository\log4j\log4j\1.2.17\log4j-1.2.17.jar;D:\repository\mysql\mysql-connector-java\6.0.6\mysql-connector-java-6.0.6.jar;D:\repository\com\alibaba\boot\dubbo-spring-boot-starter\0.2.0\dubbo-spring-boot-starter-0.2.0.jar;D:\repository\com\alibaba\dubbo\2.6.2\dubbo-2.6.2.jar;D:\repository\org\javassist\javassist\3.20.0-GA\javassist-3.20.0-GA.jar;D:\repository\org\jboss\netty\netty\3.2.5.Final\netty-3.2.5.Final.jar;D:\repository\org\apache\zookeeper\zookeeper\3.4.9\zookeeper-3.4.9.jar;D:\repository\jline\jline\0.9.94\jline-0.9.94.jar;D:\repository\io\netty\netty\3.10.5.Final\netty-3.10.5.Final.jar;D:\repository\org\apache\curator\curator-framework\2.12.0\curator-framework-2.12.0.jar;D:\repository\org\apache\curator\curator-client\2.12.0\curator-client-2.12.0.jar;D:\repository\com\alibaba\boot\dubbo-spring-boot-autoconfigure\0.2.0\dubbo-spring-boot-autoconfigure-0.2.0.jar;D:\repository\com\alibaba\boot\dubbo-spring-boot-actuator\0.2.0\dubbo-spring-boot-actuator-0.2.0.jar;D:\repository\com\netflix\hystrix\hystrix-core\1.5.12\hystrix-core-1.5.12.jar;D:\repository\org\slf4j\slf4j-api\1.7.26\slf4j-api-1.7.26.jar;D:\repository\com\netflix\archaius\archaius-core\0.4.1\archaius-core-0.4.1.jar;D:\repository\commons-configuration\commons-configuration\1.8\commons-configuration-1.8.jar;D:\repository\commons-lang\commons-lang\2.6\commons-lang-2.6.jar;D:\repository\io\reactivex\rxjava\1.3.8\rxjava-1.3.8.jar;D:\repository\org\hdrhistogram\HdrHistogram\2.1.9\HdrHistogram-2.1.9.jar;D:\repository\com\netflix\hystrix\hystrix-metrics-event-stream\1.5.12\hystrix-metrics-event-stream-1.5.12.jar;D:\repository\com\netflix\hystrix\hystrix-serialization\1.5.12\hystrix-serialization-1.5.12.jar;D:\repository\com\fasterxml\jackson\module\jackson-module-afterburner\2.9.9\jackson-module-afterburner-2.9.9.jar;D:\repository\com\fasterxml\jackson\core\jackson-core\2.9.9\jackson-core-2.9.9.jar;D:\repository\com\fasterxml\jackson\core\jackson-annotations\2.9.0\jackson-annotations-2.9.0.jar;D:\repository\com\netflix\hystrix\hystrix-javanica\1.5.12\hystrix-javanica-1.5.12.jar;D:\repository\org\aspectj\aspectjrt\1.9.4\aspectjrt-1.9.4.jar;D:\repository\org\apache\commons\commons-lang3\3.3.1\commons-lang3-3.3.1.jar;D:\repository\org\ow2\asm\asm\5.0.4\asm-5.0.4.jar;D:\repository\org\aspectj\aspectjweaver\1.9.4\aspectjweaver-1.9.4.jar;D:\repository\com\google\guava\guava\15.0\guava-15.0.jar;D:\repository\com\google\code\findbugs\jsr305\2.0.0\jsr305-2.0.0.jar;D:\repository\org\apache\rocketmq\rocketmq-client\4.3.0\rocketmq-client-4.3.0.jar;D:\repository\org\apache\rocketmq\rocketmq-common\4.3.0\rocketmq-common-4.3.0.jar;D:\repository\org\apache\rocketmq\rocketmq-remoting\4.3.0\rocketmq-remoting-4.3.0.jar;D:\repository\com\alibaba\fastjson\1.2.29\fastjson-1.2.29.jar;D:\repository\io\netty\netty-all\4.1.36.Final\netty-all-4.1.36.Final.jar;D:\repository\org\apache\rocketmq\rocketmq-logging\4.3.0\rocketmq-logging-4.3.0.jar;D:\repository\io\netty\netty-tcnative-boringssl-static\2.0.25.Final\netty-tcnative-boringssl-static-2.0.25.Final.jar;D:\repository\com\zys\zys-store-api\0.0.1-SNAPSHOT\zys-store-api-0.0.1-SNAPSHOT.jar;D:\repository\org\springframework\boot\spring-boot-starter\2.1.6.RELEASE\spring-boot-starter-2.1.6.RELEASE.jar;D:\repository\org\springframework\boot\spring-boot\2.1.6.RELEASE\spring-boot-2.1.6.RELEASE.jar;D:\repository\org\springframework\boot\spring-boot-starter-logging\2.1.6.RELEASE\spring-boot-starter-logging-2.1.6.RELEASE.jar;D:\repository\ch\qos\logback\logback-classic\1.2.3\logback-classic-1.2.3.jar;D:\repository\ch\qos\logback\logback-core\1.2.3\logback-core-1.2.3.jar;D:\repository\org\apache\logging\log4j\log4j-to-slf4j\2.11.2\log4j-to-slf4j-2.11.2.jar;D:\repository\org\apache\logging\log4j\log4j-api\2.11.2\log4j-api-2.11.2.jar;D:\repository\org\slf4j\jul-to-slf4j\1.7.26\jul-to-slf4j-1.7.26.jar;D:\repository\javax\annotation\javax.annotation-api\1.3.2\javax.annotation-api-1.3.2.jar;D:\repository\org\yaml\snakeyaml\1.23\snakeyaml-1.23.jar;D:\idea\IntelliJ IDEA 2019.2\lib\idea_rt.jar 2019-11-20 10:18:58.930 INFO 48096 --- [ main] org.apache.zookeeper.ZooKeeper : Client environment:java.library.path=C:\Program Files\Java\jdk1.8.0_211\bin;C:\Windows\Sun\Java\bin;C:\Windows\system32;C:\Windows;D:\idea\IntelliJ IDEA 2019.2\jbr\\bin;D:\idea\IntelliJ IDEA 2019.2\jbr\\bin\server;D:\oracleClient\product\11.2.0\client_1\bin;D:\xshell\;C:\Program Files (x86)\Common Files\Oracle\Java\javapath;C:\Windows\system32;C:\Windows;C:\Windows\System32\Wbem;C:\Windows\System32\WindowsPowerShell\v1.0\;C:\Windows\System32\OpenSSH\;C:\Program Files\Java\jdk1.8.0_211;D:\Git\cmd;C:\Program Files\MySQL\MySQL Server 5.7\bin;D:\TortoiseSVN1.10\bin;D:\apache-maven-idea\bin;C:\Users\Administrator\AppData\Local\Microsoft\WindowsApps;;. 2019-11-20 10:18:58.931 INFO 48096 --- [ main] org.apache.zookeeper.ZooKeeper : Client environment:java.io.tmpdir=C:\Users\ADMINI~1\AppData\Local\Temp\ 2019-11-20 10:18:58.931 INFO 48096 --- [ main] org.apache.zookeeper.ZooKeeper : Client environment:java.compiler=<NA> 2019-11-20 10:18:58.931 INFO 48096 --- [ main] org.apache.zookeeper.ZooKeeper : Client environment:os.name=Windows 10 2019-11-20 10:18:58.931 INFO 48096 --- [ main] org.apache.zookeeper.ZooKeeper : Client environment:os.arch=amd64 2019-11-20 10:18:58.931 INFO 48096 --- [ main] org.apache.zookeeper.ZooKeeper : Client environment:os.version=10.0 2019-11-20 10:18:58.931 INFO 48096 --- [ main] org.apache.zookeeper.ZooKeeper : Client environment:user.name=Administrator 2019-11-20 10:18:58.931 INFO 48096 --- [ main] org.apache.zookeeper.ZooKeeper : Client environment:user.home=C:\Users\Administrator 2019-11-20 10:18:58.931 INFO 48096 --- [ main] org.apache.zookeeper.ZooKeeper : Client environment:user.dir=D:\ideaworkspace\zys-project 2019-11-20 10:18:58.932 INFO 48096 --- [ main] org.apache.zookeeper.ZooKeeper : Initiating client connection, connectString=192.168.146.132:2181,192.168.146.131:2181,192.168.146.133:2181 sessionTimeout=60000 watcher=org.apache.curator.ConnectionState@5a3a1bf9 2019-11-20 10:18:58.942 INFO 48096 --- [8.146.132:2181)] org.apache.zookeeper.ClientCnxn : Opening socket connection to server 192.168.146.132/192.168.146.132:2181. Will not attempt to authenticate using SASL (unknown error) 2019-11-20 10:18:58.942 INFO 48096 --- [8.146.132:2181)] org.apache.zookeeper.ClientCnxn : Socket connection established to 192.168.146.132/192.168.146.132:2181, initiating session 2019-11-20 10:18:58.953 INFO 48096 --- [8.146.132:2181)] org.apache.zookeeper.ClientCnxn : Session establishment complete on server 192.168.146.132/192.168.146.132:2181, sessionid = 0x200000235350000, negotiated timeout = 40000 2019-11-20 10:18:58.957 INFO 48096 --- [ain-EventThread] o.a.c.f.state.ConnectionStateManager : State change: CONNECTED 2019-11-20 10:18:59.030 INFO 48096 --- [ main] c.a.d.c.s.b.f.a.ReferenceBeanBuilder : <dubbo:reference object="com.alibaba.dubbo.common.bytecode.proxy0@3b5c665c" singleton="true" interface="com.zys.store.service.api.HelloServiceApi" uniqueServiceName="com.zys.store.service.api.HelloServiceApi:1.0.0" generic="false" version="1.0.0" check="false" timeout="3000" id="com.zys.store.service.api.HelloServiceApi" /> has been built. 2019-11-20 10:18:59.242 INFO 48096 --- [ main] o.s.s.concurrent.ThreadPoolTaskExecutor : Initializing ExecutorService 'applicationTaskExecutor' 2019-11-20 10:18:59.420 INFO 48096 --- [ main] com.zaxxer.hikari.HikariDataSource : MyHikariCP - Starting... 2019-11-20 10:18:59.592 INFO 48096 --- [ main] com.zaxxer.hikari.HikariDataSource : MyHikariCP - Start completed. _ _ |_ _ _|_. ___ _ | _ | | |\/|_)(_| | |_\ |_)||_|_\ / | 3.1.1 2019-11-20 10:18:59.836 INFO 48096 --- [ main] o.s.b.a.e.web.EndpointLinksResolver : Exposing 2 endpoint(s) beneath base path '/actuator' 2019-11-20 10:18:59.897 INFO 48096 --- [ main] o.s.b.w.embedded.tomcat.TomcatWebServer : Tomcat started on port(s): 8088 (http) with context path '' 2019-11-20 10:18:59.899 INFO 48096 --- [ main] com.zys.order.ZysOrderApplication : Started ZysOrderApplication in 12.907 seconds (JVM running for 13.464) 2019-11-20 10:18:59.956 INFO 48096 --- [-192.168.255.54] o.a.c.c.C.[Tomcat].[localhost].[/] : Initializing Spring DispatcherServlet 'dispatcherServlet' 2019-11-20 10:18:59.956 INFO 48096 --- [-192.168.255.54] o.s.web.servlet.DispatcherServlet : Initializing Servlet 'dispatcherServlet' 2019-11-20 10:18:59.969 INFO 48096 --- [-192.168.255.54] o.s.web.servlet.DispatcherServlet : Completed initialization in 13 ms ```
Spark1.3基于scala2.11编译hive-thrift报错,关于jline的
[INFO] [INFO] ------------------------------------------------------------------------ [INFO] Building Spark Project Hive Thrift Server 1.3.0 [INFO] ------------------------------------------------------------------------ [INFO] [INFO] --- maven-clean-plugin:2.5:clean (default-clean) @ spark-hive-thriftserver_2.11 --- [INFO] Deleting /usr/local/spark-1.3.0/sql/hive-thriftserver/target [INFO] [INFO] --- maven-enforcer-plugin:1.3.1:enforce (enforce-versions) @ spark-hive-thriftserver_2.11 --- [INFO] [INFO] --- scala-maven-plugin:3.2.0:add-source (eclipse-add-source) @ spark-hive-thriftserver_2.11 --- [INFO] Add Source directory: /usr/local/spark-1.3.0/sql/hive-thriftserver/src/main/scala [INFO] Add Test Source directory: /usr/local/spark-1.3.0/sql/hive-thriftserver/src/test/scala [INFO] [INFO] --- build-helper-maven-plugin:1.8:add-source (add-scala-sources) @ spark-hive-thriftserver_2.11 --- [INFO] Source directory: /usr/local/spark-1.3.0/sql/hive-thriftserver/src/main/scala added. [INFO] [INFO] --- build-helper-maven-plugin:1.8:add-source (add-default-sources) @ spark-hive-thriftserver_2.11 --- [INFO] Source directory: /usr/local/spark-1.3.0/sql/hive-thriftserver/v0.13.1/src/main/scala added. [INFO] [INFO] --- maven-remote-resources-plugin:1.5:process (default) @ spark-hive-thriftserver_2.11 --- [INFO] [INFO] --- maven-resources-plugin:2.6:resources (default-resources) @ spark-hive-thriftserver_2.11 --- [INFO] Using 'UTF-8' encoding to copy filtered resources. [INFO] skip non existing resourceDirectory /usr/local/spark-1.3.0/sql/hive-thriftserver/src/main/resources [INFO] Copying 3 resources [INFO] [INFO] --- scala-maven-plugin:3.2.0:compile (scala-compile-first) @ spark-hive-thriftserver_2.11 --- [WARNING] Zinc server is not available at port 3030 - reverting to normal incremental compile [INFO] Using incremental compilation [INFO] compiler plugin: BasicArtifact(org.scalamacros,paradise_2.11.2,2.0.1,null) [INFO] Compiling 9 Scala sources to /usr/local/spark-1.3.0/sql/hive-thriftserver/target/scala-2.11/classes... [ERROR] /usr/local/spark-1.3.0/sql/hive-thriftserver/src/main/scala/org/apache/spark/sql/hive/thriftserver/SparkSQLCLIDriver.scala:25: object ConsoleReader is not a member of package jline [ERROR] import jline.{ConsoleReader, History} [ERROR] ^ [WARNING] Class jline.Completor not found - continuing with a stub. [WARNING] Class jline.ConsoleReader not found - continuing with a stub. [ERROR] /usr/local/spark-1.3.0/sql/hive-thriftserver/src/main/scala/org/apache/spark/sql/hive/thriftserver/SparkSQLCLIDriver.scala:165: not found: type ConsoleReader [ERROR] val reader = new ConsoleReader() [ERROR] ^ [ERROR] Class jline.Completor not found - continuing with a stub. [WARNING] Class com.google.protobuf.Parser not found - continuing with a stub. [WARNING] Class com.google.protobuf.Parser not found - continuing with a stub. [WARNING] Class com.google.protobuf.Parser not found - continuing with a stub. [WARNING] Class com.google.protobuf.Parser not found - continuing with a stub. [WARNING] 6 warnings found [ERROR] three errors found [INFO] ------------------------------------------------------------------------ [INFO] Reactor Summary: [INFO] [INFO] Spark Project Parent POM ........................... SUCCESS [01:20 min] [INFO] Spark Project Networking ........................... SUCCESS [01:31 min] [INFO] Spark Project Shuffle Streaming Service ............ SUCCESS [ 47.808 s] [INFO] Spark Project Core ................................. SUCCESS [34:00 min] [INFO] Spark Project Bagel ................................ SUCCESS [03:21 min] [INFO] Spark Project GraphX ............................... SUCCESS [09:22 min] [INFO] Spark Project Streaming ............................ SUCCESS [15:07 min] [INFO] Spark Project Catalyst ............................. SUCCESS [14:35 min] [INFO] Spark Project SQL .................................. SUCCESS [16:31 min] [INFO] Spark Project ML Library ........................... SUCCESS [18:15 min] [INFO] Spark Project Tools ................................ SUCCESS [01:50 min] [INFO] Spark Project Hive ................................. SUCCESS [13:58 min] [INFO] Spark Project REPL ................................. SUCCESS [06:13 min] [INFO] Spark Project YARN ................................. SUCCESS [07:05 min] [INFO] Spark Project Hive Thrift Server ................... FAILURE [01:39 min] [INFO] Spark Project Assembly ............................. SKIPPED [INFO] Spark Project External Twitter ..................... SKIPPED [INFO] Spark Project External Flume Sink .................. SKIPPED [INFO] Spark Project External Flume ....................... SKIPPED [INFO] Spark Project External MQTT ........................ SKIPPED [INFO] Spark Project External ZeroMQ ...................... SKIPPED [INFO] Spark Project Examples ............................. SKIPPED [INFO] Spark Project YARN Shuffle Service ................. SKIPPED [INFO] ------------------------------------------------------------------------ [INFO] BUILD FAILURE [INFO] ------------------------------------------------------------------------ [INFO] Total time: 02:25 h [INFO] Finished at: 2015-04-16T14:11:24+08:00 [INFO] Final Memory: 62M/362M [INFO] ------------------------------------------------------------------------ [WARNING] The requested profile "hadoop-2.5" could not be activated because it does not exist. [ERROR] Failed to execute goal net.alchim31.maven:scala-maven-plugin:3.2.0:compile (scala-compile-first) on project spark-hive-thriftserver_2.11: Execution scala-compile-first of goal net.alchim31.maven:scala-maven-plugin:3.2.0:compile failed. CompileFailed -> [Help 1] [ERROR] [ERROR] To see the full stack trace of the errors, re-run Maven with the -e switch. [ERROR] Re-run Maven using the -X switch to enable full debug logging. [ERROR] [ERROR] For more information about the errors and possible solutions, please read the following articles: [ERROR] [Help 1] http://cwiki.apache.org/confluence/display/MAVEN/PluginExecutionException [ERROR] [ERROR] After correcting the problems, you can resume the build with the command [ERROR] mvn <goals> -rf :spark-hive-thriftserver_2.11
pom.xml 头部几行出现这样的提示问题求解
Failure to transfer org.apache.maven.plugins:maven-resources-plugin:pom:2.6 from http://repo.maven.apache.org/maven2 was cached in the local repository, resolution will not be reattempted until the update interval of central has elapsed or updates are forced. Original error: Could not transfer artifact org.apache.maven.plugins:maven-resources-plugin:pom: 2.6 from/to central (http://repo.maven.apache.org/maven2): The operation was cancelled. Maven没什么配置,maven-resources-plugin插件在本地也有 ![图片说明](https://img-ask.csdn.net/upload/201605/08/1462640995_891312.png) ![图片说明](https://img-ask.csdn.net/upload/201605/08/1462641007_856887.png)
为什么新建的springboot项目报错
新建的springboot web项目,一建出来pom.xml就报错 错误的地方是这里: × <parent> <groupId>org.springframework.boot</groupId> <artifactId>spring-boot-starter-parent</artifactId> <version>1.5.1.RELEASE</version> <relativePath/> <!-- lookup parent from repository --> </parent> 错误的信息是这样的: Multiple annotations found at this line: - Plugin execution not covered by lifecycle configuration: org.apache.maven.plugins:maven- resources-plugin:2.6:testResources (execution: default-testResources, phase: process-test-resources) - Plugin execution not covered by lifecycle configuration: org.apache.maven.plugins:maven- resources-plugin:2.6:resources (execution: default-resources, phase: process-resources) 试过网上搜一些信息但都没用,快崩溃了,请问怎么办呀?
项目启动没问题,运行试试报404,大神求救哇
[INFO] Scanning for projects... [INFO] ------------------------------------------------------------------------ [INFO] Reactor Build Order: [INFO] [INFO] taotao-manager [INFO] taotao-manager-pojo [INFO] taotao-manager-mapper [INFO] taotao-manager-service [INFO] taotao-manager-web [INFO] [INFO] ------------------------------------------------------------------------ [INFO] Building taotao-manager 0.0.1-SNAPSHOT [INFO] ------------------------------------------------------------------------ [INFO] [INFO] --- maven-clean-plugin:2.4.1:clean (default-clean) @ taotao-manager --- [INFO] [INFO] >>> tomcat-maven-plugin:1.1:run (default-cli) @ taotao-manager >>> [INFO] [INFO] <<< tomcat-maven-plugin:1.1:run (default-cli) @ taotao-manager <<< [INFO] [INFO] --- tomcat-maven-plugin:1.1:run (default-cli) @ taotao-manager --- [INFO] Skipping non-war project [INFO] [INFO] ------------------------------------------------------------------------ [INFO] Building taotao-manager-pojo 0.0.1-SNAPSHOT [INFO] ------------------------------------------------------------------------ [INFO] [INFO] --- maven-clean-plugin:2.4.1:clean (default-clean) @ taotao-manager-pojo --- [INFO] Deleting D:\Myeclipse\Myeclipse10\Work\taotao-manager\taotao-manager-pojo\target [INFO] [INFO] >>> tomcat-maven-plugin:1.1:run (default-cli) @ taotao-manager-pojo >>> [INFO] [INFO] --- maven-resources-plugin:2.7:resources (default-resources) @ taotao-manager-pojo --- [INFO] Using 'UTF-8' encoding to copy filtered resources. [INFO] Copying 0 resource [INFO] [INFO] --- maven-compiler-plugin:3.2:compile (default-compile) @ taotao-manager-pojo --- [INFO] Changes detected - recompiling the module! [INFO] Compiling 22 source files to D:\Myeclipse\Myeclipse10\Work\taotao-manager\taotao-manager-pojo\target\classes [INFO] [INFO] <<< tomcat-maven-plugin:1.1:run (default-cli) @ taotao-manager-pojo <<< [INFO] [INFO] --- tomcat-maven-plugin:1.1:run (default-cli) @ taotao-manager-pojo --- [INFO] Skipping non-war project [INFO] [INFO] ------------------------------------------------------------------------ [INFO] Building taotao-manager-mapper 0.0.1-SNAPSHOT [INFO] ------------------------------------------------------------------------ [INFO] [INFO] --- maven-clean-plugin:2.4.1:clean (default-clean) @ taotao-manager-mapper --- [INFO] Deleting D:\Myeclipse\Myeclipse10\Work\taotao-manager\taotao-manager-mapper\target [INFO] [INFO] >>> tomcat-maven-plugin:1.1:run (default-cli) @ taotao-manager-mapper >>> [INFO] [INFO] --- maven-resources-plugin:2.7:resources (default-resources) @ taotao-manager-mapper --- [INFO] Using 'UTF-8' encoding to copy filtered resources. [INFO] Copying 0 resource [INFO] [INFO] --- maven-compiler-plugin:3.2:compile (default-compile) @ taotao-manager-mapper --- [INFO] Changes detected - recompiling the module! [INFO] Compiling 11 source files to D:\Myeclipse\Myeclipse10\Work\taotao-manager\taotao-manager-mapper\target\classes [INFO] [INFO] <<< tomcat-maven-plugin:1.1:run (default-cli) @ taotao-manager-mapper <<< [INFO] [INFO] --- tomcat-maven-plugin:1.1:run (default-cli) @ taotao-manager-mapper --- [INFO] Skipping non-war project [INFO] [INFO] ------------------------------------------------------------------------ [INFO] Building taotao-manager-service 0.0.1-SNAPSHOT [INFO] ------------------------------------------------------------------------ [INFO] [INFO] --- maven-clean-plugin:2.4.1:clean (default-clean) @ taotao-manager-service --- [INFO] Deleting D:\Myeclipse\Myeclipse10\Work\taotao-manager\taotao-manager-service\target [INFO] [INFO] >>> tomcat-maven-plugin:1.1:run (default-cli) @ taotao-manager-service >>> [INFO] [INFO] --- maven-resources-plugin:2.7:resources (default-resources) @ taotao-manager-service --- [INFO] Using 'UTF-8' encoding to copy filtered resources. [INFO] Copying 0 resource [INFO] [INFO] --- maven-compiler-plugin:3.2:compile (default-compile) @ taotao-manager-service --- [INFO] Changes detected - recompiling the module! [INFO] Compiling 2 source files to D:\Myeclipse\Myeclipse10\Work\taotao-manager\taotao-manager-service\target\classes [INFO] [INFO] <<< tomcat-maven-plugin:1.1:run (default-cli) @ taotao-manager-service <<< [INFO] [INFO] --- tomcat-maven-plugin:1.1:run (default-cli) @ taotao-manager-service --- [INFO] Skipping non-war project [INFO] [INFO] ------------------------------------------------------------------------ [INFO] Building taotao-manager-web 0.0.1-SNAPSHOT [INFO] ------------------------------------------------------------------------ [INFO] [INFO] --- maven-clean-plugin:2.4.1:clean (default-clean) @ taotao-manager-web --- [INFO] Deleting D:\Myeclipse\Myeclipse10\Work\taotao-manager\taotao-manager-web\target [INFO] [INFO] >>> tomcat-maven-plugin:1.1:run (default-cli) @ taotao-manager-web >>> [INFO] [INFO] --- maven-resources-plugin:2.7:resources (default-resources) @ taotao-manager-web --- [INFO] Using 'UTF-8' encoding to copy filtered resources. [INFO] Copying 6 resources [INFO] [INFO] --- maven-compiler-plugin:3.2:compile (default-compile) @ taotao-manager-web --- [INFO] Changes detected - recompiling the module! [INFO] Compiling 1 source file to D:\Myeclipse\Myeclipse10\Work\taotao-manager\taotao-manager-web\target\classes [INFO] [INFO] <<< tomcat-maven-plugin:1.1:run (default-cli) @ taotao-manager-web <<< [INFO] [INFO] --- tomcat-maven-plugin:1.1:run (default-cli) @ taotao-manager-web --- [INFO] Running war on http://localhost:8080/taotao-manager-web [INFO] Creating Tomcat server configuration at D:\Myeclipse\Myeclipse10\Work\taotao-manager\taotao-manager-web\target\tomcat 九月 02, 2016 2:16:53 下午 org.apache.catalina.startup.Embedded start 信息: Starting tomcat server 九月 02, 2016 2:16:53 下午 org.apache.catalina.core.StandardEngine start 信息: Starting Servlet Engine: Apache Tomcat/6.0.29 九月 02, 2016 2:16:54 下午 org.apache.catalina.core.ApplicationContext log 信息: Initializing Spring root WebApplicationContext log4j:WARN No appenders could be found for logger (org.springframework.web.context.ContextLoader). log4j:WARN Please initialize the log4j system properly. log4j:WARN See http://logging.apache.org/log4j/1.2/faq.html#noconfig for more info. 九月 02, 2016 2:16:56 下午 org.apache.catalina.core.ApplicationContext log 信息: Initializing Spring FrameworkServlet 'taotao-manager' 九月 02, 2016 2:16:58 下午 org.apache.coyote.http11.Http11Protocol init 信息: Initializing Coyote HTTP/1.1 on http-8080 九月 02, 2016 2:16:58 下午 org.apache.coyote.http11.Http11Protocol start 信息: Starting Coyote HTTP/1.1 on http-8080
有知道这个问题怎么解决的吗?一直没有解决
[INFO] Scanning for projects... [WARNING] [WARNING] Some problems were encountered while building the effective model for com.sikiedu:MavenSSM2:war:0.0.1-SNAPSHOT [WARNING] 'build.plugins.plugin.(groupId:artifactId)' must be unique but found duplicate declaration of plugin org.apache.tomcat.maven:tomcat7-maven-plugin @ line 309, column 13 [WARNING] [WARNING] It is highly recommended to fix these problems because they threaten the stability of your build. [WARNING] [WARNING] For this reason, future Maven versions might no longer support building such malformed projects. [WARNING] [INFO] [INFO] -----------------------< com.sikiedu:MavenSSM2 >------------------------ [INFO] Building MavenSSM2 0.0.1-SNAPSHOT [INFO] --------------------------------[ war ]--------------------------------- [INFO] [INFO] --- maven-clean-plugin:2.5:clean (default-clean) @ MavenSSM2 --- [INFO] Deleting C:\Users\Mr.Li\Desktop\工作室\作业\Java\HelloMaven\target [INFO] [INFO] >>> tomcat7-maven-plugin:2.2:deploy (default-cli) > package @ MavenSSM2 >>> [WARNING] The POM for cn.easyproject:ojdbc7:jar:12.1.0.2.0 is invalid, transitive dependencies (if any) will not be available, enable debug logging for more details [WARNING] The POM for javax.servlet:jstl:jar:1.2 is invalid, transitive dependencies (if any) will not be available, enable debug logging for more details [WARNING] The POM for commons-fileupload:commons-fileupload:jar:1.3.1 is invalid, transitive dependencies (if any) will not be available, enable debug logging for more details [INFO] [INFO] --- maven-resources-plugin:2.6:resources (default-resources) @ MavenSSM2 --- [WARNING] Using platform encoding (UTF-8 actually) to copy filtered resources, i.e. build is platform dependent! [INFO] Copying 0 resource [INFO] Copying 5 resources [INFO] [INFO] --- maven-compiler-plugin:3.8.0:compile (default-compile) @ MavenSSM2 --- [INFO] Changes detected - recompiling the module! [WARNING] File encoding has not been set, using platform encoding UTF-8, i.e. build is platform dependent! [INFO] Compiling 8 source files to C:\Users\Mr.Li\Desktop\工作室\作业\Java\HelloMaven\target\classes [INFO] [INFO] --- maven-resources-plugin:2.6:testResources (default-testResources) @ MavenSSM2 --- [WARNING] Using platform encoding (UTF-8 actually) to copy filtered resources, i.e. build is platform dependent! [INFO] Copying 0 resource [INFO] [INFO] --- maven-compiler-plugin:3.8.0:testCompile (default-testCompile) @ MavenSSM2 --- [INFO] Nothing to compile - all classes are up to date [INFO] [INFO] --- maven-surefire-plugin:2.12.4:test (default-test) @ MavenSSM2 --- [INFO] [INFO] --- maven-war-plugin:2.2:war (default-war) @ MavenSSM2 --- [INFO] Packaging webapp [INFO] Assembling webapp [MavenSSM2] in [C:\Users\Mr.Li\Desktop\工作室\作业\Java\HelloMaven\target\MavenSSM2-0.0.1-SNAPSHOT] [INFO] Processing war project [INFO] Copying webapp resources [C:\Users\Mr.Li\Desktop\工作室\作业\Java\HelloMaven\src\main\webapp] [INFO] Webapp assembled in [216 msecs] [INFO] Building war: C:\Users\Mr.Li\Desktop\工作室\作业\Java\HelloMaven\target\MavenSSM2-0.0.1-SNAPSHOT.war [INFO] WEB-INF\web.xml already added, skipping [INFO] [INFO] <<< tomcat7-maven-plugin:2.2:deploy (default-cli) < package @ MavenSSM2 <<< [INFO] [INFO] [INFO] --- tomcat7-maven-plugin:2.2:deploy (default-cli) @ MavenSSM2 --- [INFO] Deploying war to http://localhost:8080/MavenSSM2 [INFO] ------------------------------------------------------------------------ [INFO] BUILD FAILURE [INFO] ------------------------------------------------------------------------ [INFO] Total time: 8.940 s [INFO] Finished at: 2019-07-29T15:56:55+08:00 [INFO] ------------------------------------------------------------------------ [ERROR] Failed to execute goal org.apache.tomcat.maven:tomcat7-maven-plugin:2.2:deploy (default-cli) on project MavenSSM2: Cannot invoke Tomcat manager: Connection refused: connect -> [Help 1] [ERROR] [ERROR] To see the full stack trace of the errors, re-run Maven with the -e switch. [ERROR] Re-run Maven using the -X switch to enable full debug logging. [ERROR] [ERROR] For more information about the errors and possible solutions, please read the following articles: [ERROR] [Help 1] http://cwiki.apache.org/confluence/display/MAVEN/MojoExecutionException
tomcat启动成功但是localhost8080访问不了
[INFO] Scanning for projects... [INFO] ------------------------------------------------------------------------ [INFO] Reactor Build Order: [INFO] [INFO] taotao-manager [INFO] taotao-manager-pojo [INFO] taotao-manager-mapper [INFO] taotao-manager-service [INFO] taotao-manager-web [INFO] [INFO] ------------------------------------------------------------------------ [INFO] Building taotao-manager 0.0.1-SNAPSHOT [INFO] ------------------------------------------------------------------------ [INFO] [INFO] >>> tomcat7-maven-plugin:2.2:run (default-cli) > process-classes @ taotao-manager >>> [INFO] [INFO] <<< tomcat7-maven-plugin:2.2:run (default-cli) < process-classes @ taotao-manager <<< [INFO] [INFO] --- tomcat7-maven-plugin:2.2:run (default-cli) @ taotao-manager --- [INFO] Skipping non-war project [INFO] [INFO] ------------------------------------------------------------------------ [INFO] Building taotao-manager-pojo 0.0.1-SNAPSHOT [INFO] ------------------------------------------------------------------------ [INFO] [INFO] >>> tomcat7-maven-plugin:2.2:run (default-cli) > process-classes @ taotao-manager-pojo >>> [INFO] [INFO] --- maven-resources-plugin:2.7:resources (default-resources) @ taotao-manager-pojo --- [INFO] Using 'UTF-8' encoding to copy filtered resources. [INFO] Copying 0 resource [INFO] [INFO] --- maven-compiler-plugin:3.2:compile (default-compile) @ taotao-manager-pojo --- [INFO] Nothing to compile - all classes are up to date [INFO] [INFO] <<< tomcat7-maven-plugin:2.2:run (default-cli) < process-classes @ taotao-manager-pojo <<< [INFO] [INFO] --- tomcat7-maven-plugin:2.2:run (default-cli) @ taotao-manager-pojo --- [INFO] Skipping non-war project [INFO] [INFO] ------------------------------------------------------------------------ [INFO] Building taotao-manager-mapper 0.0.1-SNAPSHOT [INFO] ------------------------------------------------------------------------ [INFO] [INFO] >>> tomcat7-maven-plugin:2.2:run (default-cli) > process-classes @ taotao-manager-mapper >>> [INFO] [INFO] --- maven-resources-plugin:2.7:resources (default-resources) @ taotao-manager-mapper --- [INFO] Using 'UTF-8' encoding to copy filtered resources. [INFO] Copying 11 resources [INFO] [INFO] --- maven-compiler-plugin:3.2:compile (default-compile) @ taotao-manager-mapper --- [INFO] Nothing to compile - all classes are up to date [INFO] [INFO] <<< tomcat7-maven-plugin:2.2:run (default-cli) < process-classes @ taotao-manager-mapper <<< [INFO] [INFO] --- tomcat7-maven-plugin:2.2:run (default-cli) @ taotao-manager-mapper --- [INFO] Skipping non-war project [INFO] [INFO] ------------------------------------------------------------------------ [INFO] Building taotao-manager-service 0.0.1-SNAPSHOT [INFO] ------------------------------------------------------------------------ [INFO] [INFO] >>> tomcat7-maven-plugin:2.2:run (default-cli) > process-classes @ taotao-manager-service >>> [INFO] [INFO] --- maven-resources-plugin:2.7:resources (default-resources) @ taotao-manager-service --- [INFO] Using 'UTF-8' encoding to copy filtered resources. [INFO] Copying 0 resource [INFO] [INFO] --- maven-compiler-plugin:3.2:compile (default-compile) @ taotao-manager-service --- [INFO] Nothing to compile - all classes are up to date [INFO] [INFO] <<< tomcat7-maven-plugin:2.2:run (default-cli) < process-classes @ taotao-manager-service <<< [INFO] [INFO] --- tomcat7-maven-plugin:2.2:run (default-cli) @ taotao-manager-service --- [INFO] Skipping non-war project [INFO] [INFO] ------------------------------------------------------------------------ [INFO] Building taotao-manager-web 0.0.1-SNAPSHOT [INFO] ------------------------------------------------------------------------ [INFO] [INFO] >>> tomcat7-maven-plugin:2.2:run (default-cli) > process-classes @ taotao-manager-web >>> [INFO] [INFO] --- maven-resources-plugin:2.7:resources (default-resources) @ taotao-manager-web --- [INFO] Using 'UTF-8' encoding to copy filtered resources. [INFO] Copying 6 resources [INFO] [INFO] --- maven-compiler-plugin:3.2:compile (default-compile) @ taotao-manager-web --- [INFO] Nothing to compile - all classes are up to date [INFO] [INFO] <<< tomcat7-maven-plugin:2.2:run (default-cli) < process-classes @ taotao-manager-web <<< [INFO] [INFO] --- tomcat7-maven-plugin:2.2:run (default-cli) @ taotao-manager-web --- [INFO] Running war on http://localhost:8080/ [INFO] Using existing Tomcat server configuration at D:\Users\Administrator\taotao\workspace\taotao-manager\taotao-manager-web\target\tomcat [INFO] create webapp with contextPath: 七月 08, 2016 2:26:09 下午 org.apache.coyote.AbstractProtocol init 信息: Initializing ProtocolHandler ["http-bio-8080"] 七月 08, 2016 2:26:09 下午 org.apache.catalina.core.StandardService startInternal 信息: Starting service Tomcat 七月 08, 2016 2:26:09 下午 org.apache.catalina.core.StandardEngine startInternal 信息: Starting Servlet Engine: Apache Tomcat/7.0.47 七月 08, 2016 2:26:16 下午 org.apache.catalina.core.ApplicationContext log 信息: No Spring WebApplicationInitializer types detected on classpath 七月 08, 2016 2:26:17 下午 org.apache.catalina.core.ApplicationContext log 信息: Initializing Spring root WebApplicationContext log4j:WARN No appenders could be found for logger (org.springframework.web.context.ContextLoader). log4j:WARN Please initialize the log4j system properly. log4j:WARN See http://logging.apache.org/log4j/1.2/faq.html#noconfig for more info.
终于明白阿里百度这样的大公司,为什么面试经常拿ThreadLocal考验求职者了
点击上面↑「爱开发」关注我们每晚10点,捕获技术思考和创业资源洞察什么是ThreadLocalThreadLocal是一个本地线程副本变量工具类,各个线程都拥有一份线程私有的数
程序员必须掌握的核心算法有哪些?
由于我之前一直强调数据结构以及算法学习的重要性,所以就有一些读者经常问我,数据结构与算法应该要学习到哪个程度呢?,说实话,这个问题我不知道要怎么回答你,主要取决于你想学习到哪些程度,不过针对这个问题,我稍微总结一下我学过的算法知识点,以及我觉得值得学习的算法。这些算法与数据结构的学习大多数是零散的,并没有一本把他们全部覆盖的书籍。下面是我觉得值得学习的一些算法以及数据结构,当然,我也会整理一些看过
《奇巧淫技》系列-python!!每天早上八点自动发送天气预报邮件到QQ邮箱
此博客仅为我业余记录文章所用,发布到此,仅供网友阅读参考,如有侵权,请通知我,我会删掉。 补充 有不少读者留言说本文章没有用,因为天气预报直接打开手机就可以收到了,为何要多此一举发送到邮箱呢!!!那我在这里只能说:因为你没用,所以你没用!!! 这里主要介绍的是思路,不是天气预报!不是天气预报!!不是天气预报!!!天气预报只是用于举例。请各位不要再刚了!!! 下面是我会用到的两个场景: 每日下
死磕YOLO系列,YOLOv1 的大脑、躯干和手脚
YOLO 是我非常喜欢的目标检测算法,堪称工业级的目标检测,能够达到实时的要求,它帮我解决了许多实际问题。 这就是 YOLO 的目标检测效果。它定位了图像中物体的位置,当然,也能预测物体的类别。 之前我有写博文介绍过它,但是每次重新读它的论文,我都有新的收获,为此我准备写一个系列的文章来详尽分析它。这是第一篇,从它的起始 YOLOv1 讲起。 YOLOv1 的论文地址:https://www.c
知乎高赞:中国有什么拿得出手的开源软件产品?(整理自本人原创回答)
知乎高赞:中国有什么拿得出手的开源软件产品? 在知乎上,有个问题问“中国有什么拿得出手的开源软件产品(在 GitHub 等社区受欢迎度较好的)?” 事实上,还不少呢~ 本人于2019.7.6进行了较为全面的 回答 - Bravo Yeung,获得该问题下回答中得最高赞(236赞和1枚专业勋章),对这些受欢迎的 Github 开源项目分类整理如下: 分布式计算、云平台相关工具类 1.SkyWalk
20行Python代码爬取王者荣耀全英雄皮肤
引言 王者荣耀大家都玩过吧,没玩过的也应该听说过,作为时下最火的手机MOBA游戏,咳咳,好像跑题了。我们今天的重点是爬取王者荣耀所有英雄的所有皮肤,而且仅仅使用20行Python代码即可完成。 准备工作 爬取皮肤本身并不难,难点在于分析,我们首先得得到皮肤图片的url地址,话不多说,我们马上来到王者荣耀的官网: 我们点击英雄资料,然后随意地选择一位英雄,接着F12打开调试台,找到英雄原皮肤的图片
简明易理解的@SpringBootApplication注解源码解析(包含面试提问)
欢迎关注文章系列 ,关注我 《提升能力,涨薪可待》 《面试知识,工作可待》 《实战演练,拒绝996》 欢迎关注我博客,原创技术文章第一时间推出 也欢迎关注公 众 号【Ccww笔记】,同时推出 如果此文对你有帮助、喜欢的话,那就点个赞呗,点个关注呗! 《提升能力,涨薪可待篇》- @SpringBootApplication注解源码解析 一、@SpringBootApplication 的作用是什
西游记团队中如果需要裁掉一个人,会先裁掉谁?
2019年互联网寒冬,大批企业开始裁员,下图是网上流传的一张截图: 裁员不可避免,那如何才能做到不管大环境如何变化,自身不受影响呢? 我们先来看一个有意思的故事,如果西游记取经团队需要裁员一名,会裁掉谁呢,为什么? 西游记团队组成: 1.唐僧 作为团队teamleader,有很坚韧的品性和极高的原则性,不达目的不罢休,遇到任何问题,都没有退缩过,又很得上司支持和赏识(直接得到唐太宗的任命,既给
Python语言高频重点汇总
Python语言高频重点汇总 GitHub面试宝典仓库——点这里跳转 文章目录Python语言高频重点汇总**GitHub面试宝典仓库——点这里跳转**1. 函数-传参2. 元类3. @staticmethod和@classmethod两个装饰器4. 类属性和实例属性5. Python的自省6. 列表、集合、字典推导式7. Python中单下划线和双下划线8. 格式化字符串中的%和format9.
究竟你适不适合买Mac?
我清晰的记得,刚买的macbook pro回到家,开机后第一件事情,就是上了淘宝网,花了500元钱,找了一个上门维修电脑的师傅,上门给我装了一个windows系统。。。。。。 表砍我。。。 当时买mac的初衷,只是想要个固态硬盘的笔记本,用来运行一些复杂的扑克软件。而看了当时所有的SSD笔记本后,最终决定,还是买个好(xiong)看(da)的。 已经有好几个朋友问我mba怎么样了,所以今天尽量客观
程序员一般通过什么途径接私活?
二哥,你好,我想知道一般程序猿都如何接私活,我也想接,能告诉我一些方法吗? 上面是一个读者“烦不烦”问我的一个问题。其实不止是“烦不烦”,还有很多读者问过我类似这样的问题。 我接的私活不算多,挣到的钱也没有多少,加起来不到 20W。说实话,这个数目说出来我是有点心虚的,毕竟太少了,大家轻喷。但我想,恰好配得上“一般程序员”这个称号啊。毕竟苍蝇再小也是肉,我也算是有经验的人了。 唾弃接私活、做外
ES6基础-ES6的扩展
进行对字符串扩展,正则扩展,数值扩展,函数扩展,对象扩展,数组扩展。 开发环境准备: 编辑器(VS Code, Atom,Sublime)或者IDE(Webstorm) 浏览器最新的Chrome 字符串的扩展: 模板字符串,部分新的方法,新的unicode表示和遍历方法: 部分新的字符串方法 padStart,padEnd,repeat,startsWith,endsWith,includes 字
Python爬虫爬取淘宝,京东商品信息
小编是一个理科生,不善长说一些废话。简单介绍下原理然后直接上代码。 使用的工具(Python+pycharm2019.3+selenium+xpath+chromedriver)其中要使用pycharm也可以私聊我selenium是一个框架可以通过pip下载 pip install selenium -i https://pypi.tuna.tsinghua.edu.cn/simple/ 
阿里程序员写了一个新手都写不出的低级bug,被骂惨了。
你知道的越多,你不知道的越多 点赞再看,养成习惯 本文 GitHub https://github.com/JavaFamily 已收录,有一线大厂面试点思维导图,也整理了很多我的文档,欢迎Star和完善,大家面试可以参照考点复习,希望我们一起有点东西。 前前言 为啥今天有个前前言呢? 因为你们的丙丙啊,昨天有牌面了哟,直接被微信官方推荐,知乎推荐,也就仅仅是还行吧(心里乐开花)
Java工作4年来应聘要16K最后没要,细节如下。。。
前奏: 今天2B哥和大家分享一位前几天面试的一位应聘者,工作4年26岁,统招本科。 以下就是他的简历和面试情况。 基本情况: 专业技能: 1、&nbsp;熟悉Sping了解SpringMVC、SpringBoot、Mybatis等框架、了解SpringCloud微服务 2、&nbsp;熟悉常用项目管理工具:SVN、GIT、MAVEN、Jenkins 3、&nbsp;熟悉Nginx、tomca
Python爬虫精简步骤1 获取数据
爬虫的工作分为四步: 1.获取数据。爬虫程序会根据我们提供的网址,向服务器发起请求,然后返回数据。 2.解析数据。爬虫程序会把服务器返回的数据解析成我们能读懂的格式。 3.提取数据。爬虫程序再从中提取出我们需要的数据。 4.储存数据。爬虫程序把这些有用的数据保存起来,便于你日后的使用和分析。 这一篇的内容就是:获取数据。 首先,我们将会利用一个强大的库——requests来获取数据。 在电脑上安装
作为一个程序员,CPU的这些硬核知识你必须会!
CPU对每个程序员来说,是个既熟悉又陌生的东西? 如果你只知道CPU是中央处理器的话,那可能对你并没有什么用,那么作为程序员的我们,必须要搞懂的就是CPU这家伙是如何运行的,尤其要搞懂它里面的寄存器是怎么一回事,因为这将让你从底层明白程序的运行机制。 随我一起,来好好认识下CPU这货吧 把CPU掰开来看 对于CPU来说,我们首先就要搞明白它是怎么回事,也就是它的内部构造,当然,CPU那么牛的一个东
破14亿,Python分析我国存在哪些人口危机!
2020年1月17日,国家统计局发布了2019年国民经济报告,报告中指出我国人口突破14亿。 猪哥的朋友圈被14亿人口刷屏,但是很多人并没有看到我国复杂的人口问题:老龄化、男女比例失衡、生育率下降、人口红利下降等。 今天我们就来分析一下我们国家的人口数据吧! 更多有趣分析教程,扫描下方二维码关注vx公号「裸睡的猪」 即可查看! 一、背景 1.人口突破14亿 2020年1月17日,国家统计局发布
web前端javascript+jquery知识点总结
Javascript javascript 在前端网页中占有非常重要的地位,可以用于验证表单,制作特效等功能,它是一种描述语言,也是一种基于对象(Object)和事件驱动并具有安全性的脚本语言 ,语法同java类似,是一种解释性语言,边执行边解释。 JavaScript的组成: ECMAScipt 用于描述: 语法,变量和数据类型,运算符,逻辑控制语句,关键字保留字,对象。 浏览器对象模型(Br
Qt实践录:开篇
本系列文章介绍笔者的Qt实践之路。 背景 笔者首次接触 Qt 大约是十多年前,当时试用了 Qt ,觉得不如 MFC 好用。现在 Qt 的 API、文档等都比较完善,在年初决定重新拾起,正所谓技多不压身,将 Qt 当为一种谋生工具亦未尝不可。利用春节假期的集中时间,快速专攻一下。 本系列名为“Qt实践”,故不是教程,笔者对 Qt 的定位是“使用”,可以帮助快速编写日常的工具,如串口、网络等。所以不
在家远程办公效率低?那你一定要收好这个「在家办公」神器!
相信大家都已经收到国务院延长春节假期的消息,接下来,在家远程办公可能将会持续一段时间。 但是问题来了。远程办公不是人在电脑前就当坐班了,相反,对于沟通效率,文件协作,以及信息安全都有着极高的要求。有着非常多的挑战,比如: 1在异地互相不见面的会议上,如何提高沟通效率? 2文件之间的来往反馈如何做到及时性?如何保证信息安全? 3如何规划安排每天工作,以及如何进行成果验收? ......
作为一个程序员,内存和磁盘的这些事情,你不得不知道啊!!!
截止目前,我已经分享了如下几篇文章: 一个程序在计算机中是如何运行的?超级干货!!! 作为一个程序员,CPU的这些硬核知识你必须会! 作为一个程序员,内存的这些硬核知识你必须懂! 这些知识可以说是我们之前都不太重视的基础知识,可能大家在上大学的时候都学习过了,但是嘞,当时由于老师讲解的没那么有趣,又加上这些知识本身就比较枯燥,所以嘞,大家当初几乎等于没学。 再说啦,学习这些,也看不出来有什么用啊!
这个世界上人真的分三六九等,你信吗?
偶然间,在知乎上看到一个问题 一时间,勾起了我深深的回忆。 以前在厂里打过两次工,做过家教,干过辅导班,做过中介。零下几度的晚上,贴过广告,满脸、满手地长冻疮。   再回首那段岁月,虽然苦,但让我学会了坚持和忍耐。让我明白了,在这个世界上,无论环境多么的恶劣,只要心存希望,星星之火,亦可燎原。   下文是原回答,希望能对你能有所启发。   如果我说,这个世界上人真的分三六九等,
为什么听过很多道理,依然过不好这一生?
记录学习笔记是一个重要的习惯,不希望学习过的东西成为过眼云烟。做总结的同时也是一次复盘思考的过程。 本文是根据阅读得到 App上《万维钢·精英日课》部分文章后所做的一点笔记和思考。学习是一个系统的过程,思维模型的建立需要相对完整的学习和思考过程。以下观点是在碎片化阅读后总结的一点心得总结。
B 站上有哪些很好的学习资源?
哇说起B站,在小九眼里就是宝藏般的存在,放年假宅在家时一天刷6、7个小时不在话下,更别提今年的跨年晚会,我简直是跪着看完的!! 最早大家聚在在B站是为了追番,再后来我在上面刷欧美新歌和漂亮小姐姐的舞蹈视频,最近两年我和周围的朋友们已经把B站当作学习教室了,而且学习成本还免费,真是个励志的好平台ヽ(.◕ฺˇд ˇ◕ฺ;)ノ 下面我们就来盘点一下B站上优质的学习资源: 综合类 Oeasy: 综合
雷火神山直播超两亿,Web播放器事件监听是怎么实现的?
Web播放器解决了在手机浏览器和PC浏览器上播放音视频数据的问题,让视音频内容可以不依赖用户安装App,就能进行播放以及在社交平台进行传播。在视频业务大数据平台中,播放数据的统计分析非常重要,所以Web播放器在使用过程中,需要对其内部的数据进行收集并上报至服务端,此时,就需要对发生在其内部的一些播放行为进行事件监听。 那么Web播放器事件监听是怎么实现的呢? 01 监听事件明细表 名
3万字总结,Mysql优化之精髓
本文知识点较多,篇幅较长,请耐心学习 MySQL已经成为时下关系型数据库产品的中坚力量,备受互联网大厂的青睐,出门面试想进BAT,想拿高工资,不会点MySQL优化知识,拿offer的成功率会大大下降。 为什么要优化 系统的吞吐量瓶颈往往出现在数据库的访问速度上 随着应用程序的运行,数据库的中的数据会越来越多,处理时间会相应变慢 数据是存放在磁盘上的,读写速度无法和内存相比 如何优化 设计
一条链接即可让黑客跟踪你的位置! | Seeker工具使用
搬运自:冰崖的部落阁(icecliffsnet) 严正声明:本文仅限于技术讨论,严禁用于其他用途。 请遵守相对应法律规则,禁止用作违法途径,出事后果自负! 上次写的防社工文章里边提到的gps定位信息(如何防止自己被社工或人肉) 除了主动收集他人位置信息以外,我们还可以进行被动收集 (没有技术含量) Seeker作为一款高精度地理位置跟踪工具,同时也是社交工程学(社会工程学)爱好者...
作为程序员的我,大学四年一直自学,全靠这些实用工具和学习网站!
我本人因为高中沉迷于爱情,导致学业荒废,后来高考,毫无疑问进入了一所普普通通的大学,实在惭愧...... 我又是那么好强,现在学历不行,没办法改变的事情了,所以,进入大学开始,我就下定决心,一定要让自己掌握更多的技能,尤其选择了计算机这个行业,一定要多学习技术。 在进入大学学习不久后,我就认清了一个现实:我这个大学的整体教学质量和学习风气,真的一言难尽,懂的人自然知道怎么回事? 怎么办?我该如何更好的提升
前端JS初级面试题二 (。•ˇ‸ˇ•。)老铁们!快来瞧瞧自己都会了么
1. 传统事件绑定和符合W3C标准的事件绑定有什么区别? 传统事件绑定 &lt;div onclick=""&gt;123&lt;/div&gt; div1.onclick = function(){}; &lt;button onmouseover=""&gt;&lt;/button&gt; 注意: 如果给同一个元素绑定了两次或多次相同类型的事件,那么后面的绑定会覆盖前面的绑定 (不支持DOM事...
相关热词 c# singleton c#中类的默认值是 c#各种进制之间的转换 c# 正则表达式保留汉字 c#后台跨域 c#基础代码大全 c#指定combox选择 c#关系 mono c# 相差毫秒 用c#做一个简易计算器
立即提问