android 4.4-r3源码编译未报错,但是安装之后卡死在进入系统的界面?

android 4.4-r3源码编译未报错,但是安装之后卡死在进入系统的界面?

2个回答

本人也有同样的需求,哪位大神帮帮吗

安装之后?有没有使用模拟器先测试一下,或者看看有没有 CatLog 之类可以获取到卡死的原因信息。

Csdn user default icon
上传中...
上传图片
插入图片
抄袭、复制答案,以达到刷声望分或其他目的的行为,在CSDN问答是严格禁止的,一经发现立刻封号。是时候展现真正的技术了!
其他相关推荐
Android4.4编译stop,电脑卡住

我在编译Android4.4源码时,编译到如下步骤时候,就不动了,电脑很卡,什么也干不了, target SharedLib: libwebviewchromium (out/target/product/generic/obj/SHARED_LIBRARIES/libwebviewchromium_intermediates/LINKED/libwebviewchromium.so) 按照网上的解决方法: sudo dd if=/dev/zero of=/opt/moreswap bs=1024 count=512k sudo mkswap /opt/moreswap sudo swapon /opt/moreswap sudo gedit /etc/fstab 添加下面这一行: /opt/moreswap none swap sw 0 0 试了之后,还是不行。不知道是什么原因呢,求各位大侠赐教啊啊!!!

编译 android4.4 源码 framework 下 systemui 出错

修改了frameworks/base/packages/systemui,编译后报错,求解 错误log: make: *** [out/target/common/obj/APPS/SystemUI_intermediates/src/R.stamp] Error 1

android4.4 源码编译 提示The correct version is: Java SE 1.6

下载了android4.4的源码,大小差不多10G,但看见别人下载的都是20个G左右,不知道我的有没有下载正确 既然已经下载了,就先编译来看看 环境:ubuntu64位(虚拟机) JDK:1.6..40 (之前下载的是1.8,按要求降到1.6) 在源码目录下使用命令 source build/envsetup.sh lunch full-eng make -j4 一直会提示: Checking build tools versions... ************************************************************ You are attempting to build with the incorrect version of java. Your version is: Picked up JAVA_TOOL_OPTIONS: -javaagent:/usr/share/java/jayatanaag.jar . The correct version is: Java SE 1.6. Please follow the machine setup instructions at https://source.android.com/source/download.html ************************************************************ build/core/main.mk:168: *** stop。 停止。** 看上面的提示应该是要JDK1.6版本的,但我的是1.6 用 java varsion命令 root@ubuntu:/home/chen/android4.4# java -version Picked up JAVA_TOOL_OPTIONS: -javaagent:/usr/share/java/jayatanaag.jar java version "1.6.0_41" Java(TM) SE Runtime Environment (build 1.6.0_41-b02) Java HotSpot(TM) 64-Bit Server VM (build 20.14-b01, mixed mode) 看上面提示是1.6哇,实在搞不清楚为什么一直报这个错,求大神指点

关于JNI,为什么在android 4.4运行正常的程序,在4.0上运行就报错了

事情是这样的: 本身项目是基于android 4.4.2、JDK1.7 编译的,然后公司要求最低版本。 然后我将项目改成了android 2.3.3、JDK1.6编译,修改一些内容后,编译通过,在android 4.4.2的手机上运行正常。 但是现在市场部反应,在低于4.1.X的版本上运行还是有问题,因此我找来一台android 4.0.4内核的手机调试,确实报错了,在JNI模块。 报:UnsatisfiedLinkError,找不到调用的那个Native对应在C中的方法,现在我该怎么办? android 4.4.x和android4.1.x在JNI上面有什么改变? 既然我程序在4.4.2运行成功,证明代码上没有问题,编译也没有问题,那么问题到底出在哪里??

展讯内核版本4.4第一次编译报错make: *** [out/target/common/obj/APPS/SystemUI_intermediates/src/R.stamp] Error 1

1.展讯内核版本4.4第一次编译报错,附上log ![图片说明](https://img-ask.csdn.net/upload/202005/07/1588831501_92435.png)

编译安卓4.4出错如下,求解!

各位大虾,编译安卓4.4 根文件系统,报错如下, 很多网友的帖子说是swap分区空间不够,我也增大了swap分区,并且在编译时监控内存使用率,并没有达到100% 代码肯定没问题,在其他地方都编译成功了,提示一大堆的undefined ,不知道为什么 有哪位知道如何处理,请指教,谢谢! external/chromium_org/third_party/WebKit/Source/core/platform/sql/SQLiteDatabase.cpp:343: error: undefined reference to 'sqlite3_errcode' external/chromium_org/third_party/WebKit/Source/core/platform/sql/SQLiteDatabase.cpp:349: error: undefined reference to 'sqlite3_errmsg' external/chromium_org/third_party/WebKit/Source/core/platform/sql/SQLiteDatabase.cpp:461: error: undefined reference to 'sqlite3_set_authorizer' external/chromium_org/third_party/WebKit/Source/core/platform/sql/SQLiteDatabase.cpp:466: error: undefined reference to 'sqlite3_get_autocommit' external/chromium_org/third_party/WebKit/Source/core/platform/sql/SQLiteDatabase.cpp:129: error: undefined reference to 'sqlite3_interrupt' external/chromium_org/third_party/WebKit/Source/core/platform/sql/SQLiteDatabase.cpp:114: error: undefined reference to 'sqlite3_close' external/chromium_org/third_party/WebKit/Source/core/platform/sql/SQLiteDatabase.cpp:76: error: undefined reference to 'sqlite3_errmsg' external/chromium_org/third_party/WebKit/Source/core/platform/sql/SQLiteDatabase.cpp:79: error: undefined reference to 'sqlite3_close' external/chromium_org/third_party/WebKit/Source/core/platform/sql/SQLiteDatabase.cpp:84: error: undefined reference to 'sqlite3_extended_result_codes' external/chromium_org/third_party/WebKit/Source/core/platform/sql/SQLiteDatabase.cpp:86: error: undefined reference to 'sqlite3_errmsg' external/chromium_org/third_party/WebKit/Source/core/platform/sql/SQLiteDatabase.cpp:88: error: undefined reference to 'sqlite3_close' external/chromium_org/third_party/WebKit/Source/core/platform/sql/SQLiteStatement.cpp:75: error: undefined reference to 'sqlite3_prepare_v2' external/chromium_org/third_party/WebKit/Source/core/platform/sql/SQLiteStatement.cpp:104: error: undefined reference to 'sqlite3_step' external/chromium_org/third_party/WebKit/Source/core/platform/sql/SQLiteStatement.cpp:121: error: undefined reference to 'sqlite3_finalize' external/chromium_org/third_party/WebKit/Source/core/platform/sql/SQLiteStatement.cpp:218: error: undefined reference to 'sqlite3_bind_double' external/chromium_org/third_party/WebKit/Source/core/platform/sql/SQLiteStatement.cpp:227: error: undefined reference to 'sqlite3_bind_null' external/chromium_org/third_party/WebKit/Source/core/platform/sql/SQLiteStatement.cpp:250: error: undefined reference to 'sqlite3_bind_parameter_count' external/chromium_org/third_party/WebKit/Source/core/platform/sql/SQLiteStatement.cpp:258: error: undefined reference to 'sqlite3_data_count' external/chromium_org/third_party/WebKit/Source/core/platform/sql/SQLiteStatement.cpp:292: error: undefined reference to 'sqlite3_column_name16' external/chromium_org/third_party/WebKit/Source/core/platform/sql/SQLiteStatement.cpp:306: error: undefined reference to 'sqlite3_column_value' external/chromium_org/third_party/WebKit/Source/core/platform/sql/SQLiteStatement.cpp:307: error: undefined reference to 'sqlite3_value_type' external/chromium_org/third_party/WebKit/Source/core/platform/sql/SQLiteStatement.cpp:310: error: undefined reference to 'sqlite3_value_double' external/chromium_org/third_party/WebKit/Source/core/platform/sql/SQLiteStatement.cpp:313: error: undefined reference to 'sqlite3_value_text16' external/chromium_org/third_party/WebKit/Source/core/platform/sql/SQLiteStatement.cpp:334: error: undefined reference to 'sqlite3_column_text16' external/chromium_org/third_party/WebKit/Source/core/platform/sql/SQLiteStatement.cpp:335: error: undefined reference to 'sqlite3_column_bytes16' external/chromium_org/third_party/WebKit/Source/core/platform/sql/SQLiteStatement.cpp:357: error: undefined reference to 'sqlite3_column_int' external/chromium_org/third_party/WebKit/Source/core/platform/sql/SQLiteStatement.cpp:368: error: undefined reference to 'sqlite3_column_int64' external/chromium_org/third_party/WebKit/Source/core/platform/sql/SQLiteStatement.cpp:191: error: undefined reference to 'sqlite3_bind_text16' external/chromium_org/third_party/WebKit/Source/core/platform/sql/chromium/SQLiteFileSystemChromium.cpp:49: error: undefined reference to 'sqlite3_open' external/chromium_org/third_party/WebKit/Source/core/platform/sql/chromium/SQLiteFileSystemChromium.cpp:51: error: undefined reference to 'sqlite3_open_v2' external/chromium_org/third_party/WebKit/Source/core/platform/sql/chromium/SQLiteFileSystemChromiumPosix.cpp:150: error: undefined reference to 'sqlite3_snprintf' external/chromium_org/third_party/WebKit/Source/core/platform/sql/chromium/SQLiteFileSystemChromiumPosix.cpp:65: error: undefined reference to 'chromium_sqlite3_initialize_unix_sqlite3_file' external/chromium_org/third_party/WebKit/Source/core/platform/sql/chromium/SQLiteFileSystemChromiumPosix.cpp:67: error: undefined reference to 'chromium_sqlite3_get_reusable_file_handle' external/chromium_org/third_party/WebKit/Source/core/platform/sql/chromium/SQLiteFileSystemChromiumPosix.cpp:79: error: undefined reference to 'chromium_sqlite3_destroy_reusable_file_handle' external/chromium_org/third_party/WebKit/Source/core/platform/sql/chromium/SQLiteFileSystemChromiumPosix.cpp:85: error: undefined reference to 'chromium_sqlite3_update_reusable_file_handle' external/chromium_org/third_party/WebKit/Source/core/platform/sql/chromium/SQLiteFileSystemChromiumPosix.cpp:92: error: undefined reference to 'chromium_sqlite3_fill_in_unix_sqlite3_file' external/chromium_org/third_party/WebKit/Source/core/platform/sql/chromium/SQLiteFileSystemChromiumPosix.cpp:94: error: undefined reference to 'chromium_sqlite3_destroy_reusable_file_handle' external/chromium_org/third_party/WebKit/Source/core/platform/sql/chromium/SQLiteFileSystemChromiumPosix.cpp:173: error: undefined reference to 'sqlite3_vfs_find' external/chromium_org/third_party/WebKit/Source/core/platform/sql/chromium/SQLiteFileSystemChromiumPosix.cpp:194: error: undefined reference to 'sqlite3_vfs_register' external/chromium_org/webkit/glue/webkit_glue.cc:14: error: undefined reference to 'v8::V8::SetFlagsFromString(char const*, int)' external/chromium_org/webkit/child/webkit_child_helpers.cc:29: error: undefined reference to 'v8::HeapStatistics::HeapStatistics()' ****external/chromium_org/webkit/child/webkit_child_helpers.cc:32: error: undefined reference to 'v8::Isolate::GetHeapStatistics(v8::HeapStatistics*)' collect2: error: ld returned 1 exit status make: *** [out/target/product/drone2/obj/SHARED_LIBRARIES/libwebviewchromium_intermediates/LINKED/libwebviewchromium.so] Error 1 ****

Android4.4以后如何单独编译webview

Android4.4以前webview包含两部分内容,一部分是上层Java代码,另一部分是下层c++代码(包括两个so库)。Android4.4以后webview原来基于webkit内核,改为基于chromium,找不到对应的so库了,哪位大神了解这块,帮帮忙,重谢。

android studio 编译的app在4.4.4版本的安卓手机上运行不了?

我在 abdroid studio上编译的app,在模拟器上可以正常运行,下载到手机上一打开闪一下就关闭了,也不报错什么的。 这是app的编译配置: ``` android { compileSdkVersion 24 buildToolsVersion "25.0.1" defaultConfig { applicationId "com.example.administrator.class_fragmenttest" minSdkVersion 14 targetSdkVersion 24 versionCode 1 versionName "1.0" testInstrumentationRunner "android.support.test.runner.AndroidJUnitRunner" } ``` 手机版本信息 ![图片说明](https://img-ask.csdn.net/upload/201612/14/1481703366_165218.jpg) ,我把手机换成5.5的Android就可以运行了。问题是我设置的最低兼容的api版本是14 ,应该能在4.4的android上运行才对的。哪位大神知道是什么原因不? 代码里面什么都没有写,只有studio自动生成的 hello android!这个程序都不能在4.4的手机上运行

Android4.4之后都改了哪些机制,为什么我之前的程序在4.4之后报错

Android4.4之后都改了哪些机制,为什么我之前的程序在4.4之后报错? 主要是我上传插件那就报错了

SecureCRT源码编译问题

我在SecureCRT整体编译Android4.4源码时make没有报错 但是单独编译时 通不过 下面是我编译Settings 和 SystemUI 时遇到的问题 大神帮解下 感谢!! make: *** No rule to make target `out/host/linux-x86/bin/aapt', needed by `out/target/common/obj/APPS/Settings_intermediates/src/R.stamp'. Stop. make: *** No rule to make target `out/host/linux-x86/bin/aapt', needed by `out/target/common/obj/APPS/SystemUI_intermediates/src/R.stamp'. Stop.

基于android4.4以下与4.4及以上的webview对于html5兼容性问题

在Android 4.4以下(不包含4.4)系统WebView底层实现是采用WebKit内核,而在Android 4.4及其以上Google 采用了chromium作为系统WebView的底层内核支持,我现在做的一个app是就是使用webview调用了一个html5的网址,但发现有些地方是不兼容的,比如说一个登录页面在输入用户名称或者密码的时候弹出键盘,然后在滑动屏幕的时候上方就会有空白区域出现![图片说明](https://img-ask.csdn.net/upload/201603/14/1457938848_658228.jpg) 帮忙分析下,是android兼容问题,还是页面编写的问题 如果是android兼容问题,是不是有第三方组件可以使用

创建android 4.4W avd 没有System Image,无法创建

android 4.4W 创建不了,没有那个System Image,这是怎么回事

android 4.4W avd 创建不了。应该如何配置呢。

android 4.4W avd 创建不了。应该如何配置呢。 如题。。谢谢。

android 4.4中Activity问题

android4.4中两个Activity均设置为全屏透明。在activity正常显示时是没有状态栏的。 可是由一个Activity向另一个Activity切换的过程中会有状态栏闪现的bug。如何修复。

关于android4.4以后短信监听的问题

大家好,我最近在做一个短信监听的项目,要能够监听和删除短信。由于android4.4以后短信数据库需要设置为默认短信应用才能有写操作,我是用了一台魅族手做的测试,广播方式无法监听到短信的到来,数据库观察者也无法获取,但是我发现360手机卫士那个隐私空间却可以在魅族手机监听短信,并且不让短信显示在短信列表里。我想请问下,那么360是通过哪种方式监听到的呢?请大神指点一下。

android4.4短信拦截问题

android4.4以后的版本如果要拦截短信该怎么实现呢?有没有高手给个思路,小弟初学,百度好久貌似都是以前的老帖子。 还有就是在原生系统下,短信receiver还是可以正常接收到,在一些国产机的定制系统上,就接受不到广播了,求解。

adnroid 开发编译mqtt报错

android studio 下载并打开paho.mqtt.android 编译报错,我的gradle版本4.4 as版本3.1.3 下载地址https://github.com/eclipse/paho.mqtt.android 直接git到的原始的项目,打开编译就报错,我本地新建空内容项目都能编译成功,adnroid 开发编译mqtt报错× 报错如下: Cannot create variant 'android-lint' after configuration ':org.eclipse.paho.android.service:debugRuntimeElements' has been resolved ![图片说明](https://img-ask.csdn.net/upload/201808/10/1533894738_767361.png) org.gradle.initialization.ReportedException: org.gradle.internal.exceptions.LocationAwareException: A problem occurred configuring project ':org.eclipse.paho.android.service'. at org.gradle.initialization.DefaultGradleLauncher.doBuildStages(DefaultGradleLauncher.java:139) at org.gradle.initialization.DefaultGradleLauncher.executeTasks(DefaultGradleLauncher.java:109) at org.gradle.internal.invocation.GradleBuildController$1.call(GradleBuildController.java:78) at org.gradle.internal.invocation.GradleBuildController$1.call(GradleBuildController.java:75) at org.gradle.internal.work.DefaultWorkerLeaseService.withLocks(DefaultWorkerLeaseService.java:152) at org.gradle.internal.invocation.GradleBuildController.doBuild(GradleBuildController.java:100) at org.gradle.internal.invocation.GradleBuildController.run(GradleBuildController.java:75) at org.gradle.tooling.internal.provider.runner.BuildModelActionRunner.run(BuildModelActionRunner.java:53) at org.gradle.launcher.exec.ChainingBuildActionRunner.run(ChainingBuildActionRunner.java:35) at org.gradle.launcher.exec.ChainingBuildActionRunner.run(ChainingBuildActionRunner.java:35) 。。。 at java.util.concurrent.ThreadPoolExecutor.runWorker(ThreadPoolExecutor.java:1142) at java.util.concurrent.ThreadPoolExecutor$Worker.run(ThreadPoolExecutor.java:617) at org.gradle.internal.concurrent.ThreadFactoryImpl$ManagedThreadRunnable.run(ThreadFactoryImpl.java:55) at java.lang.Thread.run(Thread.java:745) Caused by: org.gradle.internal.exceptions.LocationAwareException: A problem occurred configuring project ':org.eclipse.paho.android.service'. at org.gradle.initialization.DefaultExceptionAnalyser.transform(DefaultExceptionAnalyser.java:74) at org.gradle.initialization.MultipleBuildFailuresExceptionAnalyser.transform(MultipleBuildFailuresExceptionAnalyser.java:47) at org.gradle.initialization.StackTraceSanitizingExceptionAnalyser.transform(StackTraceSanitizingExceptionAnalyser.java:30) at org.gradle.initialization.DefaultGradleLauncher.doBuildStages(DefaultGradleLauncher.java:137) at org.gradle.initialization.DefaultGradleLauncher.executeTasks(DefaultGradleLauncher.java:109) at org.gradle.internal.invocation.GradleBuildController$1.call(GradleBuildController.java:78) at org.gradle.internal.invocation.GradleBuildController$1.call(GradleBuildController.java:75) at org.gradle.internal.work.DefaultWorkerLeaseService.withLocks(DefaultWorkerLeaseService.java:152) at org.gradle.internal.invocation.GradleBuildController.doBuild(GradleBuildController.java:100) at org.gradle.internal.invocation.GradleBuildController.run(GradleBuildController.java:75) at org.gradle.tooling.internal.provider.runner.BuildModelActionRunner.run(BuildModelActionRunner.java:53) at org.gradle.launcher.exec.ChainingBuildActionRunner.run(ChainingBuildActionRunner.java:35) at org.gradle.launcher.exec.ChainingBuildActionRunner.run(ChainingBuildActionRunner.java:35) at org.gradle.tooling.internal.provider.ValidatingBuildActionRunner.run(ValidatingBuildActionRunner.java:32) at org.gradle.launcher.exec.RunAsBuildOperationBuildActionRunner$1.run(RunAsBuildOperationBuildActionRunner.java:43) at org.gradle.internal.progress.DefaultBuildOperationExecutor$RunnableBuildOperationWorker.execute(DefaultBuildOperationExecutor.java:336) at org.gradle.internal.progress.DefaultBuildOperationExecutor$RunnableBuildOperationWorker.execute(DefaultBuildOperationExecutor.java:328) at org.gradle.internal.progress.DefaultBuildOperationExecutor.execute(DefaultBuildOperationExecutor.java:199) at org.gradle.internal.progress.DefaultBuildOperationExecutor.run(DefaultBuildOperationExecutor.java:110) at org.gradle.launcher.exec.RunAsBuildOperationBuildActionRunner.run(RunAsBuildOperationBuildActionRunner.java:40) 。。。 at org.gradle.launcher.daemon.server.exec.BuildCommandOnly.execute(BuildCommandOnly.java:36) at org.gradle.launcher.daemon.server.api.DaemonCommandExecution.proceed(DaemonCommandExecution.java:122) at org.gradle.launcher.daemon.server.exec.EstablishBuildEnvironment.doBuild(EstablishBuildEnvironment.java:82) at org.gradle.launcher.daemon.server.exec.BuildCommandOnly.execute(BuildCommandOnly.java:36) at org.gradle.launcher.daemon.server.api.DaemonCommandExecution.proceed(DaemonCommandExecution.java:122) at org.gradle.launcher.daemon.server.exec.StartBuildOrRespondWithBusy$1.run(StartBuildOrRespondWithBusy.java:50) at org.gradle.launcher.daemon.server.DaemonStateCoordinator$1.run(DaemonStateCoordinator.java:295) at org.gradle.internal.concurrent.ExecutorPolicy$CatchAndRecordFailures.onExecute(ExecutorPolicy.java:63) at org.gradle.internal.concurrent.ManagedExecutorImpl$1.run(ManagedExecutorImpl.java:46) at org.gradle.internal.concurrent.ThreadFactoryImpl$ManagedThreadRunnable.run(ThreadFactoryImpl.java:55) Caused by: org.gradle.api.ProjectConfigurationException: A problem occurred configuring project ':org.eclipse.paho.android.service'. at org.gradle.configuration.project.LifecycleProjectEvaluator.addConfigurationFailure(LifecycleProjectEvaluator.java:94) at org.gradle.configuration.project.LifecycleProjectEvaluator.notifyAfterEvaluate(LifecycleProjectEvaluator.java:89) 。。。 ... 62 more Caused by: org.gradle.api.InvalidUserCodeException: Cannot create variant 'android-lint' after configuration ':org.eclipse.paho.android.service:debugRuntimeElements' has been resolved at org.gradle.api.internal.artifacts.configurations.DefaultConfigurationPublications$ConfigurationVariantFactory.create(DefaultConfigurationPublications.java:158) at org.gradle.api.internal.artifacts.configurations.DefaultConfigurationPublications$ConfigurationVariantFactory.create(DefaultConfigurationPublications.java:151) at org.gradle.api.internal.FactoryNamedDomainObjectContainer.doCreate(FactoryNamedDomainObjectContainer.java:100) at org.gradle.api.internal.AbstractNamedDomainObjectContainer.create(AbstractNamedDomainObjectContainer.java:67) at com.android.build.gradle.internal.scope.VariantScopeImpl.lambda$publishArtifactToConfiguration$2(VariantScopeImpl.java:378) at org.gradle.api.internal.artifacts.configurations.DefaultConfigurationPublications.variants(DefaultConfigurationPublications.java:139) at com.android.build.gradle.internal.scope.VariantScopeImpl.publishArtifactToConfiguration(VariantScopeImpl.java:376) at com.android.build.gradle.internal.scope.VariantScopeImpl.publishIntermediateArtifact(VariantScopeImpl.java:347) at com.android.build.gradle.internal.scope.VariantScopeImpl.addTaskOutput(VariantScopeImpl.java:298) at com.android.build.gradle.internal.TaskManager.configureGlobalLintTask(TaskManager.java:536) at com.android.build.gradle.BasePlugin.createAndroidTasks(BasePlugin.java:7

android4.4 webview播放视频全屏问题

在android4.4的webview上播放从优酷提供的视频接口网页无法全屏,已经开启硬件加速,点击全屏按钮的时候发现没有回调onShowCustomView方法,在android4.4一下都可以正常回调。 不知道是否有人遇到同样的问题,希望有谁能帮忙解决一下,请用这个测试地址实验:http://cont.app.autohome.com.cn/autov4.2.5/content/news/videopage-a2-pm1-v4.3-vid30235-night0-showpage1-fs0-cw320.html,万分感谢

android4.4版本之后怎么实现swf播放

项目中遇到一个需求,app中需要实现播放swf文件。但在网上查询相关资料后,发现android4.4版本之后浏览器内核不支持swf/flash的播放. 目前没有查到相关解决方法。 向各位大侠请教一下: 各位有没有什么好的方法实现swf的播放,有没有应用的示例或者demo。使用html5技术能实现吗?比较急,在线等。多谢各位

在中国程序员是青春饭吗?

今年,我也32了 ,为了不给大家误导,咨询了猎头、圈内好友,以及年过35岁的几位老程序员……舍了老脸去揭人家伤疤……希望能给大家以帮助,记得帮我点赞哦。 目录: 你以为的人生 一次又一次的伤害 猎头界的真相 如何应对互联网行业的「中年危机」 一、你以为的人生 刚入行时,拿着傲人的工资,想着好好干,以为我们的人生是这样的: 等真到了那一天,你会发现,你的人生很可能是这样的: ...

程序员请照顾好自己,周末病魔差点一套带走我。

程序员在一个周末的时间,得了重病,差点当场去世,还好及时挽救回来了。

Java基础知识面试题(2020最新版)

文章目录Java概述何为编程什么是Javajdk1.5之后的三大版本JVM、JRE和JDK的关系什么是跨平台性?原理是什么Java语言有哪些特点什么是字节码?采用字节码的最大好处是什么什么是Java程序的主类?应用程序和小程序的主类有何不同?Java应用程序与小程序之间有那些差别?Java和C++的区别Oracle JDK 和 OpenJDK 的对比基础语法数据类型Java有哪些数据类型switc...

技术大佬:我去,你写的 switch 语句也太老土了吧

昨天早上通过远程的方式 review 了两名新来同事的代码,大部分代码都写得很漂亮,严谨的同时注释也很到位,这令我非常满意。但当我看到他们当中有一个人写的 switch 语句时,还是忍不住破口大骂:“我擦,小王,你丫写的 switch 语句也太老土了吧!” 来看看小王写的代码吧,看完不要骂我装逼啊。 private static String createPlayer(PlayerTypes p...

和黑客斗争的 6 天!

互联网公司工作,很难避免不和黑客们打交道,我呆过的两家互联网公司,几乎每月每天每分钟都有黑客在公司网站上扫描。有的是寻找 Sql 注入的缺口,有的是寻找线上服务器可能存在的漏洞,大部分都...

Intellij IDEA 实用插件安利

1. 前言从2020 年 JVM 生态报告解读 可以看出Intellij IDEA 目前已经稳坐 Java IDE 头把交椅。而且统计得出付费用户已经超过了八成(国外统计)。IDEA 的...

女程序员,为什么比男程序员少???

昨天看到一档综艺节目,讨论了两个话题:(1)中国学生的数学成绩,平均下来看,会比国外好?为什么?(2)男生的数学成绩,平均下来看,会比女生好?为什么?同时,我又联想到了一个技术圈经常讨...

总结了 150 余个神奇网站,你不来瞅瞅吗?

原博客再更新,可能就没了,之后将持续更新本篇博客。

副业收入是我做程序媛的3倍,工作外的B面人生是怎样的?

提到“程序员”,多数人脑海里首先想到的大约是:为人木讷、薪水超高、工作枯燥…… 然而,当离开工作岗位,撕去层层标签,脱下“程序员”这身外套,有的人生动又有趣,马上展现出了完全不同的A/B面人生! 不论是简单的爱好,还是正经的副业,他们都干得同样出色。偶尔,还能和程序员的特质结合,产生奇妙的“化学反应”。 @Charlotte:平日素颜示人,周末美妆博主 大家都以为程序媛也个个不修边幅,但我们也许...

MySQL数据库面试题(2020最新版)

文章目录数据库基础知识为什么要使用数据库什么是SQL?什么是MySQL?数据库三大范式是什么mysql有关权限的表都有哪几个MySQL的binlog有有几种录入格式?分别有什么区别?数据类型mysql有哪些数据类型引擎MySQL存储引擎MyISAM与InnoDB区别MyISAM索引与InnoDB索引的区别?InnoDB引擎的4大特性存储引擎选择索引什么是索引?索引有哪些优缺点?索引使用场景(重点)...

如果你是老板,你会不会踢了这样的员工?

有个好朋友ZS,是技术总监,昨天问我:“有一个老下属,跟了我很多年,做事勤勤恳恳,主动性也很好。但随着公司的发展,他的进步速度,跟不上团队的步伐了,有点...

我入职阿里后,才知道原来简历这么写

私下里,有不少读者问我:“二哥,如何才能写出一份专业的技术简历呢?我总感觉自己写的简历太烂了,所以投了无数份,都石沉大海了。”说实话,我自己好多年没有写过简历了,但我认识的一个同行,他在阿里,给我说了一些他当年写简历的方法论,我感觉太牛逼了,实在是忍不住,就分享了出来,希望能够帮助到你。 01、简历的本质 作为简历的撰写者,你必须要搞清楚一点,简历的本质是什么,它就是为了来销售你的价值主张的。往深...

魂迁光刻,梦绕芯片,中芯国际终获ASML大型光刻机

据羊城晚报报道,近日中芯国际从荷兰进口的一台大型光刻机,顺利通过深圳出口加工区场站两道闸口进入厂区,中芯国际发表公告称该光刻机并非此前盛传的EUV光刻机,主要用于企业复工复产后的生产线扩容。 我们知道EUV主要用于7nm及以下制程的芯片制造,光刻机作为集成电路制造中最关键的设备,对芯片制作工艺有着决定性的影响,被誉为“超精密制造技术皇冠上的明珠”,根据之前中芯国际的公报,目...

优雅的替换if-else语句

场景 日常开发,if-else语句写的不少吧??当逻辑分支非常多的时候,if-else套了一层又一层,虽然业务功能倒是实现了,但是看起来是真的很不优雅,尤其是对于我这种有强迫症的程序"猿",看到这么多if-else,脑袋瓜子就嗡嗡的,总想着解锁新姿势:干掉过多的if-else!!!本文将介绍三板斧手段: 优先判断条件,条件不满足的,逻辑及时中断返回; 采用策略模式+工厂模式; 结合注解,锦...

离职半年了,老东家又发 offer,回不回?

有小伙伴问松哥这个问题,他在上海某公司,在离职了几个月后,前公司的领导联系到他,希望他能够返聘回去,他很纠结要不要回去? 俗话说好马不吃回头草,但是这个小伙伴既然感到纠结了,我觉得至少说明了两个问题:1.曾经的公司还不错;2.现在的日子也不是很如意。否则应该就不会纠结了。 老实说,松哥之前也有过类似的经历,今天就来和小伙伴们聊聊回头草到底吃不吃。 首先一个基本观点,就是离职了也没必要和老东家弄的苦...

2020阿里全球数学大赛:3万名高手、4道题、2天2夜未交卷

阿里巴巴全球数学竞赛( Alibaba Global Mathematics Competition)由马云发起,由中国科学技术协会、阿里巴巴基金会、阿里巴巴达摩院共同举办。大赛不设报名门槛,全世界爱好数学的人都可参与,不论是否出身数学专业、是否投身数学研究。 2020年阿里巴巴达摩院邀请北京大学、剑桥大学、浙江大学等高校的顶尖数学教师组建了出题组。中科院院士、美国艺术与科学院院士、北京国际数学...

为什么你不想学习?只想玩?人是如何一步一步废掉的

不知道是不是只有我这样子,还是你们也有过类似的经历。 上学的时候总有很多光辉历史,学年名列前茅,或者单科目大佬,但是虽然慢慢地长大了,你开始懈怠了,开始废掉了。。。 什么?你说不知道具体的情况是怎么样的? 我来告诉你: 你常常潜意识里或者心理觉得,自己真正的生活或者奋斗还没有开始。总是幻想着自己还拥有大把时间,还有无限的可能,自己还能逆风翻盘,只不是自己还没开始罢了,自己以后肯定会变得特别厉害...

男生更看重女生的身材脸蛋,还是思想?

往往,我们看不进去大段大段的逻辑。深刻的哲理,往往短而精悍,一阵见血。问:产品经理挺漂亮的,有点心动,但不知道合不合得来。男生更看重女生的身材脸蛋,还是...

为什么程序员做外包会被瞧不起?

二哥,有个事想询问下您的意见,您觉得应届生值得去外包吗?公司虽然挺大的,中xx,但待遇感觉挺低,马上要报到,挺纠结的。

当HR压你价,说你只值7K,你该怎么回答?

当HR压你价,说你只值7K时,你可以流畅地回答,记住,是流畅,不能犹豫。 礼貌地说:“7K是吗?了解了。嗯~其实我对贵司的面试官印象很好。只不过,现在我的手头上已经有一份11K的offer。来面试,主要也是自己对贵司挺有兴趣的,所以过来看看……”(未完) 这段话主要是陪HR互诈的同时,从公司兴趣,公司职员印象上,都给予对方正面的肯定,既能提升HR的好感度,又能让谈判气氛融洽,为后面的发挥留足空间。...

面试:第十六章:Java中级开发

HashMap底层实现原理,红黑树,B+树,B树的结构原理 Spring的AOP和IOC是什么?它们常见的使用场景有哪些?Spring事务,事务的属性,传播行为,数据库隔离级别 Spring和SpringMVC,MyBatis以及SpringBoot的注解分别有哪些?SpringMVC的工作原理,SpringBoot框架的优点,MyBatis框架的优点 SpringCould组件有哪些,他们...

面试阿里p7,被按在地上摩擦,鬼知道我经历了什么?

面试阿里p7被问到的问题(当时我只知道第一个):@Conditional是做什么的?@Conditional多个条件是什么逻辑关系?条件判断在什么时候执...

Python爬虫,高清美图我全都要(彼岸桌面壁纸)

爬取彼岸桌面网站较为简单,用到了requests、lxml、Beautiful Soup4

差点跪了...

最近微信又搞出了一个大利器,甚至都上了热搜,当然消息最敏捷的自媒体人,纷纷都开通了自己的视频号。01 视频号是什么呢?视频号是微信体系内的短视频,它不同...

面试了一个 31 岁程序员,让我有所触动,30岁以上的程序员该何去何从?

最近面试了一个31岁8年经验的程序猿,让我有点感慨,大龄程序猿该何去何从。

Vue回炉重造之router路由(更新中)

你好,我是Vam的金豆之路,可以叫我豆哥。2019年年度博客之星、技术领域博客专家。主要领域:前端开发。我的微信是 maomin9761,有什么疑问可以加我哦,自己创建了一个微信技术交流群,可以加我邀请你一起交流学习。最后自己也创建了一个微信公众号,里面的文章是我自己精挑细选的文章,主要介绍各种IT新技术。欢迎关注哦,微信搜索:臻美IT,等你来。 欢迎阅读本博文,本博文主要讲述【】,文字通...

大三实习生,字节跳动面经分享,已拿Offer

说实话,自己的算法,我一个不会,太难了吧

程序员垃圾简历长什么样?

已经连续五年参加大厂校招、社招的技术面试工作,简历看的不下于万份 这篇文章会用实例告诉你,什么是差的程序员简历! 疫情快要结束了,各个公司也都开始春招了,作为即将红遍大江南北的新晋UP主,那当然要为小伙伴们做点事(手动狗头)。 就在公众号里公开征简历,义务帮大家看,并一一点评。《启舰:春招在即,义务帮大家看看简历吧》 一石激起千层浪,三天收到两百多封简历。 花光了两个星期的所有空闲时...

Java岗开发3年,公司临时抽查算法,离职后这几题我记一辈子

前几天我们公司做了一件蠢事,非常非常愚蠢的事情。我原以为从学校出来之后,除了找工作有测试外,不会有任何与考试有关的事儿。 但是,天有不测风云,公司技术总监、人事总监两位大佬突然降临到我们事业线,叫上我老大,给我们组织了一场别开生面的“考试”。 那是一个风和日丽的下午,我翘着二郎腿,左手端着一杯卡布奇诺,右手抓着我的罗技鼠标,滚动着轮轴,穿梭在头条热点之间。 “淡黄的长裙~蓬松的头发...

大胆预测下未来5年的Web开发

在2019年的ReactiveConf 上,《Elm in Action》的作者Richard Feldman对未来5年Web开发的发展做了预测,很有意思,分享给大家。如果你有机会从头...

立即提问
相关内容推荐