2 yhe222 yhe222 于 2016.02.28 18:32 提问

编译caffe时make runtest出现7个错误,如图!求大神赐教!!

图片说明

1个回答

oyljerry
oyljerry   Ds   Rxr 2016.02.28 20:32

这是ut的一些case没有过吧

yhe222
yhe222 UT是什么呢
2 年多之前 回复
yhe222
yhe222 具体要怎么弄呢??能给点线索吗??急求啊
2 年多之前 回复
Csdn user default icon
上传中...
上传图片
插入图片
准确详细的回答,更有利于被提问者采纳,从而获得C币。复制、灌水、广告等回答会被删除,是时候展现真正的技术了!
其他相关推荐
编译caffe报错:make: *** [runtest] 错误 134
make runtest报错:'[libprotobuf ERROR google/protobuf/text_format.cc:245] Error parsing text-format caffe.SolverParameter: 1:113: Message type "caffe.SolverParameter" has no field named "layer_wise_reduc
编译caffe源码时,make runtest问题解决方案:[ FAILED ] NesterovSolverTest/0.TestSnapshotShare, where TypeParam =
转载自  http://blog.csdn.net/wonengguwozai/article/details/52724409 加一句,一些make runtest中的测试就算不通过也不会耽误使用的,一般只要make all , make pycaffe 和 make test不出错即可 编译caffe源码的大致过程如下: make all make pyca
编译caffe源码时,make runtest问题解决方案:[ FAILED ] SGDSolverTest/0.TestSnapshotShare, where TypeParam = caffe:
编译caffe源码的大致过程如下: make all make pycaffe make test make runtest 小编在第N次搭建Caffe环境时,前面几步都很顺利,到最后一步make runtest这里出了问题。本来看着动漫等着make runtest运行完就去Happy,看到报错整个人都不好了。报错内容大致是这样的: [----------] Global test e
CAFFE 成功MAKE成功后,make runtest 出现了大量的错误
CXX src/caffe/test/test_data_transformer.cpp CXX src/caffe/test/test_filler.cpp CXX src/caffe/test/test_syncedmem.cpp CXX src/caffe/test/test_mvn_layer.cpp CXX src/caffe/test/test_solver.cpp CXX
caffe make runtest 错误
执行 make runtest 后出现如下错误: [----------] Global test environment tear-down [==========] 1096 tests from 150 test cases ran. (106016 ms total) [  PASSED  ] 1095 tests. [  FAILED  ] 1 test, liste
caffe---make发生的错误和解决办法2
错误1: 执行命令:for req in $(cat requirements.txt); do pip install $req; done 错误2: make runtest
caffe编译出现的一些错误及解决方法(仅供参考)
1、make pytest时,出现layer_factory.hpp:77 ] Check failed: registry..... 解决方法:打开caffe目录下的Makefile.config文件,找到WITH_PYTHON_LAYER  := 1这一行,将前面的‘#’去掉,重新编译,最好是重新打开一个终端进行编译。 2、在编译pycaffe的时候可能会出现提示关于libm.so和rea
Ubuntu 16.04Caffe配置出现问题解决方法
本文参照了fengbingchun的CSDN专栏的 Ubuntu 14.04 64位机上不带CUDA支持的Caffe配置编译操作过程  按照engbingchun的CSDN专栏的 Ubuntu 14.04 64位机上不带CUDA支持的Caffe配置编译操作过程进行配置过程中出现了一些问题,进行了解决 1.      安装BLAS:$ sudo apt-get install libatl
安装caffe时make pytest遇到错误【Segmentation fault (core dumped) 】
在安装caffe时make, make all, make runtest, make pycaffe均成功完成 但是在mak pytest时出现错误 Segmentation fault (core dumped) 如下 [zs@gpu09 caffe]$ make pycaffemake: Nothing to be done for `pycaffe'.[zs@gpu09 caffe
caffe编译matlab 接口以及出错问题
首先,安装caffe之后编译 sudo make all -j8 sudo make test -j8 sudo make runtest -j8 接下来编译matlab借口 sudo make matcaffe -j8 测试matlab 接口: sudo make mattest -j8  如果顺利的就OK了   但是,如果matlab版本和gcc(Linux)版本不匹配的话,