Mac symbol(s) not found for architecture x86_64 ?

Mac编译 symbol(s) not found for architecture x86_64 ?修改

uname
Darwin Kernel Version 15.3.0: Thu Dec 10 18:40:58 PST 2015; root:xnu-3248.30.4~1/RELEASE_X86_64 x86_64
gcc -lncurses -o "veto_mq_server" ./src/veto_mq_server.o
Undefined symbols for architecture x86_64:
"_zmq_bind", referenced from:
_main in veto_mq_server.o
"_zmq_ctx_new", referenced from:
_main in veto_mq_server.o
"_zmq_recv", referenced from:
_main in veto_mq_server.o
"_zmq_send", referenced from:
_main in veto_mq_server.o
"_zmq_socket", referenced from:
_main in veto_mq_server.o
ld: symbol(s) not found for architecture x86_64

clang: error: linker command failed with exit code 1 (use -v to see invocation)
引用了第三方库ZMQ
/usr/local/include/
-rw-r--r--@ 1 root admin 844 Mar 10 15:00 zmq_utils.h

-rw-r--r--@ 1 root admin 16613 Mar 10 15:00 zmq.h
/usr/local/lib/
lrwxr-xr-x 1 yanrui admin 43 Mar 18 2015 libzmq.4.dylib -> ../Cellar/zeromq/4.0.5_2/lib/libzmq.4.dylib
-rwxr-xr-x 1 root admin 958 Mar 10 15:00 libzmq.la
lrwxr-xr-x 1 root admin 14 Mar 10 15:00 libzmq.dylib -> libzmq.5.dylib
-rw-r--r-- 1 root admin 23545352 Mar 10 15:00 libzmq.a
-rwxr-xr-x 1 root admin 602308 Mar 10 15:00 libzmq.5.dylib

图片说明

c mac

1个回答

gcc -L/usr/local/lib -o "veto_mq_server" ./src/veto_mq_server.o -lzmq

-L:第三方库路径
-l: 第三方库名称 形如libzmq.so,掐头去尾

Csdn user default icon
上传中...
上传图片
插入图片
抄袭、复制答案,以达到刷声望分或其他目的的行为,在CSDN问答是严格禁止的,一经发现立刻封号。是时候展现真正的技术了!
其他相关推荐
mac php brew install ld:symbol(s) not found for architecture x86_64
brew install php56rn==> Installing php56 from josegonzalez/homebrew-phprn==> Downloading https://www.php.net/get/php-5.6.4.tar.bz2/from/this/mirrorrnAlready downloaded: /Library/Caches/Homebrew/php56-5.6.4rn==> Patchingrn==> ./configure --prefix=/usr/local/Cellar/php56/5.6.4 --localstatedir=/usr/local/var --sysconfdir=/usr/local/etc/php/5.6 --with-config-file-rn==> makern ...rnld: symbol(s) not found for architecture x86_64rnclang: error: linker command failed with exit code 1 (use -v to see invocation)rnmake: *** [libs/libphp5.bundle] Error 1rnmake: *** Waiting for unfinished jobs....rnrnREAD THIS: http://git.io/brew-troubleshootingrnIf reporting this issue please do so at (not Homebrew/homebrew):rn https://github.com/josegonzalez/homebrew-php/issuesrnrn求助:有人知道怎么回事吗?
求助帖:在学习以太坊源代码时遇到问题 ld: symbol(s) not found for architecture x86_64
问题 ld: symbol(s) not found for architecture x86_64 我使用的是mac终端,先通过git clone https://github.com/ethereum/go-ethereum.git将远端以太坊代码下载下来,然后按网上所找到教程的提示,进入了go-ethereum文件夹,运行了make geth命令,出现如下问题: ld: warning: ...
Undefined symbols for architecture x86_64
Ld /Users/Lawrence/Library/Developer/Xcode/DerivedData/TempProject-gsfqekbhfijequcmtomvccfjafol/Build/Products/Debug/TempProject normal x86_64rn cd "/Users/Lawrence/workspace/Xcode Workspace/TempProject"rn export MACOSX_DEPLOYMENT_TARGET=10.9rn /Applications/Xcode.app/Contents/Developer/Toolchains/XcodeDefault.xctoolchain/usr/bin/clang++ -arch x86_64 -isysroot /Applications/Xcode.app/Contents/Developer/Platforms/MacOSX.platform/Developer/SDKs/MacOSX10.10.sdk -L/Users/Lawrence/Library/Developer/Xcode/DerivedData/TempProject-gsfqekbhfijequcmtomvccfjafol/Build/Products/Debug -F/Users/Lawrence/Library/Developer/Xcode/DerivedData/TempProject-gsfqekbhfijequcmtomvccfjafol/Build/Products/Debug -filelist /Users/Lawrence/Library/Developer/Xcode/DerivedData/TempProject-gsfqekbhfijequcmtomvccfjafol/Build/Intermediates/TempProject.build/Debug/TempProject.build/Objects-normal/x86_64/TempProject.LinkFileList -mmacosx-version-min=10.9 -stdlib=libc++ -Xlinker -dependency_info -Xlinker /Users/Lawrence/Library/Developer/Xcode/DerivedData/TempProject-gsfqekbhfijequcmtomvccfjafol/Build/Intermediates/TempProject.build/Debug/TempProject.build/Objects-normal/x86_64/TempProject_dependency_info.dat -o /Users/Lawrence/Library/Developer/Xcode/DerivedData/TempProject-gsfqekbhfijequcmtomvccfjafol/Build/Products/Debug/TempProjectrnrnUndefined symbols for architecture x86_64:rn "Config::source", referenced from:rn Config::getSource() in scan.orn "_lastTokenContent", referenced from:rn getWholeWord() in scan.orn getToken() in scan.orn "_sourceFile", referenced from:rn preScan() in scan.orn getNextChar() in scan.orn ungetCurrentChar() in scan.orn getWholeWord() in scan.ornld: symbol(s) not found for architecture x86_64rnclang: error: linker command failed with exit code 1 (use -v to see invocation)rnrnglobals.hrn[code=c]rn#ifndef GLOBALS_Hrn#define GLOBALS_Hrn#includernrnusing std::ifstream;rnrnenum TokenType rn ERROR,// error tokenrn REAL_NUMBER,// real numberrn;rnrnextern ifstream sourceFile;rnrn#endif // GLOBALS_Hrn[/code]rnrnscan.hrn[code=c]#ifndef SCANrn#define SCANrnrnTokenType getToken();rnrn#endif // SCANrn[/code]rnrnscan.cpprn[code=c]#include rn#include rn#include rn#include"globals.h"rn#include "scan.h"rn#include "Config.h"rnusing std::ifstream;rnusing std::cerr;rnusing std::endl;rnusing std::ios_base;rnusing std::ios;rnrnconst static int STATE_START = 0;rnrn/*rn * STATE_IN_ADDTION state means we get a char +,rn * we need read more char to judge we will get +=, ++ or just a single +rn * Other STATE_IN_XXX states are similar.rn */rnconst static int STATE_IN_IDENTIFIER= 17;rnconst static int STATE_IN_NUMBER = 18;rnconst static int STATE_END = -1;rnrnconst static int MAX_TOKEN_LENGTH = 64;rnextern ifstream sourceFile;rnrn/**rn * @brief lastTokenContent the token content in the last calling getToken();rn */rnextern char lastTokenContent[MAX_TOKEN_LENGTH+1];rnstatic int tokenContentPos = 0;rnrn/**rn * @brief preScan do some initial work before scanrn * this function will do:rn * 1. open the source file input streamrn */rnvoid preScan()rn if(!sourceFile.is_open())rn rn sourceFile.open(Config::getSource(),ios_base::in);rn if(!sourceFile.is_open())rn rn cerr<<"Open file "<
duplicate symbols for architecture x86_64
C++里分cpp的时候碰到的问题,小白求解rnrnrn在昨天以前,我把所有文件写在一个cpp 里,只有几个.h 文件,为了代码不那么难看,我决定分开。 然后就出现了如下问题,环境并没有变,代码也是一样的。没有其余报错,只有这个报错。[img=https://img-bbs.csdn.net/upload/201604/25/1461576409_253360.png][/img]rnrn急急急,在线等
xcode提示Symbol not found
版本:xcode4.2rn我在创建工程的时候,库里面的类都是可以找到的。rn后来我做一些操作,如设置环境,新建xib,创建类,然后重启xcode,点击Command+鼠标左键,就提示Symbol not foundrn系统的那些类都变成白色了,点不见去,也没有提示了,呜呜呜呜。rnrn但是我重新建一个工程,却是好的。rnrn好郁闷,求大虾指点下。rnrn删除这个目录下的索引我也试过了,没用。依然找不到。rn~/Library/Developer/Xcode/DerivedData
急:symbol not found
rnldd -r libPrmCommBusiMgnt_mgrD.sornrn报错rntrying path=/usr/lib/libc.so.1rn symbol not found: __1cQCPrmInterfaceMgrPdo_adcUserBatch6FrnLotl_connect_kh3rknDstdMbasic_string4Ccn0CLchar_traits4Cc__n0CJallocator4Cc____rk5rknDPRMLCSubContent_rkn0CGvector4n0GPCFeatureContent_n0CJallocator4n0I_____rknNMPrmCbsCommonKStringList_r9Jr5rnLCBSErrorMsg__h_ (/data2/openprm/lib/libPrmCommBusiMgnt_mgrD.so)
错误: dyld Symbol not found
iphoen上编译程序的时候出了一个错误,这是什么原因呢?rnrndyld: Symbol not found: _CFXMLNodeGetInfoPtrrn Referenced from: /System/Library/Frameworks/Security.framework/Versions/A/Securityrn Expected in: /Developer/Platforms/iPhoneSimulator.platform/Developer/SDKs/iPhoneSimulator4.3.sdk/System/Library/Frameworks/CoreFoundation.framework/Versions/A/CoreFoundationrn in /System/Library/Frameworks/Security.framework/Versions/A/Securityrnrnrn编译的时候没有错误,是运行的时候才出现的。rnrn编译一切正常。
Error:symbol "WaitForSingleObject" not found
调试程序的时候出现了这样一个问题,没有了返回值,线程无法正确执行rn[code=C/C++]if (WaitForSingleObject(tmeasureInfo->hTMeasureStop, 0) != WAIT_OBJECT_0)rn bContinue = false;rn [/code]rn为什么bContinue = false;总是能执行呢?把rnWaitForSingleObject(tmeasureInfo->hTMeasureStop, 0) != WAIT_OBJECT_0改为rnWaitForSingleObject(tmeasureInfo->hTMeasureStop, 0) == WAIT_OBJECT_0后rnbContinue = false;也被执行
如何解决“symbol not found" ??
小弟初学数据库,在书上抄了个程序,其中有一个函数出现了问题。程序如下:rnrnvoid CADO1View::OnSize(UINT nType, int cx, int cy) rnrn int iHeight,iWidth;rn CRect rect;rnrn COleDBRecordView::OnSize(nType, cx, cy);rn rn rn m_adoDC1.GetClientRect(rect);rnrn iHeight=rect.Height();rn iWidth=rect.Width();rnrn m_adoDC1.MoveWindow(cx,cy,iWidth,iHeight,TRUE);rn rn m_dataGrid1.MoveWindow(0,0,cx,cy-iHeight,TRUE);rn rnrnrncompile时没有问题,但执行时提示错误,debug后,提示:rn symbol iHeight not foundrn symbol iWidth not foundrnrn不知道是怎么回事,哪位帮忙解决一下!
libluabaseD.so: symbol g_cThreadKey: referenced symbol not found
libluabaseD.so: symbol g_cThreadKey: referenced symbol not foundrncrd_set0.sh: line 5: 8110 Killed luash testluasql.luarnrnrn求解决
qt调用xcode写的库出错symbol(s) not found for architecture armv7
我有一个程序。是人家给的。xcode写的库,xcode的示例。运行正常。我自己有个程序用qt写的,写了很久了。现在想把这部分程序加到我的程序里。我用qt调用库出现这样的总是:rn[color=#FF0000]:-1: error: symbol(s) not found for architecture armv7[/color]rn:-1: error: linker command failed with exit code 1 (use -v to see invocation)rnrnLd untitled.build/Release-iphoneos/untitled.build/Objects-normal/arm64/untitled normal arm64rn cd /Users/xujianxiang/build-untitled-iphoneos_clang_Qt_5_4_0_for_iOS-Releasern export IPHONEOS_DEPLOYMENT_TARGET=6.0rn export PATH="/Applications/Xcode.app/Contents/Developer/Platforms/iPhoneOS.platform/Developer/usr/bin:/Applications/Xcode.app/Contents/Developer/usr/bin:/Applications/Xcode.app/Contents/Developer/Toolchains/XcodeDefault.xctoolchain/usr/bin:/usr/bin:/bin:/usr/sbin:/sbin"rn /Applications/Xcode.app/Contents/Developer/Toolchains/XcodeDefault.xctoolchain/usr/bin/clang++ -arch arm64 -isysroot /Applications/Xcode.app/Contents/Developer/Platforms/iPhoneOS.platform/Developer/SDKs/iPhoneOS8.1.sdk -L/Users/xujianxiang/build-untitled-iphoneos_clang_Qt_5_4_0_for_iOS-Release/Release-iphoneos -L/Applications/Xcode.app/Contents/Developer/Platforms/iPhoneOS.platform/Developer/SDKs/iPhoneOS8.1.sdk/System/Library/Frameworks -L/Users/xujianxiang/untitled -L/Users/xujianxiang/Qt5.4.0/5.4/ios/plugins/platforms -L/Users/xujianxiang/Qt5.4.0/5.4/ios/lib -L/Users/xujianxiang/Qt5.4.0/5.4/ios/plugins/imageformats -F/Users/xujianxiang/build-untitled-iphoneos_clang_Qt_5_4_0_for_iOS-Release/Release-iphoneos -filelist /Users/xujianxiang/build-untitled-iphoneos_clang_Qt_5_4_0_for_iOS-Release/untitled.build/Release-iphoneos/untitled.build/Objects-normal/arm64/untitled.LinkFileList -dead_strip -headerpad_max_install_names -framework OpenGLES -framework UIKit -stdlib=libc++ -u _qt_registerPlatformPlugin -L/Users/xujianxiang/untitled/ -L/Users/xujianxiang/Qt5.4.0/5.4/ios/plugins/platforms -framework UIKit -L/Users/xujianxiang/Qt5.4.0/5.4/ios/lib -framework OpenGLES -L/Users/xujianxiang/Qt5.4.0/5.4/ios/plugins/imageformats -lz -lm -miphoneos-version-min=6.0 -framework OpenAL -framework AudioToolbox -framework QuartzCore -lHCNetSDK_dev_20141219 -lplayctrl -lSystemTransform -lqios -framework Foundation -framework CoreFoundation -framework CoreText -framework CoreGraphics -lQt5PlatformSupport -lQt5Widgets -lqdds -lqicns -lqico -lqjp2 -lqmng -lqtga -lqtiff -lqwbmp -lQt5Gui -lqtharfbuzzng -lQt5Core -Xlinker -dependency_info -Xlinker /Users/xujianxiang/build-untitled-iphoneos_clang_Qt_5_4_0_for_iOS-Release/untitled.build/Release-iphoneos/untitled.build/Objects-normal/arm64/untitled_dependency_info.dat -o /Users/xujianxiang/build-untitled-iphoneos_clang_Qt_5_4_0_for_iOS-Release/untitled.build/Release-iphoneos/untitled.build/Objects-normal/arm64/untitledrnUndefined symbols for architecture arm64:rn "std::string::at(unsigned long)", referenced from:rn TiXmlElement::StreamIn(std::istream*, std::string*) in libHCNetSDK_dev_20141219.a(tinyxmlparser.o)rn TiXmlComment::StreamIn(std::istream*, std::string*) in libHCNetSDK_dev_20141219.a(tinyxmlparser.o)rnrnrn "std::string::compare(char const*) const", referenced from:rn CXmlBase::FindElem(char const*) in libHCNetSDK_dev_20141219.a(XmlBase.o)rn "std::basic_string, std::allocator >::basic_string(char const*, std::allocator const&)", referenced from:rn rn[color=#FF0000]ld: symbol(s) not found for architecture arm64[/color]rn请问怎么解决这个问题rn
CXX0017:Error:symbol "m_CurOpItem" not found
// Main.cpp: implementation of the CMain class.rn// CMain类实现文件rn////////////////////////////////////////////////rnrn#include "stdafx.h"rn#include "AI3.h"rn#include "Main.h"rn#include "math.h"rnrnrn////////////////////////////////////rn// CaculateH:计算当前H值rn// 参数:当前节点rn// 返回值:H值rn////////////////////////////////////rnint CMain::CaculateH(CDisplay *Item)rnrn DataType Src[MaxItem][MaxItem];rn for(int i=0; iGetDispData(i,j);rn int Hop = 0;rn for(i=0; im_Desc[i][j] == Desc) rn rn Descpos = Position(i,j);rn return (int)fabs(Descpos.x - Srcpos.x)rn +(int)fabs(Descpos.y-Srcpos.y);rn rn rn return 65535;rnrnrn///////////////////////////////////////rn// FindOtherNote: 用于回溯 寻找另一个节点 rn// 参数:当前G值rn// 返回值:是否找到新节点rn///////////////////////////////////////rnBOOL CMain::FindOtherNote(int CurrentG)rnrn POSITION pos = m_DispList.GetTailPosition();rn while(pos)rn rn CDisplay *Item = (CDisplay *)m_DispList.GetPrev(pos);rn if(Item->GetCurrentG() != CurrentG) continue;//没有到当前层rn if(Item->GetNoteType() != NotYet) continue;//当前结点不是没有被扩展的结点rn m_CurOpItem = Item;rn return TRUE;rn rn return FALSE;rnrnrn///////////////////////////////////////////rn// GetResultListPoint: 得到搜索树树根的指针rn// ////////////////////////////////////////rnList * CMain::GetResultListPoint()rnrn while(1)rn rn if(m_DispList.GetCount() >= MaxNote) rn rn HWND hWnd = AfxGetApp()->GetMainWnd()->GetSafeHwnd();rn PostMessage(hWnd,WM_ERROR,0,ErrorCode1);rn return &m_DispList;rn rn if(CaculateH(m_CurOpItem) == 0) rn rn HWND hWnd = ::AfxGetApp()->GetMainWnd()->GetSafeHwnd();rn PostMessage(hWnd,WM_ERROR,0,NoError);rn return &m_DispList;rn rn GenerateMoveFlag();rn m_CurrentG++;rn if(GenerateChild() == NoError) continue;rn HWND hWnd = ::AfxGetApp()->GetMainWnd()->GetSafeHwnd();rn PostMessage(hWnd,WM_ERROR,0,ErrorCode);rn break;rn rn return NULL;rnrn这是一段不完全的程序,具体是那个地方出错的我不知道,只是调试错误
CX0017:Error:symbol " "has not found
vc6.0求解决,我是多工程的,是不是每个工程都要设置什么?
Framework not found IOSurface for architecture arm64
Framework not found IOSurface for architecture arm64 资源包
求助:CXX0017:ERROR:symbol "" not found
VC6.0写二叉树程序,一直出现CXX0017:ERROR:symbol "" not foundrn求助,怎么解决啊rn[code=cvoid InsertBST(BSTree *bst,int key)rnrn BSTNod *s;rn if ( bst == NULL)/*递归结束条件*/rn rn s = (BSTree)malloc(sizeof(BSTNod)) ;//申请新的节点srn s->key = key;rn s->lchild =NULL;rn s->rchild =NULL;rn bst = &s ;rn rn else if (key < ( (*bst)->key) )rn rn InsertBST(&((*bst)->lchild),key);/*将s插入左子树*/rn rn else if (key > ((*bst)->key))rn rn InsertBST(&((*bst)->rchild),key);/*将s插入右子树*/rn rnrnrnrnvoid CreateBST(BSTree *bst)rnrn int key;rn bst = NULL;rn scanf("%d",&key);rn while (key != 0) /*输入0结束*/rn rn InsertBST(bst,key);rn scanf("%d",&key);rn rnrnrnvoid InOrder(BSTree *bst)rnrn if (bst != NULL)rn rn InOrder(&(*bst)->lchild);rn printf("%d ",(*bst)->key);rn InOrder(&(*bst)->rchild);rn rnrnrnrnint main()rnrn BSTree *root = NULL;rn CreateBST(root);rn InOrder(root);rn return 0;rn][/code]
运行错误:this Cx0017:Eror:symbol"this" not found
建立一个MFC应用程序,未加任何代码,按F5调试,屏幕下面this这一栏显示:rnname vaulernthis Cx0017:Eror:symbol"this" not foundrn是我的Vc++6.0没装好还是?请大侠拔刀相助!
请教CXX0017:ERROR:SYMBOL "IF"NOT FOUND
今天用C语言做了个小实验。输入一组数,去掉最大值和最小值。剩下的求平均值并输出。编译正常,程序运行一半,WINDOWS就中断了。调试显示CXX0017:ERROR:SYMBOL "IF"NOT FOUNDrn我的代码:rn#includernvoid main()rnrn int n,i,j;rn float a[10],g,k;rn printf("please enter number of the sample(number<=10)/n");rn scanf("%d",&n);rn printf("please enter the value of the pressure/n");rn for(i=0;ia[j])rn rn k=a[i];rn a[i]=a[j];rn a[j]=k;rn rnrn rn k=a[1]+a[2]+a[3];rn g=k/3;rn printf("the out put with no interrupt value is%f/n",g);rn
Android's Architecture Components mobi
Android's Architecture Components 英文mobi 本资源转载自网络,如有侵权,请联系上传者或csdn删除 查看此书详细信息请在美国亚马逊官网搜索此书
Android's Architecture Components epub
Android's Architecture Components 英文epub 本资源转载自网络,如有侵权,请联系上传者或csdn删除 查看此书详细信息请在美国亚马逊官网搜索此书
Architecture and programming of 8051 MCU's
英文版的mcu51结构介绍,对于嵌入式入门的学生非常有用
AMD64 Architecture Programmer’s Manual
AMD64 Architecture Programmer’s Manual Vol1-5
Framework not found IOSurface for architecture arm64 解决方案
/Applications/Xcode.app/Contents/Developer/Platforms/iPhoneOS.platform/Developer/SDKs/iPhoneOS.sdk/System/Library/Frameworks目录下的IOSurface.framework、FileProvider.framework拷到Xcode8中相应目录下即可。 资料中包括iPhoneSimulator 和 iPhoneOS的.
What's mains "symbol table"?
thanks!
VC6.0 CXX0017:Error:symbol "xxx" not found 问题解决方法
shift+F9后就是这样,网上说的是VS的,有VC6.0的解决方法吗?据说是编译器优化导致
Xcode代码无高亮,提示Symbol Not Found
Xcode代码高亮消失,提示Symbol Not Found。 配置问题导致原本DerivedData目录下的index文件夹无法被创建,从而出现索引失败。
watch变量的时候,提示symbol not found!
vs2008+cuda 5.5 单步调试,watch有些变量,竟然提示symbol not found?rn还有var= var_sum/(height*width); var_sum 和var都是float类型,height = 220,width=118;var_sum 的值为50128660.0,相除的结果是var的值为0???改为double也不行。。cuda c太奇葩了。
mac os: file is not of required architecture
在mac os系统下学习cuda,用nvcc编译一个源文件(文件本身没有问题,在linux完成过),用g++链接的时候(g++ ...-lcutil_i386…)出现下面的错误:rnld: warning: in example_1.cu.o, file is not of required architecturernld: warning: in /Developer/GPU Computing/C/lib/libcutil_i386.a, file is not of required architecturernUndefined symbols:rn "_main", referenced from:rn start in crt1.10.6.ornld: symbol(s) not foundrncollect2: ld returned 1 exit statusrnrn然后变成nvcc -arch i386 -m32又出来如下的错误:rnnvcc : Value 'i386' is not defined for option 'gpu-architecture'rnrn哪位知道如何解决,请指点一下!
jdk6 x86_64 & i386 for mac 10.14及以下
macOS升级到mojave 即10.14后,原来的jdk6 没有了。开发需要jdk1.6,从苹果官网上下载的,亲测可用的java SE 6 [1.6.0_65-b14-468]
ios xcode 百度地图 undifined symbols for architecture x86_64 错误
刚接触ios开发,打算使用百度地图,下载了百度地图V2.8.1,按照官方提示,配置了相关的开发环境,现在出现如下错误,还望各位伸出一把援手!rn下载了比较全面的地图:rn[img=https://img-bbs.csdn.net/upload/201509/08/1441707126_99309.png][/img]rn错误信息具体如下:rn[img=https://img-bbs.csdn.net/upload/201509/08/1441707375_512721.png][/img]rnrn网上有一些朋友遇到了该问题,提供的办法为修改工程的[b]Architectures[/b]配置,但是在我当前工程中无效,不知哪位朋友能够解答一下,谢谢了!
请教大神,ld: 4 duplicate symbols for architecture x86_64???
[img=https://img-bbs.csdn.net/upload/201607/14/1468464069_723900.png][/img]rnrn请教大神,这个问题该怎么解决??急急急
The Mac Hacker’s Handbook
Mac OSX Hacker’s Handbook
arp -s ip mac
局域网有人ARP攻击,rn我是用这个命令去绑定mac地址的,rn可是,我把这条命里写入bat批处理文件里时,rn貌似不是执行一次就结束,rn而是一直不断的执行这条命令!rn[img=H:\desktop\1.JPG][/img]rnrn不知道是为什么?rn我只是想要它执行一次而已......rnrn
rtl8192eu_linux x86_64
rtl8192eu_linux x86_64,linux,无线网卡驱动,32位64位,本人在centOS7上安装可用
AMD64 Architecture Programmer’s Manual Volume 2
AMD64 Architecture Programmer’s Manual Volume 2,AMD CPU编程手册,第二卷
The Intel Architecture Software Developer's Manual Volum1-3
Intel架构的详细资料,共3卷,描述见下方。可以在intel官网上下载! The Intel Architecture Software Developer's Manual, Volume 1: Basic Architecture (Order Number 243190). The Intel Architecture Software Developer's Manual, Volume 2: Instruction Set Reference (Order Number 243191) is part of a three-volume set that describes the architecture and programming environment of all Intel Architecture processors. The Intel Architecture Software Developer's Manual, Volume 3: System Programing Guide (Order Number 243192). The Intel Architecture Software Developer's Manual, Volume 1, describes the basic architecture and programming environment of an Intel Architecture processor; the Intel Architecture Soft-ware Developer's Manual, Volume 2, describes the instructions set of the processor and the opcode structure. These two volumes are aimed at application programmers who are writing programs to run under existing operating systems or executives. The Intel Architecture Software Developer's Manual, Volume 3, describes the operating-system support environment of an Intel Architecture processor, including memory management, protection, task management, interrupt and exception handling, and system management mode. It also provides Intel Architecture processor compatibility information. This volume is aimed at operating-system and BIOS designers and programmers.
IA32&64 Architecture Programmer’s Manual Vol1-3
IA32&64 Architecture Programmer’s Manual Vol1-3
IA-32 Intel Architecture Software Developer's Manual
IA-32 Intel Architecture Software Developer's Manual
Android's Architecture Components Version 0.9 epub
Android's Architecture Components Version 0.9 英文epub 本资源转载自网络,如有侵权,请联系csdn管理员删除 查看此书详细信息请在美国亚马逊官网搜索此书
AMD64 Architecture Programmer’s Manual Volume 4.
AMD64 Architecture Programmer’s Manual Volume 4.AMD CPU编程手册,第四卷
AMD64 Architecture Programmer’s Manual Volume 5
AMD64 Architecture Programmer’s Manual Volume 5,AMD CPU编程手册,第五卷
相关热词 c++和c#哪个就业率高 c# 批量动态创建控件 c# 模块和程序集的区别 c# gmap 截图 c# 验证码图片生成类 c# 再次尝试 连接失败 c#开发编写规范 c# 压缩图片好麻烦 c#计算数组中的平均值 c#获取路由参数