2 u013408159 u013408159 于 2016.03.17 21:56 提问

程序包com.sun.org.apache.xalan.internal.utils不存在 2C

[INFO] Scanning for projects...
[WARNING]
[WARNING] Some problems were encountered while building the effective model for cn.hackingwu.easycms:EasyCMS:jar:0.0.1-SNAPSHOT
[WARNING] 'build.plugins.plugin.version' for org.apache.tomcat.maven:tomcat7-maven-plugin is missing. @ line 185, column 19
[WARNING]
[WARNING] It is highly recommended to fix these problems because they threaten the stability of your build.
[WARNING]
[WARNING] For this reason, future Maven versions might no longer support building such malformed projects.
[WARNING]
[INFO]

[INFO] ------------------------------------------------------------------------
[INFO] Building EasyCMS 0.0.1-SNAPSHOT
[INFO] ------------------------------------------------------------------------
[INFO]
[INFO] --- maven-clean-plugin:2.5:clean (default-clean) @ EasyCMS ---
[INFO] Deleting D:\java\MyProject\EasyCMS\target
[INFO]
[INFO] --- maven-resources-plugin:2.6:resources (default-resources) @ EasyCMS ---
[INFO] Using 'UTF-8' encoding to copy filtered resources.
[INFO] Copying 18 resources
[INFO]
[INFO] --- maven-compiler-plugin:3.0:compile (default-compile) @ EasyCMS ---
[INFO] Changes detected - recompiling the module!
[INFO] Compiling 120 source files to D:\java\MyProject\EasyCMS\target\classes
[INFO] -------------------------------------------------------------
[WARNING] COMPILATION WARNING :
[INFO] -------------------------------------------------------------
[WARNING] /D:/java/MyProject/EasyCMS/src/main/java/cn/easycms/service/OperlogsService.java: 某些输入文件使用了未经检查或不安全的操作。
[WARNING] /D:/java/MyProject/EasyCMS/src/main/java/cn/easycms/service/OperlogsService.java: 有关详细信息, 请使用 -Xlint:unchecked 重新编译。
[INFO] 2 warnings
[INFO] -------------------------------------------------------------
[INFO] -------------------------------------------------------------
[ERROR] COMPILATION ERROR :
[INFO] -------------------------------------------------------------
[ERROR] /D:/java/MyProject/EasyCMS/src/main/java/cn/easycms/service/TemplateChannelService.java:[9,47] 程序包com.sun.org.apache.xalan.internal.utils不存在
[INFO] 1 error
[INFO] -------------------------------------------------------------
[INFO] ------------------------------------------------------------------------
[INFO] BUILD FAILURE
[INFO] ------------------------------------------------------------------------
[INFO] Total time: 5.321 s
[INFO] Finished at: 2016-03-17T00:49:41+08:00
[INFO] Final Memory: 18M/168M
[INFO] ------------------------------------------------------------------------
[ERROR] Failed to execute goal org.apache.maven.plugins:maven-compiler-plugin:3.0:compile (default-compile) on project EasyCMS: Compilation failure
[ERROR] /D:/java/MyProject/EasyCMS/src/main/java/cn/easycms/service/TemplateChannelService.java:[9,47] 程序包com.sun.org.apache.xalan.internal.utils不存在
[ERROR] -> [Help 1]
[ERROR]
[ERROR] To see the full stack trace of the errors, re-run Maven with the -e switch.
[ERROR] Re-run Maven using the -X switch to enable full debug logging.
[ERROR]
[ERROR] For more information about the errors and possible solutions, please read the following articles:
[ERROR] [Help 1] http://cwiki.apache.org/confluence/display/MAVEN/MojoFailureException


1个回答

u013772876
u013772876   2016.03.18 16:52

那去你的本地库看看有没有这个包!而且这个错误这么明显,应该很好解决的!

u013772876
u013772876 回复波波宝: com.sun.org.apache.xalan.internal.utils 没有就从远程仓库下载下!
2 年多之前 回复
u013408159
u013408159 回复这是一个程序猿: 我看到的是rt.jar我的本地仓库是有这个包的,但是我在包里没有找到相应的位置。
2 年多之前 回复
u013408159
u013408159 回复这是一个程序猿: 可是一直没有找到这个包啊,这是什么包呢?
2 年多之前 回复
Csdn user default icon
上传中...
上传图片
插入图片
准确详细的回答,更有利于被提问者采纳,从而获得C币。复制、灌水、广告等回答会被删除,是时候展现真正的技术了!
其他相关推荐
java:程序包XXXX不存在
使用idea导入maven项目,编译时报错: java:程序包XXXX不存在
关于程序包不存在问题
javac -classpath  可以指定类路径 来编译java文件 比如 javac -classpath **\servlet-api.jar **.java 来编译某个java文件 要是需要指定多个路径呢? 答案是在linux上多个路径分隔符就是:而windows中多个路径分隔符就是; 比如 javac -cp classes;C:\Tomcat\lib\s
程序包xxx不存在,找不到符号
使用mvn命令打包时发现程序包xxx不存在,找不到符号。发现是因为maven编译时只加载maven库中的jar包,而手动添加到lib下的包maven无法自动加载。 解决办法: 在pom.xml文件中添加配置:<build> <plugins> <plugin> <groupId>org.apache.maven.plugins</g
maven发布时 系统软件包不存在的解决方法
maven项目在发布到服务器上时,若是项目中包含了java内部的一些隐藏类则会报如下错误: 如我使用了sun.swing.table就会出现如下错误: 软件包 sun.swing.table 不存在 符号: 类 DefaultTableCellHeaderRenderer 解决的方法是在maven的Pom.xml中加入如下plugin即可 org.
java (自写)程序包不存在问题解决
初学者在没有 IDE 下第一次运行打包文件的时候会出现这样的情况。 这是没有正确放置文件引起的。 首先要知道,类A、B 是相互独立的,而不是同 Exam 类放在一起。 而后,程序能够运行,互相调用,最重要的不是后缀名为 .java 的文件,而是后缀名为 .class 的文件。 这里为了说明各个类之间的关系,我用了一张图表示: 由于图上的关系,在A类中需要有打包语句: p
java 程序包不存在
在学习Java中的package的时候遇到一个这样的问题           今天在做Java例子的时候遇到一个这样的问题:错误: 程序包com.bjsxt.java140不存在         如图:                  这个例子涉及到了两个java文件:          一个是Cat.java:           [ja
ant编译时报错:程序包junit.framework不存在
代码附带率测试的时候,需要用ant编译工程,但编译不通过,报程序包junit.framework不存在的错;   可是直接运行junit测试的时候没有任何问题。 最后发现将junit的jar包复制到ANT_HOME的lib目录下就能正常编译了。 原因上网查了下看到这段描述: In order for code completion in eclipse to function you m
程序包com.sun.image.codec.jpeg不存在 的几种解决方案和遇到的坑
maven打包出现XXXX.java:[3,32] 程序包com.sun.image.codec.jpeg不存在总结一下有几种解决方案:1.不用jpeg这个类: ByteArrayOutputStream out = null; byte[] b = null; try { BufferedImage bi = ImageIO.read...
eclipse 错误 程序包不存在
将程序包所在的项目,右键,然后run as ,maven install
Error:(23, 25) 错误: 程序包R不存在
创建项目后,运行项目时Gradle Build 窗口却显示错误:程序包R不存在通常情况下是不会出现这个错误的。我是怎么遇到这个错误的呢?第一次创建项目,company Domain我使用的是:aven.com,但是创建过程在卡在了Building 'Calculator' Gradle Project info这个过程中,于是我选择了“Cancel”第二次创建项目,我还是使用相同的项目名称和项目路