在控制台上maven打包报错。

楼主刚看徐晓斌的《maven实战》,正在控制台上鼓捣maven呢,mvn clean compile,mvn clean test也成功,然后mvn clean package打包也成功,但是由于打出来的Jar包没有指定main方法的位置,我就按照书上的案例,加入maven-shade-plugin插件,在pom.xml加入这话话,一直打包都是错误的。
pom.xml文件配置如下:

<?xml version="1.0" encoding="UTF-8"?>
<project xmlns="http://maven.apache.org/POM/4.0.0" xmlns:xsi="http://www.w3.org/2001/XMLSchema-instance"
  xsi:schemaLocation="http://maven.apache.org/POM/4.0.0 http://maven.apache.org/xsd/maven-4.0.0.xsd">
  <modelVersion>4.0.0</modelVersion>

  <groupId>xx.xx.xxx</groupId>
  <artifactId>hello-maven</artifactId>
  <version>1.0-SNAPSHOT</version>
  <packaging>jar</packaging>

  <properties>
    <project.build.sourceEncoding>UTF-8</project.build.sourceEncoding>
  </properties>

  <dependencies>
    <dependency>
      <groupId>junit</groupId>
      <artifactId>junit</artifactId>
      <version>3.8.1</version>
      <scope>test</scope>
    </dependency>
  </dependencies>

 <build>
    <plugins>
        <plugin>
            <groupId>org.apache.maven.plugins</groupId>
            <artifactId>maven-compiler-plugin</artifactId>
            <configuration>
                <source>1.6</source>
                <target>1.6</target>
            </configuration>
        </plugin>

      <plugin>
        <groupId>org.apache.maven.plugins</groupId>
        <artifactId>maven-shade-plugin</artifactId>
        <version>1.2.1</version>
        <configuration>
          <transformers>
         <transformer implementation = "org.apache.maven.plugins.shade.resource.MainifestResourceTransformer">
         <mainClass>xx.xxx.xxx.hellomaven.App</mainClass>
         </transformer>
      </transformers>
        </configuration>
        <executions>
          <execution>
            <phase>package</phase>
            <goals>
              <goal>shade</goal>
            </goals>
          </execution>
        </executions>
      </plugin>
    </plugins>
  </build> 
</project>

控制台报错信息如下:

 [INFO] BUILD FAILURE
[INFO] ------------------------------------------------------------------------
[INFO] Total time: 1.731s
[INFO] Finished at: Tue Mar 29 11:40:17 CST 2016
[INFO] Final Memory: 10M/24M
[INFO] ------------------------------------------------------------------------
[ERROR] Failed to execute goal org.apache.maven.plugins:maven-shade-plugin:1.2.1
:shade (default) on project hello-maven: Unable to parse configuration of mojo o
rg.apache.maven.plugins:maven-shade-plugin:1.2.1:shade: ClassNotFoundException:
Class name which was explicitly given in configuration using 'implementation' at
tribute: 'org.apache.maven.plugins.shade.resource.MainifestResourceTransformer'
cannot be loaded -> [Help 1]
[ERROR]
[ERROR] To see the full stack trace of the errors, re-run Maven with the -e swit
ch.
[ERROR] Re-run Maven using the -X switch to enable full debug logging.
[ERROR]
[ERROR] For more information about the errors and possible solutions, please rea
d the following articles:
[ERROR] [Help 1] http://cwiki.apache.org/confluence/display/MAVEN/PluginConfigur
ationException

~\m2\repository\org\apache\maven\plugins\maven-compiler-plugin
里面居然是2.3.2版本,我的本地仓库下载下载下来的不是指定的那个1.2.1版本,这是怎么回事?

4个回答

http://bbs.csdn.net/topics/380145658?page=1 希望这个网页可以帮到你

~\m2\repository\org\apache\maven\plugins\maven-compiler-plugin
里面居然是2.3.2版本,我的本地仓库下载下载下来的不是指定的那个1.2.1版本,这是怎么回事?

已经解决问题了,我的解决方案是:重新去官网看这个补丁的地址,然后重新mvn clean package,其次,我写的类名错了,调用的类名有错,应该改为:
ManifestResourceTransformer

org.apache.maven.plugins.shade.resource.MainifestResourceTransformer 类名打错了 ManifestResourceTransformer
提示类找不到

Csdn user default icon
上传中...
上传图片
插入图片
抄袭、复制答案,以达到刷声望分或其他目的的行为,在CSDN问答是严格禁止的,一经发现立刻封号。是时候展现真正的技术了!
其他相关推荐
maven打包报错,用命令打包的mvn package 接着报这个错,急等
![图片说明](https://img-ask.csdn.net/upload/201802/02/1517553010_852643.png) ![图片说明](https://img-ask.csdn.net/upload/201802/02/1517553902_211162.png) jdk用的1.8 pom.xml配置maven之后 ``` <build> <plugins> <plugin> <groupId>org.apache.maven.plugins</groupId> <artifactId>maven-compiler-plugin</artifactId> <version>3.3</version> <configuration> <source>1.8</source> <target>1.8</target> </configuration> </plugin> </plugins> </build> ``` 又报错 ![图片说明](https://img-ask.csdn.net/upload/201802/02/1517557255_958482.png) 通过 ``` <build> <plugins> <plugin> <groupId>org.apache.maven.plugins</groupId> <artifactId>maven-compiler-plugin</artifactId> <version>3.3</version> <configuration> <source>1.8</source> <target>1.8</target> <encoding>UTF-8</encoding> <compilerArguments> <verbose /> <bootclasspath>${java.home}\lib\rt.jar;${java.home}\lib\jce.jar</bootclasspath> </compilerArguments> </configuration> </plugin> </plugins> </build> ``` 解决 现在发布又出现了新问题 ![图片说明](https://img-ask.csdn.net/upload/201802/02/1517560036_768869.png)
maven打包报错Unsupported major.minor version 51.0
我把eclipse换成jdk1.6,系统环境换成jdk1.6但是maven打包时 还是报下面的错误,求大神指导 Exception in thread "main" java.lang.UnsupportedClassVersionError: org/apache/maven/cli/MavenCli : Unsupported major.minor version 51.0 at java.lang.ClassLoader.defineClass1(Native Method) at java.lang.ClassLoader.defineClassCond(ClassLoader.java:631) at java.lang.ClassLoader.defineClass(ClassLoader.java:615) at java.security.SecureClassLoader.defineClass(SecureClassLoader.java:141) at java.net.URLClassLoader.defineClass(URLClassLoader.java:283) at java.net.URLClassLoader.access$000(URLClassLoader.java:58) at java.net.URLClassLoader$1.run(URLClassLoader.java:197) at java.security.AccessController.doPrivileged(Native Method) at java.net.URLClassLoader.findClass(URLClassLoader.java:190) at org.codehaus.plexus.classworlds.realm.ClassRealm.loadClassFromSelf(ClassRealm.java:401) at org.codehaus.plexus.classworlds.strategy.SelfFirstStrategy.loadClass(SelfFirstStrategy.java:42) at org.codehaus.plexus.classworlds.realm.ClassRealm.unsynchronizedLoadClass(ClassRealm.java:271) at org.codehaus.plexus.classworlds.realm.ClassRealm.loadClass(ClassRealm.java:254) at org.codehaus.plexus.classworlds.realm.ClassRealm.loadClass(ClassRealm.java:239) at org.codehaus.plexus.classworlds.launcher.Launcher.getMainClass(Launcher.java:144) at org.codehaus.plexus.classworlds.launcher.Launcher.launchEnhanced(Launcher.java:266) at org.codehaus.plexus.classworlds.launcher.Launcher.launch(Launcher.java:229) at org.codehaus.plexus.classworlds.launcher.Launcher.mainWithExitCode(Launcher.java:415) at org.codehaus.plexus.classworlds.launcher.Launcher.main(Launcher.java:356) at org.codehaus.classworlds.Launcher.main(Launcher.java:47)
maven module 打包报错问题
maven结构如下: ![图片说明](https://img-ask.csdn.net/upload/201707/10/1499654181_120999.png) 当加入web时打包报提示: **Failed to execute goal org.apache.maven.plugins:maven-war-plugin:2.2:war (default-war)** 后增加 **<plugins> <plugin> <groupId>org.apache.maven.plugins</groupId> <artifactId>maven-war-plugin</artifactId> <version>2.4</version> <configuration> <webResources> <resource> <directory>src\main\webapp</directory> </resource> </webResources> </configuration> </plugin> </plugins>** 却又提示 **[INFO] Processing war project [INFO] Copying webapp webResources [E:\workspace\itm.root\itm.client\src\main\webapp] to [E:\workspace\itm.root\itm.client\target\itm.client] [INFO] Copying webapp resources [E:\workspace\itm.root\itm.client\src\main\webapp] java.lang.Error: Cleaner terminated abnormally at sun.misc.Cleaner$1.run(Cleaner.java:148) at sun.misc.Cleaner$1.run(Cleaner.java:145) at java.security.AccessController.doPrivileged(Native Method) at sun.misc.Cleaner.clean(Cleaner.java:145) at sun.nio.ch.FileChannelImpl.unmap(FileChannelImpl.java:849) at sun.nio.ch.FileChannelImpl.transferFromFileChannel(FileChannelImpl.java:647) at sun.nio.ch.FileChannelImpl.transferFrom(FileChannelImpl.java:708) at org.codehaus.plexus.util.FileUtils.doCopyFile(FileUtils.java:1077) at org.codehaus.plexus.util.FileUtils.copyFile(FileUtils.java:1049) at org.apache.maven.plugin.war.packaging.AbstractWarPackagingTask.copyFile(AbstractWarPackagingTask.java:334) at org.apache.maven.plugin.war.packaging.AbstractWarPackagingTask$1.registered(AbstractWarPackagingTask.java:154) at org.apache.maven.plugin.war.util.WebappStructure.registerFile(WebappStructure.java:207) at org.apache.maven.plugin.war.packaging.AbstractWarPackagingTask.copyFile(AbstractWarPackagingTask.java:149) at org.apache.maven.plugin.war.packaging.ArtifactsPackagingTask.performPackaging(ArtifactsPackagingTask.java:110) at org.apache.maven.plugin.war.packaging.WarProjectPackagingTask.handleArtifacts(WarProjectPackagingTask.java:194) at org.apache.maven.plugin.war.packaging.WarProjectPackagingTask.performPackaging(WarProjectPackagingTask.java:106) at org.apache.maven.plugin.war.AbstractWarMojo.buildWebapp(AbstractWarMojo.java:505) at org.apache.maven.plugin.war.AbstractWarMojo.buildExplodedWebapp(AbstractWarMojo.java:433) at org.apache.maven.plugin.war.WarMojo.performPackaging(WarMojo.java:213) at org.apache.maven.plugin.war.WarMojo.execute(WarMojo.java:175) at org.apache.maven.plugin.DefaultBuildPluginManager.executeMojo(DefaultBuildPluginManager.java:134) at org.apache.maven.lifecycle.internal.MojoExecutor.execute(MojoExecutor.java:207) at org.apache.maven.lifecycle.internal.MojoExecutor.execute(MojoExecutor.java:153) at org.apache.maven.lifecycle.internal.MojoExecutor.execute(MojoExecutor.java:145) at org.apache.maven.lifecycle.internal.LifecycleModuleBuilder.buildProject(LifecycleModuleBuilder.java:116) at org.apache.maven.lifecycle.internal.LifecycleModuleBuilder.buildProject(LifecycleModuleBuilder.java:80) at org.apache.maven.lifecycle.internal.builder.singlethreaded.SingleThreadedBuilder.build(SingleThreadedBuilder.java:51) at org.apache.maven.lifecycle.internal.LifecycleStarter.execute(LifecycleStarter.java:128) at org.apache.maven.DefaultMaven.doExecute(DefaultMaven.java:307) at org.apache.maven.DefaultMaven.doExecute(DefaultMaven.java:193) at org.apache.maven.DefaultMaven.execute(DefaultMaven.java:106) at org.apache.maven.cli.MavenCli.execute(MavenCli.java:863) at org.apache.maven.cli.MavenCli.doMain(MavenCli.java:288) at org.apache.maven.cli.MavenCli.main(MavenCli.java:199) at sun.reflect.NativeMethodAccessorImpl.invoke0(Native Method) at sun.reflect.NativeMethodAccessorImpl.invoke(NativeMethodAccessorImpl.java:62) at sun.reflect.DelegatingMethodAccessorImpl.invoke(DelegatingMethodAccessorImpl.java:43) at java.lang.reflect.Method.invoke(Method.java:498) at org.codehaus.plexus.classworlds.launcher.Launcher.launchEnhanced(Launcher.java:289) at org.codehaus.plexus.classworlds.launcher.Launcher.launch(Launcher.java:229) at org.codehaus.plexus.classworlds.launcher.Launcher.mainWithExitCode(Launcher.java:415) at org.codehaus.plexus.classworlds.launcher.Launcher.main(Launcher.java:356) Caused by: java.io.IOException: 试图访问无效的地址。 at sun.nio.ch.FileChannelImpl.unmap0(Native Method) at sun.nio.ch.FileChannelImpl.access$000(FileChannelImpl.java:50) at sun.nio.ch.FileChannelImpl$Unmapper.run(FileChannelImpl.java:826) at sun.misc.Cleaner.clean(Cleaner.java:143) ... 38 more **
eclipse导入maven项目报错
eclipse导入maven项目报错 ![图片说明](https://img-ask.csdn.net/upload/201907/20/1563627514_583711.png)
maven配置私服打包报错Failed to execute goal org.apache.maven.plugins:maven-compiler-plugin:3.5:compile
直接使用阿里云镜像仓库打包没问题,替换为私服镜像仓库后报错: 就是pom.xml中的plugin报错 ``` <plugin> <groupId>org.apache.maven.plugins</groupId> <artifactId>maven-compiler-plugin</artifactId> <version>3.5</version> <configuration> <source>1.8</source> <target>1.8</target> <encoding>UTF-8</encoding> </configuration> </plugin> ``` 网上找了半天说这个指定的jdk版本的问题,查了一下版本没问题都是1.8 报错内容: [ERROR] Failed to execute goal org.apache.maven.plugins:maven-compiler-plugin:3.5:compile (default-compile) on project mytest-web: Execution default-compile of goal org.apache.maven.plugins:maven-compiler-plugin:3.5:compile failed: Plugin org.apache.maven.plugins:maven-compiler-plugin:3.5 or one of its dependencies could not be resolved: Failed to collect dependencies at org.apache.maven.plugins:maven-compiler-plugin:jar:3.5 -> org.apache.maven:maven-toolchain:jar:2.2.1 -> org.apache.maven:maven-core:jar:2.2.1 -> commons-cli:commons-cli:jar:1.2: Failed to read artifact descriptor for commons-cli:commons-cli:jar:1.2: Failure to find org.apache:apache:pom:4 in http://localhost:8081/nexus/content/groups/public/ was cached in the local repository, resolution will not be reattempted until the update interval of public has elapsed or updates are forced -> [Help 1] org.apache.maven.lifecycle.LifecycleExecutionException: Failed to execute goal org.apache.maven.plugins:maven-compiler-plugin:3.5:compile (default-compile) on project mytest-web: Execution default-compile of goal org.apache.maven.plugins:maven-compiler-plugin:3.5:compile failed: Plugin org.apache.maven.plugins:maven-compiler-plugin:3.5 or one of its dependencies could not be resolved: Failed to collect dependencies at org.apache.maven.plugins:maven-compiler-plugin:jar:3.5 -> org.apache.maven:maven-toolchain:jar:2.2.1 -> org.apache.maven:maven-core:jar:2.2.1 -> commons-cli:commons-cli:jar:1.2 at org.apache.maven.lifecycle.internal.MojoExecutor.execute(MojoExecutor.java:213) at org.apache.maven.lifecycle.internal.MojoExecutor.execute(MojoExecutor.java:154) at org.apache.maven.lifecycle.internal.MojoExecutor.execute(MojoExecutor.java:146) at org.apache.maven.lifecycle.internal.LifecycleModuleBuilder.buildProject(LifecycleModuleBuilder.java:117) at org.apache.maven.lifecycle.internal.LifecycleModuleBuilder.buildProject(LifecycleModuleBuilder.java:81) at org.apache.maven.lifecycle.internal.builder.singlethreaded.SingleThreadedBuilder.build(SingleThreadedBuilder.java:51) at org.apache.maven.lifecycle.internal.LifecycleStarter.execute(LifecycleStarter.java:128) at org.apache.maven.DefaultMaven.doExecute(DefaultMaven.java:309) at org.apache.maven.DefaultMaven.doExecute(DefaultMaven.java:194) at org.apache.maven.DefaultMaven.execute(DefaultMaven.java:107) at org.apache.maven.cli.MavenCli.execute(MavenCli.java:993) at org.apache.maven.cli.MavenCli.doMain(MavenCli.java:345) at org.apache.maven.cli.MavenCli.main(MavenCli.java:191) at sun.reflect.NativeMethodAccessorImpl.invoke0(Native Method) at sun.reflect.NativeMethodAccessorImpl.invoke(NativeMethodAccessorImpl.java:62) at sun.reflect.DelegatingMethodAccessorImpl.invoke(DelegatingMethodAccessorImpl.java:43) at java.lang.reflect.Method.invoke(Method.java:498) at org.codehaus.plexus.classworlds.launcher.Launcher.launchEnhanced(Launcher.java:289) at org.codehaus.plexus.classworlds.launcher.Launcher.launch(Launcher.java:229) at org.codehaus.plexus.classworlds.launcher.Launcher.mainWithExitCode(Launcher.java:415) at org.codehaus.plexus.classworlds.launcher.Launcher.main(Launcher.java:356) Caused by: org.apache.maven.plugin.PluginExecutionException: Execution default-compile of goal org.apache.maven.plugins:maven-compiler-plugin:3.5:compile failed: Plugin org.apache.maven.plugins:maven-compiler-plugin:3.5 or one of its dependencies could not be resolved: Failed to collect dependencies at org.apache.maven.plugins:maven-compiler-plugin:jar:3.5 -> org.apache.maven:maven-toolchain:jar:2.2.1 -> org.apache.maven:maven-core:jar:2.2.1 -> commons-cli:commons-cli:jar:1.2 at org.apache.maven.plugin.DefaultBuildPluginManager.executeMojo(DefaultBuildPluginManager.java:106) at org.apache.maven.lifecycle.internal.MojoExecutor.execute(MojoExecutor.java:208) ... 20 more Caused by: org.apache.maven.plugin.PluginResolutionException: Plugin org.apache.maven.plugins:maven-compiler-plugin:3.5 or one of its dependencies could not be resolved: Failed to collect dependencies at org.apache.maven.plugins:maven-compiler-plugin:jar:3.5 -> org.apache.maven:maven-toolchain:jar:2.2.1 -> org.apache.maven:maven-core:jar:2.2.1 -> commons-cli:commons-cli:jar:1.2 at org.apache.maven.plugin.internal.DefaultPluginDependenciesResolver.resolveInternal(DefaultPluginDependenciesResolver.java:214) at org.apache.maven.plugin.internal.DefaultPluginDependenciesResolver.resolve(DefaultPluginDependenciesResolver.java:149) at org.apache.maven.plugin.internal.DefaultMavenPluginManager.createPluginRealm(DefaultMavenPluginManager.java:402) at org.apache.maven.plugin.internal.DefaultMavenPluginManager.setupPluginRealm(DefaultMavenPluginManager.java:374) at org.apache.maven.plugin.DefaultBuildPluginManager.getPluginRealm(DefaultBuildPluginManager.java:231) at org.apache.maven.plugin.DefaultBuildPluginManager.executeMojo(DefaultBuildPluginManager.java:102) ... 21 more Caused by: org.eclipse.aether.collection.DependencyCollectionException: Failed to collect dependencies at org.apache.maven.plugins:maven-compiler-plugin:jar:3.5 -> org.apache.maven:maven-toolchain:jar:2.2.1 -> org.apache.maven:maven-core:jar:2.2.1 -> commons-cli:commons-cli:jar:1.2 at org.eclipse.aether.internal.impl.DefaultDependencyCollector.collectDependencies(DefaultDependencyCollector.java:300) at org.eclipse.aether.internal.impl.DefaultRepositorySystem.collectDependencies(DefaultRepositorySystem.java:325) at org.apache.maven.plugin.internal.DefaultPluginDependenciesResolver.resolveInternal(DefaultPluginDependenciesResolver.java:202) ... 26 more Caused by: org.eclipse.aether.resolution.ArtifactDescriptorException: Failed to read artifact descriptor for commons-cli:commons-cli:jar:1.2 at org.apache.maven.repository.internal.DefaultArtifactDescriptorReader.loadPom(DefaultArtifactDescriptorReader.java:330) at org.apache.maven.repository.internal.DefaultArtifactDescriptorReader.readArtifactDescriptor(DefaultArtifactDescriptorReader.java:199) at org.eclipse.aether.internal.impl.DefaultDependencyCollector.resolveCachedArtifactDescriptor(DefaultDependencyCollector.java:544) at org.eclipse.aether.internal.impl.DefaultDependencyCollector.getArtifactDescriptorResult(DefaultDependencyCollector.java:528) at org.eclipse.aether.internal.impl.DefaultDependencyCollector.processDependency(DefaultDependencyCollector.java:418) at org.eclipse.aether.internal.impl.DefaultDependencyCollector.processDependency(DefaultDependencyCollector.java:372) at org.eclipse.aether.internal.impl.DefaultDependencyCollector.process(DefaultDependencyCollector.java:360) at org.eclipse.aether.internal.impl.DefaultDependencyCollector.doRecurse(DefaultDependencyCollector.java:513) at org.eclipse.aether.internal.impl.DefaultDependencyCollector.processDependency(DefaultDependencyCollector.java:467) at org.eclipse.aether.internal.impl.DefaultDependencyCollector.processDependency(DefaultDependencyCollector.java:372) at org.eclipse.aether.internal.impl.DefaultDependencyCollector.process(DefaultDependencyCollector.java:360) at org.eclipse.aether.internal.impl.DefaultDependencyCollector.doRecurse(DefaultDependencyCollector.java:513) at org.eclipse.aether.internal.impl.DefaultDependencyCollector.processDependency(DefaultDependencyCollector.java:467) at org.eclipse.aether.internal.impl.DefaultDependencyCollector.processDependency(DefaultDependencyCollector.java:372) at org.eclipse.aether.internal.impl.DefaultDependencyCollector.process(DefaultDependencyCollector.java:360) at org.eclipse.aether.internal.impl.DefaultDependencyCollector.collectDependencies(DefaultDependencyCollector.java:263) ... 28 more Caused by: org.apache.maven.model.resolution.UnresolvableModelException: Failure to find org.apache:apache:pom:4 in http://localhost:8081/nexus/content/groups/public/ was cached in the local repository, resolution will not be reattempted until the update interval of public has elapsed or updates are forced at org.apache.maven.repository.internal.DefaultModelResolver.resolveModel(DefaultModelResolver.java:178) at org.apache.maven.repository.internal.DefaultModelResolver.resolveModel(DefaultModelResolver.java:224) at org.apache.maven.model.building.DefaultModelBuilder.readParentExternally(DefaultModelBuilder.java:1051) at org.apache.maven.model.building.DefaultModelBuilder.readParent(DefaultModelBuilder.java:829) at org.apache.maven.model.building.DefaultModelBuilder.build(DefaultModelBuilder.java:331) at org.apache.maven.repository.internal.DefaultArtifactDescriptorReader.loadPom(DefaultArtifactDescriptorReader.java:321) ... 43 more Caused by: org.eclipse.aether.resolution.ArtifactResolutionException: Failure to find org.apache:apache:pom:4 in http://localhost:8081/nexus/content/groups/public/ was cached in the local repository, resolution will not be reattempted until the update interval of public has elapsed or updates are forced at org.eclipse.aether.internal.impl.DefaultArtifactResolver.resolve(DefaultArtifactResolver.java:453) at org.eclipse.aether.internal.impl.DefaultArtifactResolver.resolveArtifacts(DefaultArtifactResolver.java:255) at org.eclipse.aether.internal.impl.DefaultArtifactResolver.resolveArtifact(DefaultArtifactResolver.java:232) at org.apache.maven.repository.internal.DefaultModelResolver.resolveModel(DefaultModelResolver.java:174) ... 48 more Caused by: org.eclipse.aether.transfer.ArtifactNotFoundException: Failure to find org.apache:apache:pom:4 in http://localhost:8081/nexus/content/groups/public/ was cached in the local repository, resolution will not be reattempted until the update interval of public has elapsed or updates are forced at org.eclipse.aether.internal.impl.DefaultUpdateCheckManager.newException(DefaultUpdateCheckManager.java:240) at org.eclipse.aether.internal.impl.DefaultUpdateCheckManager.checkArtifact(DefaultUpdateCheckManager.java:215) at org.eclipse.aether.internal.impl.DefaultArtifactResolver.gatherDownloads(DefaultArtifactResolver.java:594) at org.eclipse.aether.internal.impl.DefaultArtifactResolver.performDownloads(DefaultArtifactResolver.java:512) at org.eclipse.aether.internal.impl.DefaultArtifactResolver.resolve(DefaultArtifactResolver.java:430) ... 51 more [ERROR] [ERROR] Re-run Maven using the -X switch to enable full debug logging. [ERROR] [ERROR] For more information about the errors and possible solutions, please read the following articles: [ERROR] [Help 1] http://cwiki.apache.org/confluence/display/MAVEN/PluginResolutionException
导入maven项目报错pom.xlm
1、导入spring boot maven 项目时子模块pom.xml报错 2、![图片说明](https://img-ask.csdn.net/upload/201910/10/1570699619_216667.png) 3、现在jdk1.8.0 maven 3.5.2 4、spring boot主项目不报错,子项目报错![图片说明](https://img-ask.csdn.net/upload/201910/11/1570755539_914360.png)
maven 打包报如下错误
org.apache.maven.lifecycle.LifecycleExecutionException: Failed to execute goal org.apache.maven.plugins:maven-compiler-plugin:2.5.1:compile (default-compile) on project ship-base-web: Compilation failure at org.apache.maven.lifecycle.internal.MojoExecutor.execute(MojoExecutor.java:212) at org.apache.maven.lifecycle.internal.MojoExecutor.execute(MojoExecutor.java:153) at org.apache.maven.lifecycle.internal.MojoExecutor.execute(MojoExecutor.java:145) at org.apache.maven.lifecycle.internal.LifecycleModuleBuilder.buildProject(LifecycleModuleBuilder.java:116) at org.apache.maven.lifecycle.internal.LifecycleModuleBuilder.buildProject(LifecycleModuleBuilder.java:80) at org.apache.maven.lifecycle.internal.builder.singlethreaded.SingleThreadedBuilder.build(SingleThreadedBuilder.java:51) at org.apache.maven.lifecycle.internal.LifecycleStarter.execute(LifecycleStarter.java:128) at org.apache.maven.DefaultMaven.doExecute(DefaultMaven.java:307) at org.apache.maven.DefaultMaven.doExecute(DefaultMaven.java:193) at org.apache.maven.DefaultMaven.execute(DefaultMaven.java:106) at org.apache.maven.cli.MavenCli.execute(MavenCli.java:862) at org.apache.maven.cli.MavenCli.doMain(MavenCli.java:286) at org.apache.maven.cli.MavenCli.main(MavenCli.java:197) at sun.reflect.NativeMethodAccessorImpl.invoke0(Native Method) at sun.reflect.NativeMethodAccessorImpl.invoke(NativeMethodAccessorImpl.java:57) at sun.reflect.DelegatingMethodAccessorImpl.invoke(DelegatingMethodAccessorImpl.java:43) at java.lang.reflect.Method.invoke(Method.java:606) at org.codehaus.plexus.classworlds.launcher.Launcher.launchEnhanced(Launcher.java:289) at org.codehaus.plexus.classworlds.launcher.Launcher.launch(Launcher.java:229) at org.codehaus.plexus.classworlds.launcher.Launcher.mainWithExitCode(Launcher.java:415) at org.codehaus.plexus.classworlds.launcher.Launcher.main(Launcher.java:356) Caused by: org.apache.maven.plugin.CompilationFailureException: Compilation failure at org.apache.maven.plugin.AbstractCompilerMojo.execute(AbstractCompilerMojo.java:729) at org.apache.maven.plugin.CompilerMojo.execute(CompilerMojo.java:128) at org.apache.maven.plugin.DefaultBuildPluginManager.executeMojo(DefaultBuildPluginManager.java:134) at org.apache.maven.lifecycle.internal.MojoExecutor.execute(MojoExecutor.java:208) ... 20 more [ERROR] [ERROR] Re-run Maven using the -X switch to enable full debug logging. [ERROR] [ERROR] For more information about the errors and possible solutions, please read the following articles: [ERROR] [Help 1] http://cwiki.apache.org/confluence/display/MAVEN/MojoFailureException
IDEA使用Maven打包Spark项目报错
报错日志如下: F:\IdeaProjects\testspark>mvn clean package [ERROR] Error executing Maven. [ERROR] 1 problem was encountered while building the effective settings [FATAL] Non-parseable settings F:\Program Files\apache-maven-3.5.0\bin\..\conf\settings.xml: expected START_TAG or END_TAG not TEXT (position: TEXT seen ...</url>\ua0\ua0\t\t\ua0\ua0\ua0\ua0\ua0\ua0 \ua0\ua0\n\t</mirror>\ua0\n </... @164:5) @ F:\Program Files\apache-maven-3.5.0\bin\..\conf\settings.xml, line 164, column 5 日志说setting.xml文件第165行的标签有问题,但是我检查后没发现有哪里不对啊,如下图: ![图片说明](https://img-ask.csdn.net/upload/201708/13/1502635652_248904.png) 有没有知道如何解决的呢?
springboot +shiro+maven 打包运行项目报错
运行登录的时候报下边错误,大神能给看看嘛? ===2019-12-10 13:31:07.250 WARN org.apache.shiro.authc.AbstractAuthenticator Line:216 - Authentication failed for token submission [org.apache.shiro.authc.UsernamePasswordToken - root, rememberMe=false (0:0:0:0:0:0:0:1)]. Possible unexpected error? (Typical or expected login exceptions should extend from AuthenticationException). java.lang.ClassCastException: class org.apache.shiro.authc.UsernamePasswordToken cannot be cast to class com.qiyuansoft.unicorn.common.realm.QYToken (org.apache.shiro.authc.UsernamePasswordToken and com.qiyuansoft.unicorn.common.realm.QYToken are in unnamed module of loader org.apache.catalina.loader.ParallelWebappClassLoader @651745d7) at com.qiyuansoft.unicorn.common.realm.QYLoginRealm.doGetAuthenticationInfo(QYLoginRealm.java:149) at org.apache.shiro.realm.AuthenticatingRealm.getAuthenticationInfo(AuthenticatingRealm.java:571) at org.apache.shiro.authc.pam.ModularRealmAuthenticator.doSingleRealmAuthentication(ModularRealmAuthenticator.java:180) at org.apache.shiro.authc.pam.ModularRealmAuthenticator.doAuthenticate(ModularRealmAuthenticator.java:267) at org.apache.shiro.authc.AbstractAuthenticator.authenticate(AbstractAuthenticator.java:198) at org.apache.shiro.mgt.AuthenticatingSecurityManager.authenticate(AuthenticatingSecurityManager.java:106) at org.apache.shiro.mgt.DefaultSecurityManager.login(DefaultSecurityManager.java:274) at org.apache.shiro.subject.support.DelegatingSubject.login(DelegatingSubject.java:260) at org.apache.shiro.web.filter.authc.AuthenticatingFilter.executeLogin(AuthenticatingFilter.java:53) at org.apache.shiro.web.filter.authc.FormAuthenticationFilter.onAccessDenied(FormAuthenticationFilter.java:154) at org.apache.shiro.web.filter.AccessControlFilter.onAccessDenied(AccessControlFilter.java:133) at org.apache.shiro.web.filter.AccessControlFilter.onPreHandle(AccessControlFilter.java:162) at org.apache.shiro.web.filter.PathMatchingFilter.isFilterChainContinued(PathMatchingFilter.java:203) at org.apache.shiro.web.filter.PathMatchingFilter.preHandle(PathMatchingFilter.java:178) at org.apache.shiro.web.servlet.AdviceFilter.doFilterInternal(AdviceFilter.java:131) at org.apache.shiro.web.servlet.OncePerRequestFilter.doFilter(OncePerRequestFilter.java:125) at org.apache.catalina.core.ApplicationFilterChain.internalDoFilter(ApplicationFilterChain.java:193) at org.apache.catalina.core.ApplicationFilterChain.doFilter(ApplicationFilterChain.java:166) at org.apache.shiro.web.servlet.ProxiedFilterChain.doFilter(ProxiedFilterChain.java:61) at org.apache.shiro.web.servlet.AdviceFilter.executeChain(AdviceFilter.java:108) at org.apache.shiro.web.servlet.AdviceFilter.doFilterInternal(AdviceFilter.java:137) at org.apache.shiro.web.servlet.OncePerRequestFilter.doFilter(OncePerRequestFilter.java:125) at org.apache.shiro.web.servlet.ProxiedFilterChain.doFilter(ProxiedFilterChain.java:66) at org.apache.shiro.web.servlet.AbstractShiroFilter.executeChain(AbstractShiroFilter.java:449) at org.apache.shiro.web.servlet.AbstractShiroFilter$1.call(AbstractShiroFilter.java:365) at org.apache.shiro.subject.support.SubjectCallable.doCall(SubjectCallable.java:90) at org.apache.shiro.subject.support.SubjectCallable.call(SubjectCallable.java:83) at org.apache.shiro.subject.support.DelegatingSubject.execute(DelegatingSubject.java:387) at org.apache.shiro.web.servlet.AbstractShiroFilter.doFilterInternal(AbstractShiroFilter.java:362) at org.apache.shiro.web.servlet.OncePerRequestFilter.doFilter(OncePerRequestFilter.java:125) at org.apache.catalina.core.ApplicationFilterChain.internalDoFilter(ApplicationFilterChain.java:193) at org.apache.catalina.core.ApplicationFilterChain.doFilter(ApplicationFilterChain.java:166) at org.springframework.web.filter.RequestContextFilter.doFilterInternal(RequestContextFilter.java:99) at org.springframework.web.filter.OncePerRequestFilter.doFilter(OncePerRequestFilter.java:107) at org.apache.catalina.core.ApplicationFilterChain.internalDoFilter(ApplicationFilterChain.java:193) at org.apache.catalina.core.ApplicationFilterChain.doFilter(ApplicationFilterChain.java:166) at org.springframework.web.filter.FormContentFilter.doFilterInternal(FormContentFilter.java:92) at org.springframework.web.filter.OncePerRequestFilter.doFilter(OncePerRequestFilter.java:107) at org.apache.catalina.core.ApplicationFilterChain.internalDoFilter(ApplicationFilterChain.java:193) at org.apache.catalina.core.ApplicationFilterChain.doFilter(ApplicationFilterChain.java:166) at org.springframework.web.filter.HiddenHttpMethodFilter.doFilterInternal(HiddenHttpMethodFilter.java:93) at org.springframework.web.filter.OncePerRequestFilter.doFilter(OncePerRequestFilter.java:107) at org.apache.catalina.core.ApplicationFilterChain.internalDoFilter(ApplicationFilterChain.java:193) at org.apache.catalina.core.ApplicationFilterChain.doFilter(ApplicationFilterChain.java:166) at org.springframework.boot.web.servlet.support.ErrorPageFilter.doFilter(ErrorPageFilter.java:130) at org.springframework.boot.web.servlet.support.ErrorPageFilter.access$000(ErrorPageFilter.java:66) at org.springframework.boot.web.servlet.support.ErrorPageFilter$1.doFilterInternal(ErrorPageFilter.java:105) at org.springframework.web.filter.OncePerRequestFilter.doFilter(OncePerRequestFilter.java:107) at org.springframework.boot.web.servlet.support.ErrorPageFilter.doFilter(ErrorPageFilter.java:123) at org.apache.catalina.core.ApplicationFilterChain.internalDoFilter(ApplicationFilterChain.java:193) at org.apache.catalina.core.ApplicationFilterChain.doFilter(ApplicationFilterChain.java:166) at org.springframework.web.filter.CharacterEncodingFilter.doFilterInternal(CharacterEncodingFilter.java:200) at org.springframework.web.filter.OncePerRequestFilter.doFilter(OncePerRequestFilter.java:107) at org.apache.catalina.core.ApplicationFilterChain.internalDoFilter(ApplicationFilterChain.java:193) at org.apache.catalina.core.ApplicationFilterChain.doFilter(ApplicationFilterChain.java:166) at org.apache.catalina.core.StandardWrapperValve.invoke(StandardWrapperValve.java:199) at org.apache.catalina.core.StandardContextValve.invoke(StandardContextValve.java:96) at org.apache.catalina.authenticator.AuthenticatorBase.invoke(AuthenticatorBase.java:493) at org.apache.catalina.core.StandardHostValve.invoke(StandardHostValve.java:140) at org.apache.catalina.valves.ErrorReportValve.invoke(ErrorReportValve.java:81) at org.apache.catalina.valves.AbstractAccessLogValve.invoke(AbstractAccessLogValve.java:650) at org.apache.catalina.core.StandardEngineValve.invoke(StandardEngineValve.java:87) at org.apache.catalina.connector.CoyoteAdapter.service(CoyoteAdapter.java:342) at org.apache.coyote.http11.Http11Processor.service(Http11Processor.java:800) at org.apache.coyote.AbstractProcessorLight.process(AbstractProcessorLight.java:66) at org.apache.coyote.AbstractProtocol$ConnectionHandler.process(AbstractProtocol.java:806) at org.apache.tomcat.util.net.NioEndpoint$SocketProcessor.doRun(NioEndpoint.java:1498) at org.apache.tomcat.util.net.SocketProcessorBase.run(SocketProcessorBase.java:49) at java.base/java.util.concurrent.ThreadPoolExecutor.runWorker(ThreadPoolExecutor.java:1128) at java.base/java.util.concurrent.ThreadPoolExecutor$Worker.run(ThreadPoolExecutor.java:628) at org.apache.tomcat.util.threads.TaskThread$WrappingRunnable.run(TaskThread.java:61) at java.base/java.lang.Thread.run(Thread.java:834) ===2019-12-10 13:31:07.253 DEBUG org.apache.shiro.web.servlet.SimpleCookie Line:226 - Added HttpServletResponse Cookie [QYrememberMe=deleteMe; Path=/; Max-Age=0; Expires=Mon, 09-Dec-2019 05:31:07 GMT] ===2019-12-10 13:31:07.254 DEBUG org.apache.shiro.web.filter.authc.FormAuthenticationFilter Line:206 - Authentication exception org.apache.shiro.authc.AuthenticationException: Authentication failed for token submission [org.apache.shiro.authc.UsernamePasswordToken - root, rememberMe=false (0:0:0:0:0:0:0:1)]. Possible unexpected error? (Typical or expected login exceptions should extend from AuthenticationException). at org.apache.shiro.authc.AbstractAuthenticator.authenticate(AbstractAuthenticator.java:214) at org.apache.shiro.mgt.AuthenticatingSecurityManager.authenticate(AuthenticatingSecurityManager.java:106) at org.apache.shiro.mgt.DefaultSecurityManager.login(DefaultSecurityManager.java:274) at org.apache.shiro.subject.support.DelegatingSubject.login(DelegatingSubject.java:260) at org.apache.shiro.web.filter.authc.AuthenticatingFilter.executeLogin(AuthenticatingFilter.java:53) at org.apache.shiro.web.filter.authc.FormAuthenticationFilter.onAccessDenied(FormAuthenticationFilter.java:154) at org.apache.shiro.web.filter.AccessControlFilter.onAccessDenied(AccessControlFilter.java:133) at org.apache.shiro.web.filter.AccessControlFilter.onPreHandle(AccessControlFilter.java:162) at org.apache.shiro.web.filter.PathMatchingFilter.isFilterChainContinued(PathMatchingFilter.java:203) at org.apache.shiro.web.filter.PathMatchingFilter.preHandle(PathMatchingFilter.java:178) at org.apache.shiro.web.servlet.AdviceFilter.doFilterInternal(AdviceFilter.java:131) at org.apache.shiro.web.servlet.OncePerRequestFilter.doFilter(OncePerRequestFilter.java:125) at org.apache.catalina.core.ApplicationFilterChain.internalDoFilter(ApplicationFilterChain.java:193) at org.apache.catalina.core.ApplicationFilterChain.doFilter(ApplicationFilterChain.java:166) at org.apache.shiro.web.servlet.ProxiedFilterChain.doFilter(ProxiedFilterChain.java:61) at org.apache.shiro.web.servlet.AdviceFilter.executeChain(AdviceFilter.java:108) at org.apache.shiro.web.servlet.AdviceFilter.doFilterInternal(AdviceFilter.java:137) at org.apache.shiro.web.servlet.OncePerRequestFilter.doFilter(OncePerRequestFilter.java:125) at org.apache.shiro.web.servlet.ProxiedFilterChain.doFilter(ProxiedFilterChain.java:66) at org.apache.shiro.web.servlet.AbstractShiroFilter.executeChain(AbstractShiroFilter.java:449) at org.apache.shiro.web.servlet.AbstractShiroFilter$1.call(AbstractShiroFilter.java:365) at org.apache.shiro.subject.support.SubjectCallable.doCall(SubjectCallable.java:90) at org.apache.shiro.subject.support.SubjectCallable.call(SubjectCallable.java:83) at org.apache.shiro.subject.support.DelegatingSubject.execute(DelegatingSubject.java:387) at org.apache.shiro.web.servlet.AbstractShiroFilter.doFilterInternal(AbstractShiroFilter.java:362) at org.apache.shiro.web.servlet.OncePerRequestFilter.doFilter(OncePerRequestFilter.java:125) at org.apache.catalina.core.ApplicationFilterChain.internalDoFilter(ApplicationFilterChain.java:193) at org.apache.catalina.core.ApplicationFilterChain.doFilter(ApplicationFilterChain.java:166) at org.springframework.web.filter.RequestContextFilter.doFilterInternal(RequestContextFilter.java:99) at org.springframework.web.filter.OncePerRequestFilter.doFilter(OncePerRequestFilter.java:107) at org.apache.catalina.core.ApplicationFilterChain.internalDoFilter(ApplicationFilterChain.java:193) at org.apache.catalina.core.ApplicationFilterChain.doFilter(ApplicationFilterChain.java:166) at org.springframework.web.filter.FormContentFilter.doFilterInternal(FormContentFilter.java:92) at org.springframework.web.filter.OncePerRequestFilter.doFilter(OncePerRequestFilter.java:107) at org.apache.catalina.core.ApplicationFilterChain.internalDoFilter(ApplicationFilterChain.java:193) at org.apache.catalina.core.ApplicationFilterChain.doFilter(ApplicationFilterChain.java:166) at org.springframework.web.filter.HiddenHttpMethodFilter.doFilterInternal(HiddenHttpMethodFilter.java:93) at org.springframework.web.filter.OncePerRequestFilter.doFilter(OncePerRequestFilter.java:107) at org.apache.catalina.core.ApplicationFilterChain.internalDoFilter(ApplicationFilterChain.java:193) at org.apache.catalina.core.ApplicationFilterChain.doFilter(ApplicationFilterChain.java:166) at org.springframework.boot.web.servlet.support.ErrorPageFilter.doFilter(ErrorPageFilter.java:130) at org.springframework.boot.web.servlet.support.ErrorPageFilter.access$000(ErrorPageFilter.java:66) at org.springframework.boot.web.servlet.support.ErrorPageFilter$1.doFilterInternal(ErrorPageFilter.java:105) at org.springframework.web.filter.OncePerRequestFilter.doFilter(OncePerRequestFilter.java:107) at org.springframework.boot.web.servlet.support.ErrorPageFilter.doFilter(ErrorPageFilter.java:123) at org.apache.catalina.core.ApplicationFilterChain.internalDoFilter(ApplicationFilterChain.java:193) at org.apache.catalina.core.ApplicationFilterChain.doFilter(ApplicationFilterChain.java:166) at org.springframework.web.filter.CharacterEncodingFilter.doFilterInternal(CharacterEncodingFilter.java:200) at org.springframework.web.filter.OncePerRequestFilter.doFilter(OncePerRequestFilter.java:107) at org.apache.catalina.core.ApplicationFilterChain.internalDoFilter(ApplicationFilterChain.java:193) at org.apache.catalina.core.ApplicationFilterChain.doFilter(ApplicationFilterChain.java:166) at org.apache.catalina.core.StandardWrapperValve.invoke(StandardWrapperValve.java:199) at org.apache.catalina.core.StandardContextValve.invoke(StandardContextValve.java:96) at org.apache.catalina.authenticator.AuthenticatorBase.invoke(AuthenticatorBase.java:493) at org.apache.catalina.core.StandardHostValve.invoke(StandardHostValve.java:140) at org.apache.catalina.valves.ErrorReportValve.invoke(ErrorReportValve.java:81) at org.apache.catalina.valves.AbstractAccessLogValve.invoke(AbstractAccessLogValve.java:650) at org.apache.catalina.core.StandardEngineValve.invoke(StandardEngineValve.java:87) at org.apache.catalina.connector.CoyoteAdapter.service(CoyoteAdapter.java:342) at org.apache.coyote.http11.Http11Processor.service(Http11Processor.java:800) at org.apache.coyote.AbstractProcessorLight.process(AbstractProcessorLight.java:66) at org.apache.coyote.AbstractProtocol$ConnectionHandler.process(AbstractProtocol.java:806) at org.apache.tomcat.util.net.NioEndpoint$SocketProcessor.doRun(NioEndpoint.java:1498) at org.apache.tomcat.util.net.SocketProcessorBase.run(SocketProcessorBase.java:49) at java.base/java.util.concurrent.ThreadPoolExecutor.runWorker(ThreadPoolExecutor.java:1128) at java.base/java.util.concurrent.ThreadPoolExecutor$Worker.run(ThreadPoolExecutor.java:628) at org.apache.tomcat.util.threads.TaskThread$WrappingRunnable.run(TaskThread.java:61) at java.base/java.lang.Thread.run(Thread.java:834) Caused by: java.lang.ClassCastException: class org.apache.shiro.authc.UsernamePasswordToken cannot be cast to class com.qiyuansoft.unicorn.common.realm.QYToken (org.apache.shiro.authc.UsernamePasswordToken and com.qiyuansoft.unicorn.common.realm.QYToken are in unnamed module of loader org.apache.catalina.loader.ParallelWebappClassLoader @651745d7) at com.qiyuansoft.unicorn.common.realm.QYLoginRealm.doGetAuthenticationInfo(QYLoginRealm.java:149) at org.apache.shiro.realm.AuthenticatingRealm.getAuthenticationInfo(AuthenticatingRealm.java:571) at org.apache.shiro.authc.pam.ModularRealmAuthenticator.doSingleRealmAuthentication(ModularRealmAuthenticator.java:180) at org.apache.shiro.authc.pam.ModularRealmAuthenticator.doAuthenticate(ModularRealmAuthenticator.java:267) at org.apache.shiro.authc.AbstractAuthenticator.authenticate(AbstractAuthenticator.java:198) ... 67 common frames omitted ===2019-12-10 13:31:07.281 DEBUG org.apache.shiro.session.mgt.DefaultSessionManager Line:218 - Unable to resolve session ID from SessionKey [org.apache.shiro.web.session.mgt.WebSessionKey@47af0345]. Returning null to indicate a session could not be found.
maven打包时报错,dependencies.dependency.(groupId:artifactId:type:classifier)' must be unique
maven项目打包时报错,如下图,困扰了我两天了,心力交瘁,还望走过路过的前辈给与指点,谢谢!!maven3.2.5,jdk1.6 ![图片说明](https://img-ask.csdn.net/upload/201910/21/1571624802_850311.jpg) ![图片说明](https://img-ask.csdn.net/upload/201910/21/1571624858_650725.jpg)
求助weblogic上部署maven项目报错!
第一次在weblogic上部署maven项目,报错了都不知道怎么改,请大家帮我看看这个错误是啥意思?应该怎么解决?如图![图片说明](https://img-ask.csdn.net/upload/201708/27/1503825397_874860.png)![图片说明](https://img-ask.csdn.net/upload/201708/27/1503825450_679831.png)
Maven多渠道打包报错,求解!
## 这是异常: D:\makeApk\MavenBuild>D:\makeApk\MavenBuild\build.bat [INFO] Scanning for projects... [INFO] [INFO] ------------------------------------------------------------------------ [INFO] Building mavenbuild-test 1.0.0 [INFO] ------------------------------------------------------------------------ Exception in thread "pool-1-thread-1" java.lang.NoClassDefFoundError: org/eclips e/aether/spi/connector/Transfer$State at org.eclipse.aether.connector.wagon.WagonRepositoryConnector$GetTask.r un(WagonRepositoryConnector.java:608) at org.eclipse.aether.util.concurrency.RunnableErrorForwarder$1.run(Runn ableErrorForwarder.java:67) at java.util.concurrent.ThreadPoolExecutor.runWorker(ThreadPoolExecutor. java:1145) at java.util.concurrent.ThreadPoolExecutor$Worker.run(ThreadPoolExecutor .java:615) at java.lang.Thread.run(Thread.java:724) [INFO] ------------------------------------------------------------------------C aused by: java.lang.ClassNotFoundException: org.eclipse.aether.spi.connector.Tra nsfer$State at org.codehaus.plexus.classworlds.strategy.SelfFirstStrategy.loadClass( SelfFirstStrategy.java:50)[INFO] BUILD FAILURE at org.codehaus.plexus.classworlds.realm.ClassRealm.unsynchronizedLoadCl ass(ClassRealm.java:271)[INFO] ------------------------------------------------- ----------------------- at org.codehaus.plexus.classworlds.realm.ClassRealm.loadClass(ClassRealm .java:247) at org.codehaus.plexus.classworlds.realm.ClassRealm.loadClass(ClassRealm .java:239) ... 5 more [INFO] Total time: 2.117 s [INFO] Finished at: 2015-07-23T11:06:57+08:00 [INFO] Final Memory: 14M/213M [INFO] ------------------------------------------------------------------------ --------------------------------------------------- constituent[0]: file:/D:/Soft/apache-maven-3.3.3/lib/aether-api-1.0.2.v20150114. jar constituent[1]: file:/D:/Soft/apache-maven-3.3.3/lib/aether-connector-basic-1.0. 2.v20150114.jar constituent[2]: file:/D:/Soft/apache-maven-3.3.3/lib/aether-impl-1.0.2.v20150114 .jar constituent[3]: file:/D:/Soft/apache-maven-3.3.3/lib/aether-spi-1.0.2.v20150114. jar constituent[4]: file:/D:/Soft/apache-maven-3.3.3/lib/aether-transport-wagon-1.0. 2.v20150114.jar constituent[5]: file:/D:/Soft/apache-maven-3.3.3/lib/aether-util-1.0.2.v20150114 .jar constituent[6]: file:/D:/Soft/apache-maven-3.3.3/lib/aopalliance-1.0.jar constituent[7]: file:/D:/Soft/apache-maven-3.3.3/lib/cdi-api-1.0.jar constituent[8]: file:/D:/Soft/apache-maven-3.3.3/lib/commons-cli-1.2.jar constituent[9]: file:/D:/Soft/apache-maven-3.3.3/lib/commons-io-2.2.jar constituent[10]: file:/D:/Soft/apache-maven-3.3.3/lib/commons-lang-2.6.jar constituent[11]: file:/D:/Soft/apache-maven-3.3.3/lib/guava-18.0.jar constituent[12]: file:/D:/Soft/apache-maven-3.3.3/lib/javax.inject-1.jar constituent[13]: file:/D:/Soft/apache-maven-3.3.3/lib/jsoup-1.7.2.jar constituent[14]: file:/D:/Soft/apache-maven-3.3.3/lib/jsr250-api-1.0.jar constituent[15]: file:/D:/Soft/apache-maven-3.3.3/lib/maven-aether-provider-3.3. 3.jar constituent[16]: file:/D:/Soft/apache-maven-3.3.3/lib/maven-artifact-3.3.3.jar constituent[17]: file:/D:/Soft/apache-maven-3.3.3/lib/maven-builder-support-3.3. 3.jar constituent[18]: file:/D:/Soft/apache-maven-3.3.3/lib/maven-compat-3.3.3.jar constituent[19]: file:/D:/Soft/apache-maven-3.3.3/lib/maven-core-3.3.3.jar constituent[20]: file:/D:/Soft/apache-maven-3.3.3/lib/maven-embedder-3.3.3.jar constituent[21]: file:/D:/Soft/apache-maven-3.3.3/lib/maven-model-3.3.3.jar constituent[22]: file:/D:/Soft/apache-maven-3.3.3/lib/maven-model-builder-3.3.3. jar constituent[23]: file:/D:/Soft/apache-maven-3.3.3/lib/maven-plugin-api-3.3.3.jar constituent[24]: file:/D:/Soft/apache-maven-3.3.3/lib/maven-repository-metadata- 3.3.3.jar constituent[25]: file:/D:/Soft/apache-maven-3.3.3/lib/maven-settings-3.3.3.jar constituent[26]: file:/D:/Soft/apache-maven-3.3.3/lib/maven-settings-builder-3.3 .3.jar constituent[27]: file:/D:/Soft/apache-maven-3.3.3/lib/org.eclipse.sisu.inject-0. 3.0.jar constituent[28]: file:/D:/Soft/apache-maven-3.3.3/lib/org.eclipse.sisu.plexus-0. 3.0.jar constituent[29]: file:/D:/Soft/apache-maven-3.3.3/lib/plexus-cipher-1.7.jar constituent[30]: file:/D:/Soft/apache-maven-3.3.3/lib/plexus-component-annotatio ns-1.5.5.jar constituent[31]: file:/D:/Soft/apache-maven-3.3.3/lib/plexus-interpolation-1.21. jar constituent[32]: file:/D:/Soft/apache-maven-3.3.3/lib/plexus-sec-dispatcher-1.3. jar constituent[33]: file:/D:/Soft/apache-maven-3.3.3/lib/plexus-utils-3.0.20.jar constituent[34]: file:/D:/Soft/apache-maven-3.3.3/lib/sisu-guice-3.2.5-no_aop.ja r constituent[35]: file:/D:/Soft/apache-maven-3.3.3/lib/slf4j-api-1.7.5.jar constituent[36]: file:/D:/Soft/apache-maven-3.3.3/lib/slf4j-simple-1.7.5.jar constituent[37]: file:/D:/Soft/apache-maven-3.3.3/lib/wagon-file-2.9.jar constituent[38]: file:/D:/Soft/apache-maven-3.3.3/lib/wagon-http-2.9-shaded.jar constituent[39]: file:/D:/Soft/apache-maven-3.3.3/lib/wagon-http-shared-2.9.jar constituent[40]: file:/D:/Soft/apache-maven-3.3.3/lib/wagon-provider-api-2.9.jar constituent[41]: file:/D:/Soft/apache-maven-3.3.3/conf/logging/ --------------------------------------------------- Exception in thread "main" java.lang.NoClassDefFoundError: org/eclipse/aether/sp i/connector/Transfer$State at org.eclipse.aether.connector.wagon.WagonRepositoryConnector$GetTask.r un(WagonRepositoryConnector.java:608) at org.eclipse.aether.util.concurrency.RunnableErrorForwarder$1.run(Runn ableErrorForwarder.java:67) at java.util.concurrent.ThreadPoolExecutor.runWorker(ThreadPoolExecutor. java:1145) at java.util.concurrent.ThreadPoolExecutor$Worker.run(ThreadPoolExecutor .java:615) at java.lang.Thread.run(Thread.java:724) Caused by: java.lang.ClassNotFoundException: org.eclipse.aether.spi.connector.Tr ansfer$State at org.codehaus.plexus.classworlds.strategy.SelfFirstStrategy.loadClass( SelfFirstStrategy.java:50) at org.codehaus.plexus.classworlds.realm.ClassRealm.unsynchronizedLoadCl ass(ClassRealm.java:271) at org.codehaus.plexus.classworlds.realm.ClassRealm.loadClass(ClassRealm .java:247) at org.codehaus.plexus.classworlds.realm.ClassRealm.loadClass(ClassRealm .java:239) ... 5 more 系统找不到指定的路径。 子目录或文件 assets 已经存在。 'assets/common.properties'... 正在添加: META-INF/MANIFEST.MF 正在添加: META-INF/DREAMZON.SF 正在添加: META-INF/DREAMZON.RSA 正在签名: assets/common.properties 子目录或文件 assets 已经存在。 'assets/common.properties'... 正在添加: META-INF/MANIFEST.MF 正在添加: META-INF/DREAMZON.SF 正在添加: META-INF/DREAMZON.RSA 正在签名: assets/common.properties 子目录或文件 assets 已经存在。 'assets/common.properties'... 正在添加: META-INF/MANIFEST.MF 正在添加: META-INF/DREAMZON.SF 正在添加: META-INF/DREAMZON.RSA 正在签名: assets/common.properties D:\makeApk> ## 这是pom.xml: <?xml version="1.0" encoding="utf-8"?> <project xmlns="http://maven.apache.org/POM/4.0.0" xmlns:xsi="http://www.w3.org/2001/XMLSchema-instance" xsi:schemaLocation="http://maven.apache.org/POM/4.0.0 http://maven.apache.org/maven-v4_0_0.xsd"> <modelVersion>4.0.0</modelVersion> <groupId>com.example.mavenbuild</groupId> <artifactId>mavenbuild-test</artifactId> <version>1.0.0</version> <packaging>apk</packaging> <properties> <project.build.sourceEncoding>UTF-8</project.build.sourceEncoding> </properties> <dependencies> <dependency> <groupId>com.google.android</groupId> <artifactId>android</artifactId> <version>4.1.1.4</version> <scope>provided</scope> </dependency> </dependencies> <build> <sourceDirectory>src</sourceDirectory> <finalName>${project.artifactId}</finalName> <pluginManagement> <plugins> <plugin> <groupId>com.jayway.maven.plugins.android.generation2</groupId> <artifactId>android-maven-plugin</artifactId> <version>3.8.2</version> <extensions>true</extensions> </plugin> </plugins> </pluginManagement> <plugins> <plugin> <groupId>com.jayway.maven.plugins.android.generation2</groupId> <artifactId>android-maven-plugin</artifactId> <configuration> <sdk> <!-- platform as api level (api level 16 = platform 4.1)--> <platform>16</platform> </sdk> <sign> <debug>false</debug> </sign> </configuration> </plugin> </plugins> </build> </project>
MyEclipse创建maven项目报错?
大家好我安装了maven3,MyEclipse设置了maven下的setting.xml,但是创建项目时报错:Could not resolve archetype org.apache.maven.archetypes:maven-archetype-quickstart:RELEASE from any of the configured repositories. Could not resolve artifact org.apache.maven.archetypes:maven-archetype-quickstart:pom:RELEASE Failed to resolve version for org.apache.maven.archetypes:maven-archetype-quickstart:pom:RELEASE: Could not find metadata org.apache.maven.archetypes:maven-archetype-quickstart/maven-metadata.xml in local (F:\Learing\Maven\LocalMaven) 在本地工厂中确实没有maven-metadata.xml,是不是在创建项目时下载这个啊?我的是win10系统,在win7上没有出现这种情况,还有就是有的说设置代理,请问这个代理是干什么的?对大神教教我,谢谢了,,,
【已解决】maven打包项目部署到服务器,注册service出现问题?
各位大佬,我用maven打包出一个jar包、lib, war包准备部署到服务器上。但是执行java -jar XX.jar的时候卡在第一个服务然后过了一会命令框就弹掉了。 ![图片说明](https://img-ask.csdn.net/upload/202001/22/1579657296_408756.png) 我试了一下,在自己电脑上是可以正常部署的。 下面是我的一些文件 ![图片说明](https://img-ask.csdn.net/upload/202001/22/1579657366_453022.png) bat文件里的内容为java -jar wdhis-core-service.jar 问题已解决! 是因为没有在电脑host文件中配置zookeeper的ip地址。
eclipse上建立maven项目报错Tomcat打不开?
![图片说明](https://img-ask.csdn.net/upload/201812/12/1544578173_96440.png) eclipse上建立maven项目报错Tomcat打不开,但是其他普通的项目打开没问题,在网站百度了很久没找到正确的解决方案。![图片说明](https://img-ask.csdn.net/upload/201812/13/1544697935_470078.png)
eclipse maven install 报错
[ERROR] Plugin org.apache.maven.plugins:maven-surefire-plugin:2.12.4 or one of its dependencies could not be resolved: Failed to read artifact descriptor for org.apache.maven.plugins:maven-surefire-plugin:jar:2.12.4: Could not transfer artifact org.apache.maven.plugins:maven-surefire-plugin:pom:2.12.4 from/to central (https://repo.maven.apache.org/maven2): Cannot access https://repo.maven.apache.org/maven2 with type default using the available connector factories: BasicRepositoryConnectorFactory: Cannot access https://repo.maven.apache.org/maven2 using the registered transporter factories: WagonTransporterFactory: java.util.NoSuchElementException [ERROR] role: org.apache.maven.wagon.Wagon [ERROR] roleHint: https [ERROR] -> [Help 1]
maven,zookeeper报错
启动maven报错Will not attempt to authenticate using SASL (unknown error)求解,不胜感激
新建maven项目报错,求大神帮帮我
我用的是myeclipse2015 ,apache-maven-3.3.9,每当新建maven项目时报 错, An internal error occurred during: "Retrieving archetypes:". GC overhead limit exceeded, 一直报这个错误,无法创建,怎么才能解决,百度上的试了都不行,来个大神帮帮我
终于明白阿里百度这样的大公司,为什么面试经常拿ThreadLocal考验求职者了
点击上面↑「爱开发」关注我们每晚10点,捕获技术思考和创业资源洞察什么是ThreadLocalThreadLocal是一个本地线程副本变量工具类,各个线程都拥有一份线程私...
《奇巧淫技》系列-python!!每天早上八点自动发送天气预报邮件到QQ邮箱
将代码部署服务器,每日早上定时获取到天气数据,并发送到邮箱。 也可以说是一个小人工智障。 思路可以运用在不同地方,主要介绍的是思路。
面试官问我:什么是消息队列?什么场景需要他?用了会出现什么问题?
你知道的越多,你不知道的越多 点赞再看,养成习惯 GitHub上已经开源 https://github.com/JavaFamily 有一线大厂面试点脑图、个人联系方式和人才交流群,欢迎Star和完善 前言 消息队列在互联网技术存储方面使用如此广泛,几乎所有的后端技术面试官都要在消息队列的使用和原理方面对小伙伴们进行360°的刁难。 作为一个在互联网公司面一次拿一次Offer的面霸...
8年经验面试官详解 Java 面试秘诀
作者 |胡书敏 责编 | 刘静 出品 | CSDN(ID:CSDNnews) 本人目前在一家知名外企担任架构师,而且最近八年来,在多家外企和互联网公司担任Java技术面试官,前后累计面试了有两三百位候选人。在本文里,就将结合本人的面试经验,针对Java初学者、Java初级开发和Java开发,给出若干准备简历和准备面试的建议。 Java程序员准备和投递简历的实...
究竟你适不适合买Mac?
我清晰的记得,刚买的macbook pro回到家,开机后第一件事情,就是上了淘宝网,花了500元钱,找了一个上门维修电脑的师傅,上门给我装了一个windows系统。。。。。。 表砍我。。。 当时买mac的初衷,只是想要个固态硬盘的笔记本,用来运行一些复杂的扑克软件。而看了当时所有的SSD笔记本后,最终决定,还是买个好(xiong)看(da)的。 已经有好几个朋友问我mba怎么样了,所以今天尽量客观...
MyBatis研习录(01)——MyBatis概述与入门
MyBatis 是一款优秀的持久层框架,它支持定制化 SQL、存储过程以及高级映射。MyBatis原本是apache的一个开源项目iBatis, 2010年该项目由apache software foundation 迁移到了google code并改名为MyBatis 。2013年11月MyBatis又迁移到Github。
程序员一般通过什么途径接私活?
二哥,你好,我想知道一般程序猿都如何接私活,我也想接,能告诉我一些方法吗? 上面是一个读者“烦不烦”问我的一个问题。其实不止是“烦不烦”,还有很多读者问过我类似这样的问题。 我接的私活不算多,挣到的钱也没有多少,加起来不到 20W。说实话,这个数目说出来我是有点心虚的,毕竟太少了,大家轻喷。但我想,恰好配得上“一般程序员”这个称号啊。毕竟苍蝇再小也是肉,我也算是有经验的人了。 唾弃接私活、做外...
Python爬虫爬取淘宝,京东商品信息
小编是一个理科生,不善长说一些废话。简单介绍下原理然后直接上代码。 使用的工具(Python+pycharm2019.3+selenium+xpath+chromedriver)其中要使用pycharm也可以私聊我selenium是一个框架可以通过pip下载 pip installselenium -ihttps://pypi.tuna.tsinghua.edu.cn/simple/ ...
阿里程序员写了一个新手都写不出的低级bug,被骂惨了。
这种新手都不会范的错,居然被一个工作好几年的小伙子写出来,差点被当场开除了。
Java工作4年来应聘要16K最后没要,细节如下。。。
前奏: 今天2B哥和大家分享一位前几天面试的一位应聘者,工作4年26岁,统招本科。 以下就是他的简历和面试情况。 基本情况: 专业技能: 1、&nbsp;熟悉Sping了解SpringMVC、SpringBoot、Mybatis等框架、了解SpringCloud微服务 2、&nbsp;熟悉常用项目管理工具:SVN、GIT、MAVEN、Jenkins 3、&nbsp;熟悉Nginx、tomca...
Python爬虫精简步骤1 获取数据
爬虫,从本质上来说,就是利用程序在网上拿到对我们有价值的数据。 爬虫能做很多事,能做商业分析,也能做生活助手,比如:分析北京近两年二手房成交均价是多少?广州的Python工程师平均薪资是多少?北京哪家餐厅粤菜最好吃?等等。 这是个人利用爬虫所做到的事情,而公司,同样可以利用爬虫来实现巨大的商业价值。比如你所熟悉的搜索引擎——百度和谷歌,它们的核心技术之一也是爬虫,而且是超级爬虫。 从搜索巨头到人工...
Python绘图,圣诞树,花,爱心 | Turtle篇
每周每日,分享Python实战代码,入门资料,进阶资料,基础语法,爬虫,数据分析,web网站,机器学习,深度学习等等。 公众号回复【进群】沟通交流吧,QQ扫码进群学习吧 微信群 QQ群 1.画圣诞树 import turtle screen = turtle.Screen() screen.setup(800,600) circle = turtle.Turtle()...
作为一个程序员,CPU的这些硬核知识你必须会!
CPU对每个程序员来说,是个既熟悉又陌生的东西? 如果你只知道CPU是中央处理器的话,那可能对你并没有什么用,那么作为程序员的我们,必须要搞懂的就是CPU这家伙是如何运行的,尤其要搞懂它里面的寄存器是怎么一回事,因为这将让你从底层明白程序的运行机制。 随我一起,来好好认识下CPU这货吧 把CPU掰开来看 对于CPU来说,我们首先就要搞明白它是怎么回事,也就是它的内部构造,当然,CPU那么牛的一个东...
破14亿,Python分析我国存在哪些人口危机!
一、背景 二、爬取数据 三、数据分析 1、总人口 2、男女人口比例 3、人口城镇化 4、人口增长率 5、人口老化(抚养比) 6、各省人口 7、世界人口 四、遇到的问题 遇到的问题 1、数据分页,需要获取从1949-2018年数据,观察到有近20年参数:LAST20,由此推测获取近70年的参数可设置为:LAST70 2、2019年数据没有放上去,可以手动添加上去 3、将数据进行 行列转换 4、列名...
web前端javascript+jquery知识点总结
1.Javascript 语法.用途 javascript 在前端网页中占有非常重要的地位,可以用于验证表单,制作特效等功能,它是一种描述语言,也是一种基于对象(Object)和事件驱动并具有安全性的脚本语言 ...
Python实战:抓肺炎疫情实时数据,画2019-nCoV疫情地图
今天,群里白垩老师问如何用python画武汉肺炎疫情地图。白垩老师是研究海洋生态与地球生物的学者,国家重点实验室成员,于不惑之年学习python,实为我等学习楷模。先前我并没有关注武汉肺炎的具体数据,也没有画过类似的数据分布图。于是就拿了两个小时,专门研究了一下,遂成此文。
听说想当黑客的都玩过这个Monyer游戏(1~14攻略)
第零关 进入传送门开始第0关(游戏链接) 请点击链接进入第1关: 连接在左边→ ←连接在右边 看不到啊。。。。(只能看到一堆大佬做完的留名,也能看到菜鸡的我,在后面~~) 直接fn+f12吧 &lt;span&gt;连接在左边→&lt;/span&gt; &lt;a href="first.php"&gt;&lt;/a&gt; &lt;span&gt;←连接在右边&lt;/span&gt; o...
在家远程办公效率低?那你一定要收好这个「在家办公」神器!
相信大家都已经收到国务院延长春节假期的消息,接下来,在家远程办公可能将会持续一段时间。 但是问题来了。远程办公不是人在电脑前就当坐班了,相反,对于沟通效率,文件协作,以及信息安全都有着极高的要求。有着非常多的挑战,比如: 1在异地互相不见面的会议上,如何提高沟通效率? 2文件之间的来往反馈如何做到及时性?如何保证信息安全? 3如何规划安排每天工作,以及如何进行成果验收? ...... ...
作为一个程序员,内存和磁盘的这些事情,你不得不知道啊!!!
截止目前,我已经分享了如下几篇文章: 一个程序在计算机中是如何运行的?超级干货!!! 作为一个程序员,CPU的这些硬核知识你必须会! 作为一个程序员,内存的这些硬核知识你必须懂! 这些知识可以说是我们之前都不太重视的基础知识,可能大家在上大学的时候都学习过了,但是嘞,当时由于老师讲解的没那么有趣,又加上这些知识本身就比较枯燥,所以嘞,大家当初几乎等于没学。 再说啦,学习这些,也看不出来有什么用啊!...
渗透测试-灰鸽子远控木马
木马概述 灰鸽子( Huigezi),原本该软件适用于公司和家庭管理,其功能十分强大,不但能监视摄像头、键盘记录、监控桌面、文件操作等。还提供了黑客专用功能,如:伪装系统图标、随意更换启动项名称和表述、随意更换端口、运行后自删除、毫无提示安装等,并采用反弹链接这种缺陷设计,使得使用者拥有最高权限,一经破解即无法控制。最终导致被黑客恶意使用。原作者的灰鸽子被定义为是一款集多种控制方式于一体的木马程序...
Python:爬取疫情每日数据
前言 目前每天各大平台,如腾讯、今日头条都会更新疫情每日数据,他们的数据源都是一样的,主要都是通过各地的卫健委官网通报。 以全国、湖北和上海为例,分别为以下三个网站: 国家卫健委官网:http://www.nhc.gov.cn/xcs/yqtb/list_gzbd.shtml 湖北卫健委官网:http://wjw.hubei.gov.cn/bmdt/ztzl/fkxxgzbdgrfyyq/xxfb...
这个世界上人真的分三六九等,你信吗?
偶然间,在知乎上看到一个问题 一时间,勾起了我深深的回忆。 以前在厂里打过两次工,做过家教,干过辅导班,做过中介。零下几度的晚上,贴过广告,满脸、满手地长冻疮。 再回首那段岁月,虽然苦,但让我学会了坚持和忍耐。让我明白了,在这个世界上,无论环境多么的恶劣,只要心存希望,星星之火,亦可燎原。 下文是原回答,希望能对你能有所启发。 如果我说,这个世界上人真的分三六九等,...
B 站上有哪些很好的学习资源?
哇说起B站,在小九眼里就是宝藏般的存在,放年假宅在家时一天刷6、7个小时不在话下,更别提今年的跨年晚会,我简直是跪着看完的!! 最早大家聚在在B站是为了追番,再后来我在上面刷欧美新歌和漂亮小姐姐的舞蹈视频,最近两年我和周围的朋友们已经把B站当作学习教室了,而且学习成本还免费,真是个励志的好平台ヽ(.◕ฺˇд ˇ◕ฺ;)ノ 下面我们就来盘点一下B站上优质的学习资源: 综合类 Oeasy: 综合...
雷火神山直播超两亿,Web播放器事件监听是怎么实现的?
Web播放器解决了在手机浏览器和PC浏览器上播放音视频数据的问题,让视音频内容可以不依赖用户安装App,就能进行播放以及在社交平台进行传播。在视频业务大数据平台中,播放数据的统计分析非常重要,所以Web播放器在使用过程中,需要对其内部的数据进行收集并上报至服务端,此时,就需要对发生在其内部的一些播放行为进行事件监听。 那么Web播放器事件监听是怎么实现的呢? 01 监听事件明细表 名...
3万字总结,Mysql优化之精髓
本文知识点较多,篇幅较长,请耐心学习 MySQL已经成为时下关系型数据库产品的中坚力量,备受互联网大厂的青睐,出门面试想进BAT,想拿高工资,不会点MySQL优化知识,拿offer的成功率会大大下降。 为什么要优化 系统的吞吐量瓶颈往往出现在数据库的访问速度上 随着应用程序的运行,数据库的中的数据会越来越多,处理时间会相应变慢 数据是存放在磁盘上的,读写速度无法和内存相比 如何优化 设计...
Python新型冠状病毒疫情数据自动爬取+统计+发送报告+数据屏幕(三)发送篇
今天介绍的项目是使用 Itchat 发送统计报告 项目功能设计: 定时爬取疫情数据存入Mysql 进行数据分析制作疫情报告 使用itchat给亲人朋友发送分析报告 基于Django做数据屏幕 使用Tableau做数据分析 来看看最终效果 目前已经完成,预计2月12日前更新 使用 itchat 发送数据统计报告 itchat 是一个基于 web微信的一个框架,但微信官方并不允许使用这...
作为程序员的我,大学四年一直自学,全靠这些实用工具和学习网站!
我本人因为高中沉迷于爱情,导致学业荒废,后来高考,毫无疑问进入了一所普普通通的大学,实在惭愧???? 我又是那么好强,现在学历不行,没办法改变的事情了,所以,进入大学开始,我就下定决心,一定要让自己掌握更多的技能,尤其选择了计算机这个行业,一定要多学习技术。 在进入大学学习不久后,我就认清了一个现实:我这个大学的整体教学质量和学习风气,真的一言难尽,懂的人自然知道怎么回事? 怎么办?我该如何更好的提升自...
粒子群算法求解物流配送路线问题(python)
1.Matlab实现粒子群算法的程序代码:https://www.cnblogs.com/kexinxin/p/9858664.html matlab代码求解函数最优值:https://blog.csdn.net/zyqblog/article/details/80829043 讲解通俗易懂,有数学实例的博文:https://blog.csdn.net/daaikuaichuan/article/...
教你如何编写第一个简单的爬虫
很多人知道爬虫,也很想利用爬虫去爬取自己想要的数据,那么爬虫到底怎么用呢?今天就教大家编写一个简单的爬虫。 下面以爬取笔者的个人博客网站为例获取第一篇文章的标题名称,教大家学会一个简单的爬虫。 第一步:获取页面 #!/usr/bin/python # coding: utf-8 import requests #引入包requests link = "http://www.santostang....
前端JS初级面试题二 (。•ˇ‸ˇ•。)老铁们!快来瞧瞧自己都会了么
1. 传统事件绑定和符合W3C标准的事件绑定有什么区别? 传统事件绑定 &lt;div onclick=""&gt;123&lt;/div&gt; div1.onclick = function(){}; &lt;button onmouseover=""&gt;&lt;/button&gt; 注意: 如果给同一个元素绑定了两次或多次相同类型的事件,那么后面的绑定会覆盖前面的绑定 (不支持DOM事...
情人节来了,教你个用 Python 表白的技巧
作者:@明哥 公众号:Python编程时光 2020年,这个看起来如此浪漫的年份,你还是一个人吗? 难不成我还能是一条狗? 18年的时候,写过一篇介绍如何使用 Python 来表白的文章。 虽然创意和使用效果都不错,但有一缺点,这是那个exe文件,女神需要打开电脑,才有可能参与进来,进而被你成功"调戏”。 由于是很早期的文章了,应该有很多人没有看过。 没有看过的,你可以点击这里查看:用Pyt...
相关热词 c# 时间比天数 c# oracle查询 c# 主动推送 事件 c# java 属性 c# 控制台 窗体 c# 静态类存值 c#矢量作图 c#窗体调用外部程式 c# enum是否合法 c# 如何卸载引用
立即提问