opencv3.1.0中没有opencv2\legacy\compat.hpp

opencv3.1.0中没有opencv2\legacy\compat.hpp 该如何解决 想用cvQueryHistValue_1D(,)该怎么办

1个回答

我也想知道opencv3.1是用哪个函数取代cvQueryHistValue_1D的?

Csdn user default icon
上传中...
上传图片
插入图片
抄袭、复制答案,以达到刷声望分或其他目的的行为,在CSDN问答是严格禁止的,一经发现立刻封号。是时候展现真正的技术了!
其他相关推荐
VS2015+openCV3.2.0运行openCV3.2.0的samples运行不出来
为什么我运行openCV3.2.0的samples大部分都运行不出来,运行情况有以下几种,1、把CommandLineParser类注释掉了,直接读取路径,运行出来了,不过能运行出来的很少;2、大部分把CommandLineParser类注释掉了,直接读取路径,不显示错误,运行不出来;3、大部分直接运行,不显示错误,运行不出来。我是在VS2015+openCV3.2.0做的。谢谢大家告知!
关于opencv3.1的《xfeature2d》问题
在opencv3.1与vs2015配置下调用库<xfeature2d>的函数,发现opencv3.1没有这个库,请问怎么办?
opencv3.0没有nonfree
opencv3.0没有nonfree.hpp,用不了surf算法,应该在哪个头文件里?谢谢~
opencv3.2与opencv 2.8 切换的问题
我的ubuntu系统原来安装了opencv2.8,现在由于实际需要,安装了opencv3.2。但是,opencv2.8还得继续保留。利用pkg-config --modversion opencv 查看opencv的版本,显示是3.2.0。原来(opencv2.8下),CMakeList文件是这样写的。 project(test) find_package(OpenCV REQUIRED) add_executable(test src/test.cpp) target_link_libraries(test ${OpenCV_LIBS}) cmake_minimum_required(VERSION 2.8) 我使用opencv3.2编译的时候,按照要求,我把路径给加上了。 project(test) find_package(OpenCV REQUIRED) set(OpenCV_DIR "/usr/local/opencv320/share/OpenCV") INCLUDE_DIRECTORIES(${OpenCV_INCLUDE_DIRS}) add_executable(test src/test.cpp) target_link_libraries(test ${OpenCV_LIBS}) cmake_minimum_required(VERSION 3.2) 但是显示错误:要求的opencv版本太高,当前运行版本为2.8。但是我用 pkg-config --modversion opencv 查看版本,显示的是3.2.0
opencv3.1.0交叉编译出错
我在给mini2440移植opencv3.1.0的时候,make编译opencv过程中出错了。log如下: CMakeFiles/opencv_perf_core.dir/perf/perf_math.cpp.obj: In function `cv::Mat::~Mat()': perf_math.cpp.text._ZN2cv3MatD1Ev[cv::Mat::~Mat()]+0x1c): undefined reference to `__sync_fetch_and_add_4' CMakeFiles/opencv_perf_core.dir/perf/perf_compare.cpp.obj: In function `Size_MatType_CmpType_compare:erfTestBody()': perf_compare.cpp.text._ZN28Size_MatType_CmpType_compare12PerfTestBodyEv+0x30c): undefined reference to `__sync_fetch_and_add_4' perf_compare.cpp.text._ZN28Size_MatType_CmpType_compare12PerfTestBodyEv+0x378): undefined reference to `__sync_fetch_and_add_4' perf_compare.cpp.text._ZN28Size_MatType_CmpType_compare12PerfTestBodyEv+0x3ec): undefined reference to `__sync_fetch_and_add_4' CMakeFiles/opencv_perf_core.dir/perf/perf_compare.cpp.obj: In function `Size_MatType_CmpType_compareScalar:erfTestBody()': perf_compare.cpp.text._ZN34Size_MatType_CmpType_compareScalar12PerfTestBodyEv+0x32c): undefined reference to `__sync_fetch_and_add_4' CMakeFiles/opencv_perf_core.dir/perf/perf_compare.cpp.obj:perf_compare.cpp.text._ZN34Size_MatType_CmpType_compareScalar12PerfTestBodyEv+0x3a0): more undefined references to `__sync_fetch_and_add_4' follow collect2: ld returned 1 exit status make[2]: *** [bin/opencv_perf_core] Error 1 make[1]: *** [modules/core/CMakeFiles/opencv_perf_core.dir/all] Error 2 make: *** [all] Error 2 我用的是Ubuntu14.04,32位虚拟机。 查网上说是CMAKE_C_FLAGS要设为-march=armv4t 可是我安装提示设置了CMAKE_C_FLAGS 和 CMAKE_CXX_FLAGS的值,错误还是没有消失。 我试过了opencv3.1。0和opencv3.2.0了,都会出现这个问题。因为项目需求要用到opencv3 所以只能自己编译最新版,,泪奔 有大神遇到过这个问题吗?
求助帖!!!ubuntu18.04 安装opencv4.0.0源码无限次出现如下问题
./src/image_opencv.cpp: In function ‘IplImage* image_to_ipl(image)’: ./src/image_opencv.cpp:16:5: error: ‘IPlImage’ was not declared in this scope IPlImage *disp = cvCreateImage(cvSize(im.w,im.h), IPL_DEPTH_8U, im.c); ^~~~~~~~ compilation terminated due to -Wfatal-errors. Makefile:86: recipe for target 'obj/image_opencv.o' failed make: *** [obj/image_opencv.o] Error 1 make: *** Waiting for unfinished jobs.... 但我在src文件夹中的image_opencv.cpp中也引入了#include "opencv2/imgproc/imgproc_c.h" 求助实在不知道怎么办了
Ubuntu 14 装了opencv3.0想换回2.X版本 求方法
Ubuntu 14 装了opencv3.0想换回2.X版本 因为在运行一代码时出现 main.cpp:16:42: fatal error: opencv2/nonfree/features2d.hpp: 没有那个文件或目录 #include <opencv2/nonfree/features2d.hpp> 对opencv不熟悉改不了代码。。想装回2.X版本
Ubuntu18.04配置OPENCV3.3.1时make报错
在给Ubuntu18.04下载编译openCV3.3.1时, 参照https://blog.csdn.net/zhaoxr233/article/details/90036824 在做到make那一步时,报了以下error,在网上查询无果,不知如何解决,烦请各位大佬指点 ``` Linking CXX executable ../../bin/opencv_visualisation ../../lib/libopencv_core.a(hal_internal.cpp.o):在函数‘lapack_gemm32f(float const*, unsigned long, float const*, unsigned long, float, float const*, unsigned long, float, float*, unsigned long, int, int, int, int)’中: hal_internal.cpp:(.text._Z14lapack_gemm32fPKfmS0_mfS0_mfPfmiiii+0x3d2):对‘cblas_sgemm(CBLAS_ORDER, CBLAS_TRANSPOSE, CBLAS_TRANSPOSE, int, int, int, float, float const*, int, float const*, int, float, float*, int)’未定义的引用 ............ ../../lib/libopencv_core.a(hal_internal.cpp.o):在函数‘lapack_gemm64fc(double const*, unsigned long, double const*, unsigned long, double, double const*, unsigned long, double, double*, unsigned long, int, int, int, int)’中: hal_internal.cpp:(.text._Z15lapack_gemm64fcPKdmS0_mdS0_mdPdmiiii+0x29e):对‘cblas_zgemm(CBLAS_ORDER, CBLAS_TRANSPOSE, CBLAS_TRANSPOSE, int, int, int, void const*, void const*, int, void const*, int, void const*, void*, int)’未定义的引用 hal_internal.cpp:(.text._Z15lapack_gemm64fcPKdmS0_mdS0_mdPdmiiii+0x2f5):对‘cblas_cgemm(CBLAS_ORDER, CBLAS_TRANSPOSE, CBLAS_TRANSPOSE, int, int, int, void const*, void const*, int, void const*, int, void const*, void*, int)’未定义的引用 collect2: error: ld returned 1 exit status apps/annotation/CMakeFiles/opencv_annotation.dir/build.make:119: recipe for target 'bin/opencv_annotation' failed make[2]: *** [bin/opencv_annotation] Error 1 CMakeFiles/Makefile2:4522: recipe for target 'apps/annotation/CMakeFiles/opencv_annotation.dir/all' failed make[1]: *** [apps/annotation/CMakeFiles/opencv_annotation.dir/all] Error 2 ```
opencv3.2中triangulatePoints()如何使用
opencv3.2中triangulatePoints()如何使用
opencv3.4.3配置 opencv contrib后,无法读取opencv_aruco343d.dll,怎么解决?
我需要opencv的sift算法,opencv3.4.3要用的话,需要配置opencv contrib。 我根据网上教程配置完以后,运行一段代码出现“无法读取opencv_aruco343d.dll” 的问题,我重新编译,生成过这个dll文件。但还是不行,不知道问题出哪里了。
cuda加速的問題,opencv3.1.0+cuda8.0
使用的是opencv3.1.0+cuda8.0,但是make可以,run出錯。 nvidia@tegra-ubuntu:~$ cd project_wly nvidia@tegra-ubuntu:~/project_wly$ cmake . -- The C compiler identification is GNU 5.4.0 -- The CXX compiler identification is GNU 5.4.0 -- Check for working C compiler: /usr/bin/cc -- Check for working C compiler: /usr/bin/cc -- works -- Detecting C compiler ABI info -- Detecting C compiler ABI info - done -- Detecting C compile features -- Detecting C compile features - done -- Check for working CXX compiler: /usr/bin/c++ -- Check for working CXX compiler: /usr/bin/c++ -- works -- Detecting CXX compiler ABI info -- Detecting CXX compiler ABI info - done -- Detecting CXX compile features -- Detecting CXX compile features - done -- Configuring done -- Generating done -- Build files have been written to: /home/nvidia/project_wly nvidia@tegra-ubuntu:~/project_wly$ make Scanning dependencies of target project_wly [ 50%] Building CXX object CMakeFiles/project_wly.dir/project_wly.cpp.o [100%] Linking CXX executable project_wly [100%] Built target project_wly nvidia@tegra-ubuntu:~/project_wly$ ./project_wly **OpenCV Error: Gpu API call (invalid device symbol) in loadUMax, file /home/nvidia/opencv_3.1/opencv-3.1.0/modules/cudafeatures2d/src/cuda/orb.cu, line 148 terminate called after throwing an instance of 'cv::Exception' what(): /home/nvidia/opencv_3.1/opencv-3.1.0/modules/cudafeatures2d/src/cuda/orb.cu:148: error: (-217) invalid device symbol in function loadUMax** Aborted (core dumped) nvidia@tegra-ubuntu:~/project_wly$ 求教各位大神,怎麼解決這個問題?
在Qt5.3.1中opencv2.4.9配置的问题
(这是mainwindow.h里的内容,中间四个include包含的文件总是找不到) #ifndef MAINWINDOW_H #define MAINWINDOW_H //#include <QtGui/QMainWindow> #include <QtWidgets/QMainWindow> #include <opencv2/opencv.hpp> #include <opencv2/core/core.hpp> #include <opencv2/imgproc/imgproc.hpp> #include <opencv2/highgui/highgui.hpp> //#include "cv.h" //#include "cxcore.h" //#include "highgui.h" #include<QImage> #include<QPixmap> #include<iostream> using namespace std; using namespace cv; class MainWindow : public QMainWindow { ……(后面不打了) (这是pro文件里opencv的配置,我的opencv文件是放在c:\opencv文件夹里的,系统的环境变量自己也配了) INCLUDEPATH+=c:\opencv\opencv\build\include\opencv\ c:\opencv\opencv\build\include\opencv2\ c:\opencv\opencv\build\include\ LIBS+=c:\opencv\opencv\MinGW\lib\libopencv_calib3d249.dll.a\ c:\opencv\opencv\MinGW\lib\libopencv_contrib249.dll.a\ c:\opencv\opencv\MinGW\lib\libopencv_core249.dll.a\ c:\opencv\opencv\MinGW\lib\libopencv_features2d249.dll.a\ c:\opencv\opencv\MinGW\lib\libopencv_flann249.dll.a\ c:\opencv\opencv\MinGW\lib\libopencv_gpu249.dll.a\ c:\opencv\opencv\MinGW\lib\libopencv_highgui249.dll.a\ c:\opencv\opencv\MinGW\lib\libopencv_imgproc249.dll.a\ c:\opencv\opencv\MinGW\lib\libopencv_legacy249.dll.a\ c:\opencv\opencv\MinGW\lib\libopencv_ml249.dll.a\ c:\opencv\opencv\MinGW\lib\libopencv_objdetect249.dll.a\ c:\opencv\opencv\MinGW\lib\libopencv_video249.dll.a
配置QtCreator5.5.1与opencv3.3.1,执行mingw32-make出错。
windows7配置QtCreator5.5.1与opencv3.3.1,执行mingw32-make出错。 求大神解答!!!
谁能帮忙看一下OpenCV 3.4.1源码的类型转换编译错误?
环境: 1. Ubuntu 12.04 LTS 2. cmake 3.5.1 3. OpenCV 3.4.1源码 4. Arm Cortex-A7 NXP i.MX6Q 5. 已经sudo为root 执行过程 cd opencv-3.4.1 mkdir build cd build cmakd -D CMAKE_BUILD_TYPE=Relase -D CMAKE_INSTALL_PREFIX=/usr/local .. make make install 出错提示: [ 0%] Built target gen-pkgconfig [ 9%] Built target libwebp [ 14%] Built target IlmImf [ 20%] Built target libprotobuf [ 23%] Built target carotene_objs [ 24%] Built target tegra_hal [ 24%] Built target opencv_ts_pch_dephelp [ 24%] Built target pch_Generate_opencv_ts [ 25%] Built target opencv_core_pch_dephelp [ 25%] Built target pch_Generate_opencv_core [ 31%] Built target opencv_core [ 31%] Built target opencv_imgproc_pch_dephelp [ 31%] Built target pch_Generate_opencv_imgproc [ 31%] Building CXX object modules/imgproc/CMakeFiles/opencv_imgproc.dir/src/smooth.cpp.o /home/linaro/opencv-3.4.1/modules/imgproc/src/smooth.cpp: In function ‘void cv::vlineSmooth1N(const FT* const*, const FT*, int, ET*, int) [with ET = unsigned char, FT = {anonymous}::ufixedpoint16]’: /home/linaro/opencv-3.4.1/modules/imgproc/src/smooth.cpp:2676:31: error: conversion from ‘{anonymous}::ufixedpoint32’ to ‘cv::uint8_t {aka unsigned char}’ is ambiguous /home/linaro/opencv-3.4.1/modules/imgproc/src/smooth.cpp:2676:31: note: candidates are: /home/linaro/opencv-3.4.1/modules/imgproc/src/fixedpoint.inl.hpp:223:22: note: {anonymous}::ufixedpoint32::operator float() const /home/linaro/opencv-3.4.1/modules/imgproc/src/fixedpoint.inl.hpp:222:22: note: {anonymous}::ufixedpoint32::operator double() const /home/linaro/opencv-3.4.1/modules/imgproc/src/fixedpoint.inl.hpp:221:22: note: {anonymous}::ufixedpoint32::operator ET() const [with ET = unsigned char] /home/linaro/opencv-3.4.1/modules/imgproc/src/smooth.cpp: In function ‘void cv::vlineSmooth1N1(const FT* const*, const FT*, int, ET*, int) [with ET = unsigned char, FT = {anonymous}::ufixedpoint16]’: /home/linaro/opencv-3.4.1/modules/imgproc/src/smooth.cpp:2693:24: error: conversion from ‘const {anonymous}::ufixedpoint16’ to ‘cv::uint8_t {aka unsigned char}’ is ambiguous /home/linaro/opencv-3.4.1/modules/imgproc/src/smooth.cpp:2693:24: note: candidates are: /home/linaro/opencv-3.4.1/modules/imgproc/src/fixedpoint.inl.hpp:289:22: note: {anonymous}::ufixedpoint16::operator float() const /home/linaro/opencv-3.4.1/modules/imgproc/src/fixedpoint.inl.hpp:288:22: note: {anonymous}::ufixedpoint16::operator double() const /home/linaro/opencv-3.4.1/modules/imgproc/src/fixedpoint.inl.hpp:287:22: note: {anonymous}::ufixedpoint16::operator ET() const [with ET = unsigned char] /home/linaro/opencv-3.4.1/modules/imgproc/src/smooth.cpp: In function ‘void cv::vlineSmooth3N(const FT* const*, const FT*, int, ET*, int) [with ET = unsigned char, FT = {anonymous}::ufixedpoint16]’: /home/linaro/opencv-3.4.1/modules/imgproc/src/smooth.cpp:2740:71: error: conversion from ‘{anonymous}::ufixedpoint32’ to ‘cv::uint8_t {aka unsigned char}’ is ambiguous /home/linaro/opencv-3.4.1/modules/imgproc/src/smooth.cpp:2740:71: note: candidates are: /home/linaro/opencv-3.4.1/modules/imgproc/src/fixedpoint.inl.hpp:223:22: note: {anonymous}::ufixedpoint32::operator float() const /home/linaro/opencv-3.4.1/modules/imgproc/src/fixedpoint.inl.hpp:222:22: note: {anonymous}::ufixedpoint32::operator double() const /home/linaro/opencv-3.4.1/modules/imgproc/src/fixedpoint.inl.hpp:221:22: note: {anonymous}::ufixedpoint32::operator ET() const [with ET = unsigned char] /home/linaro/opencv-3.4.1/modules/imgproc/src/smooth.cpp: In function ‘void cv::vlineSmooth5N(const FT* const*, const FT*, int, ET*, int) [with ET = unsigned char, FT = {anonymous}::ufixedpoint16]’: /home/linaro/opencv-3.4.1/modules/imgproc/src/smooth.cpp:2816:109: error: conversion from ‘{anonymous}::ufixedpoint32’ to ‘cv::uint8_t {aka unsigned char}’ is ambiguous /home/linaro/opencv-3.4.1/modules/imgproc/src/smooth.cpp:2816:109: note: candidates are: /home/linaro/opencv-3.4.1/modules/imgproc/src/fixedpoint.inl.hpp:223:22: note: {anonymous}::ufixedpoint32::operator float() const /home/linaro/opencv-3.4.1/modules/imgproc/src/fixedpoint.inl.hpp:222:22: note: {anonymous}::ufixedpoint32::operator double() const /home/linaro/opencv-3.4.1/modules/imgproc/src/fixedpoint.inl.hpp:221:22: note: {anonymous}::ufixedpoint32::operator ET() const [with ET = unsigned char] /home/linaro/opencv-3.4.1/modules/imgproc/src/smooth.cpp: In function ‘void cv::vlineSmooth(const FT* const*, const FT*, int, ET*, int) [with ET = unsigned char, FT = {anonymous}::ufixedpoint16]’: /home/linaro/opencv-3.4.1/modules/imgproc/src/smooth.cpp:2919:18: error: conversion from ‘{anonymous}::ufixedpoint32’ to ‘cv::uint8_t {aka unsigned char}’ is ambiguous /home/linaro/opencv-3.4.1/modules/imgproc/src/smooth.cpp:2914:23: note: candidates are: /home/linaro/opencv-3.4.1/modules/imgproc/src/fixedpoint.inl.hpp:223:22: note: {anonymous}::ufixedpoint32::operator float() const /home/linaro/opencv-3.4.1/modules/imgproc/src/fixedpoint.inl.hpp:222:22: note: {anonymous}::ufixedpoint32::operator double() const /home/linaro/opencv-3.4.1/modules/imgproc/src/fixedpoint.inl.hpp:221:22: note: {anonymous}::ufixedpoint32::operator ET() const [with ET = unsigned char] make[2]: *** [modules/imgproc/CMakeFiles/opencv_imgproc.dir/src/smooth.cpp.o] Error 1 make[1]: *** [modules/imgproc/CMakeFiles/opencv_imgproc.dir/all] Error 2 make: *** [all] Error 2 说明: 关键之处是 /home/linaro/opencv-3.4.1/modules/imgproc/src/smooth.cpp:2919:18: error: conversion from ‘{anonymous}::ufixedpoint32’ to ‘cv::uint8_t {aka unsigned char}’ is ambiguous 类型转换错误。 请教各位大侠,这个错误出在哪里,如何解决呢? 谢谢!
官网下载的opencv3.4.0解压后没有x86的文件夹。
我的环境是windows 7 32 +opencv3.4.0+vs2012的。求解大神应该怎么解决???为什么只有x64的文件夹
opencv3.2获取摄像头问题
我在vs下集成了opencv3.2,但是获取摄像头的时候什么都不能显示。同样的代码使用opencv2.4.10的库就可以获取 这是为什么呢?
关于opencv3.0版本图像增强中的对比度以及亮度的问题
请问。opencv3.0版本的增强对比度除了直方图变换,还有哪些现成的函数吗? 还有就是他有没有增强亮度的函数?
VS2015+opencv3.1.0+win7调试模式Debug出现问题,Release模式正常
使用VS2015+opencv3.1.0时调试出现以下问题,属性表都配置了。![图片说明](https://img-ask.csdn.net/upload/201610/18/1476763336_973563.png)
Java学习的正确打开方式
在博主认为,对于入门级学习java的最佳学习方法莫过于视频+博客+书籍+总结,前三者博主将淋漓尽致地挥毫于这篇博客文章中,至于总结在于个人,实际上越到后面你会发现学习的最好方式就是阅读参考官方文档其次就是国内的书籍,博客次之,这又是一个层次了,这里暂时不提后面再谈。博主将为各位入门java保驾护航,各位只管冲鸭!!!上天是公平的,只要不辜负时间,时间自然不会辜负你。 何谓学习?博主所理解的学习,它是一个过程,是一个不断累积、不断沉淀、不断总结、善于传达自己的个人见解以及乐于分享的过程。
程序员必须掌握的核心算法有哪些?
由于我之前一直强调数据结构以及算法学习的重要性,所以就有一些读者经常问我,数据结构与算法应该要学习到哪个程度呢?,说实话,这个问题我不知道要怎么回答你,主要取决于你想学习到哪些程度,不过针对这个问题,我稍微总结一下我学过的算法知识点,以及我觉得值得学习的算法。这些算法与数据结构的学习大多数是零散的,并没有一本把他们全部覆盖的书籍。下面是我觉得值得学习的一些算法以及数据结构,当然,我也会整理一些看过...
有哪些让程序员受益终生的建议
从业五年多,辗转两个大厂,出过书,创过业,从技术小白成长为基层管理,联合几个业内大牛回答下这个问题,希望能帮到大家,记得帮我点赞哦。 敲黑板!!!读了这篇文章,你将知道如何才能进大厂,如何实现财务自由,如何在工作中游刃有余,这篇文章很长,但绝对是精品,记得帮我点赞哦!!!! 一腔肺腑之言,能看进去多少,就看你自己了!!! 目录: 在校生篇: 为什么要尽量进大厂? 如何选择语言及方...
大学四年自学走来,这些私藏的实用工具/学习网站我贡献出来了
大学四年,看课本是不可能一直看课本的了,对于学习,特别是自学,善于搜索网上的一些资源来辅助,还是非常有必要的,下面我就把这几年私藏的各种资源,网站贡献出来给你们。主要有:电子书搜索、实用工具、在线视频学习网站、非视频学习网站、软件下载、面试/求职必备网站。 注意:文中提到的所有资源,文末我都给你整理好了,你们只管拿去,如果觉得不错,转发、分享就是最大的支持了。 一、电子书搜索 对于大部分程序员...
linux系列之常用运维命令整理笔录
本博客记录工作中需要的linux运维命令,大学时候开始接触linux,会一些基本操作,可是都没有整理起来,加上是做开发,不做运维,有些命令忘记了,所以现在整理成博客,当然vi,文件操作等就不介绍了,慢慢积累一些其它拓展的命令,博客不定时更新 free -m 其中:m表示兆,也可以用g,注意都要小写 Men:表示物理内存统计 total:表示物理内存总数(total=used+free) use...
比特币原理详解
一、什么是比特币 比特币是一种电子货币,是一种基于密码学的货币,在2008年11月1日由中本聪发表比特币白皮书,文中提出了一种去中心化的电子记账系统,我们平时的电子现金是银行来记账,因为银行的背后是国家信用。去中心化电子记账系统是参与者共同记账。比特币可以防止主权危机、信用风险。其好处不多做赘述,这一层面介绍的文章很多,本文主要从更深层的技术原理角度进行介绍。 二、问题引入 假设现有4个人...
程序员接私活怎样防止做完了不给钱?
首先跟大家说明一点,我们做 IT 类的外包开发,是非标品开发,所以很有可能在开发过程中会有这样那样的需求修改,而这种需求修改很容易造成扯皮,进而影响到费用支付,甚至出现做完了项目收不到钱的情况。 那么,怎么保证自己的薪酬安全呢? 我们在开工前,一定要做好一些证据方面的准备(也就是“讨薪”的理论依据),这其中最重要的就是需求文档和验收标准。一定要让需求方提供这两个文档资料作为开发的基础。之后开发...
网页实现一个简单的音乐播放器(大佬别看。(⊙﹏⊙))
今天闲着无事,就想写点东西。然后听了下歌,就打算写个播放器。 于是乎用h5 audio的加上js简单的播放器完工了。 演示地点演示 html代码如下` music 这个年纪 七月的风 音乐 ` 然后就是css`*{ margin: 0; padding: 0; text-decoration: none; list-...
Python十大装B语法
Python 是一种代表简单思想的语言,其语法相对简单,很容易上手。不过,如果就此小视 Python 语法的精妙和深邃,那就大错特错了。本文精心筛选了最能展现 Python 语法之精妙的十个知识点,并附上详细的实例代码。如能在实战中融会贯通、灵活使用,必将使代码更为精炼、高效,同时也会极大提升代码B格,使之看上去更老练,读起来更优雅。
数据库优化 - SQL优化
以实际SQL入手,带你一步一步走上SQL优化之路!
2019年11月中国大陆编程语言排行榜
2019年11月2日,我统计了某招聘网站,获得有效程序员招聘数据9万条。针对招聘信息,提取编程语言关键字,并统计如下: 编程语言比例 rank pl_ percentage 1 java 33.62% 2 cpp 16.42% 3 c_sharp 12.82% 4 javascript 12.31% 5 python 7.93% 6 go 7.25% 7 p...
通俗易懂地给女朋友讲:线程池的内部原理
餐盘在灯光的照耀下格外晶莹洁白,女朋友拿起红酒杯轻轻地抿了一小口,对我说:“经常听你说线程池,到底线程池到底是个什么原理?”
《奇巧淫技》系列-python!!每天早上八点自动发送天气预报邮件到QQ邮箱
将代码部署服务器,每日早上定时获取到天气数据,并发送到邮箱。 也可以说是一个小型人工智障。 知识可以运用在不同地方,不一定非是天气预报。
经典算法(5)杨辉三角
杨辉三角 是经典算法,这篇博客对它的算法思想进行了讲解,并有完整的代码实现。
英特尔不为人知的 B 面
从 PC 时代至今,众人只知在 CPU、GPU、XPU、制程、工艺等战场中,英特尔在与同行硬件芯片制造商们的竞争中杀出重围,且在不断的成长进化中,成为全球知名的半导体公司。殊不知,在「刚硬」的背后,英特尔「柔性」的软件早已经做到了全方位的支持与支撑,并持续发挥独特的生态价值,推动产业合作共赢。 而对于这一不知人知的 B 面,很多人将其称之为英特尔隐形的翅膀,虽低调,但是影响力却不容小觑。 那么,在...
腾讯算法面试题:64匹马8个跑道需要多少轮才能选出最快的四匹?
昨天,有网友私信我,说去阿里面试,彻底的被打击到了。问了为什么网上大量使用ThreadLocal的源码都会加上private static?他被难住了,因为他从来都没有考虑过这个问题。无独有偶,今天笔者又发现有网友吐槽了一道腾讯的面试题,我们一起来看看。 腾讯算法面试题:64匹马8个跑道需要多少轮才能选出最快的四匹? 在互联网职场论坛,一名程序员发帖求助到。二面腾讯,其中一个算法题:64匹...
面试官:你连RESTful都不知道我怎么敢要你?
干货,2019 RESTful最贱实践
为啥国人偏爱Mybatis,而老外喜欢Hibernate/JPA呢?
关于SQL和ORM的争论,永远都不会终止,我也一直在思考这个问题。昨天又跟群里的小伙伴进行了一番讨论,感触还是有一些,于是就有了今天这篇文。 声明:本文不会下关于Mybatis和JPA两个持久层框架哪个更好这样的结论。只是摆事实,讲道理,所以,请各位看官勿喷。 一、事件起因 关于Mybatis和JPA孰优孰劣的问题,争论已经很多年了。一直也没有结论,毕竟每个人的喜好和习惯是大不相同的。我也看...
白话阿里巴巴Java开发手册高级篇
不久前,阿里巴巴发布了《阿里巴巴Java开发手册》,总结了阿里巴巴内部实际项目开发过程中开发人员应该遵守的研发流程规范,这些流程规范在一定程度上能够保证最终的项目交付质量,通过在时间中总结模式,并推广给广大开发人员,来避免研发人员在实践中容易犯的错误,确保最终在大规模协作的项目中达成既定目标。 无独有偶,笔者去年在公司里负责升级和制定研发流程、设计模板、设计标准、代码标准等规范,并在实际工作中进行...
SQL-小白最佳入门sql查询一
不要偷偷的查询我的个人资料,即使你再喜欢我,也不要这样,真的不好;
redis分布式锁,面试官请随便问,我都会
文章有点长并且绕,先来个图片缓冲下! 前言 现在的业务场景越来越复杂,使用的架构也就越来越复杂,分布式、高并发已经是业务要求的常态。像腾讯系的不少服务,还有CDN优化、异地多备份等处理。 说到分布式,就必然涉及到分布式锁的概念,如何保证不同机器不同线程的分布式锁同步呢? 实现要点 互斥性,同一时刻,智能有一个客户端持有锁。 防止死锁发生,如果持有锁的客户端崩溃没有主动释放锁,也要保证锁可以正常释...
项目中的if else太多了,该怎么重构?
介绍 最近跟着公司的大佬开发了一款IM系统,类似QQ和微信哈,就是聊天软件。我们有一部分业务逻辑是这样的 if (msgType = "文本") { // dosomething } else if(msgType = "图片") { // doshomething } else if(msgType = "视频") { // doshomething } else { // doshom...
Nginx 原理和架构
Nginx 是一个免费的,开源的,高性能的 HTTP 服务器和反向代理,以及 IMAP / POP3 代理服务器。Nginx 以其高性能,稳定性,丰富的功能,简单的配置和低资源消耗而闻名。 Nginx 的整体架构 Nginx 里有一个 master 进程和多个 worker 进程。master 进程并不处理网络请求,主要负责调度工作进程:加载配置、启动工作进程及非停升级。worker 进程负责处...
Python 编程开发 实用经验和技巧
Python是一门很灵活的语言,也有很多实用的方法,有时候实现一个功能可以用多种方法实现,我这里总结了一些常用的方法和技巧,包括小数保留指定位小数、判断变量的数据类型、类方法@classmethod、制表符中文对齐、遍历字典、datetime.timedelta的使用等,会持续更新......
YouTube排名第一的励志英文演讲《Dream(梦想)》
Idon’t know what that dream is that you have, I don't care how disappointing it might have been as you've been working toward that dream,but that dream that you’re holding in your mind, that it’s po...
“狗屁不通文章生成器”登顶GitHub热榜,分分钟写出万字形式主义大作
一、垃圾文字生成器介绍 最近在浏览GitHub的时候,发现了这样一个骨骼清奇的雷人项目,而且热度还特别高。 项目中文名:狗屁不通文章生成器 项目英文名:BullshitGenerator 根据作者的介绍,他是偶尔需要一些中文文字用于GUI开发时测试文本渲染,因此开发了这个废话生成器。但由于生成的废话实在是太过富于哲理,所以最近已经被小伙伴们给玩坏了。 他的文风可能是这样的: 你发现,...
程序员:我终于知道post和get的区别
是一个老生常谈的话题,然而随着不断的学习,对于以前的认识有很多误区,所以还是需要不断地总结的,学而时习之,不亦说乎
《程序人生》系列-这个程序员只用了20行代码就拿了冠军
你知道的越多,你不知道的越多 点赞再看,养成习惯GitHub上已经开源https://github.com/JavaFamily,有一线大厂面试点脑图,欢迎Star和完善 前言 这一期不算《吊打面试官》系列的,所有没前言我直接开始。 絮叨 本来应该是没有这期的,看过我上期的小伙伴应该是知道的嘛,双十一比较忙嘛,要值班又要去帮忙拍摄年会的视频素材,还得搞个程序员一天的Vlog,还要写BU...
加快推动区块链技术和产业创新发展,2019可信区块链峰会在京召开
11月8日,由中国信息通信研究院、中国通信标准化协会、中国互联网协会、可信区块链推进计划联合主办,科技行者协办的2019可信区块链峰会将在北京悠唐皇冠假日酒店开幕。   区块链技术被认为是继蒸汽机、电力、互联网之后,下一代颠覆性的核心技术。如果说蒸汽机释放了人类的生产力,电力解决了人类基本的生活需求,互联网彻底改变了信息传递的方式,区块链作为构造信任的技术有重要的价值。   1...
Java世界最常用的工具类库
Apache Commons Apache Commons有很多子项目 Google Guava 参考博客
程序员把地府后台管理系统做出来了,还有3.0版本!12月7号最新消息:已在开发中有github地址
第一幕:缘起 听说阎王爷要做个生死簿后台管理系统,我们派去了一个程序员…… 996程序员做的梦: 第一场:团队招募 为了应对地府管理危机,阎王打算找“人”开发一套地府后台管理系统,于是就在地府总经办群中发了项目需求。 话说还是中国电信的信号好,地府都是满格,哈哈!!! 经常会有外行朋友问:看某网站做的不错,功能也简单,你帮忙做一下? 而这次,面对这样的需求,这个程序员...
相关热词 c# 二进制截断字符串 c#实现窗体设计器 c#检测是否为微信 c# plc s1200 c#里氏转换原则 c# 主界面 c# do loop c#存为组套 模板 c# 停掉协程 c# rgb 读取图片
立即提问