升级glibc2.14失败,如何解决?

在CentOS 6环境下升级Android SDK的platform-tools版本到最新的23时,报/lib64/libc.so.6: version `GLIBC_2.14' not found错误,升级glibc2.14出现glibc-2.14/etc/ld.so.conf: No such file or directory错误,使用命令touch /glibc-2.14/etc/ld.so.conf不再报错,但查看glibc安装版本还是不对,系统的glibc版本始终是glibc-2.12,也就是依然没有安装进去,使用export LD_LIBRARY_PATH=/opt/glibc-2.14/lib:$LD_LIBRARY_PATH修改过临时变量,都不能解决,请问如何成功安装glibc?谢谢!备注:glibc的版本我用的是glibc-2.14.tar.xz这个压缩包。

0个回答

升级GLIBC_2.14
----------------------同志你好,我是CSDN问答机器人小N,奉组织之命为你提供参考答案,编程尚未成功,同志仍需努力!

Csdn user default icon
上传中...
上传图片
插入图片
抄袭、复制答案,以达到刷声望分或其他目的的行为,在CSDN问答是严格禁止的,一经发现立刻封号。是时候展现真正的技术了!
其他相关推荐
centOS7系统中报GLIBC_2.14' not found
centOS7版本的linux系统启动一个服务时报: ./lib/libc.so.6: version `GLIBC_2.14' not found (required by /lib64/librt.so.1) 使用strings /lib64/libc.so.6 | grep GLIBC: GLIBC_2.2.5 GLIBC_2.2.6 GLIBC_2.3 GLIBC_2.3.2 GLIBC_2.3.3 GLIBC_2.3.4 GLIBC_2.4 GLIBC_2.5 GLIBC_2.6 GLIBC_2.7 GLIBC_2.8 GLIBC_2.9 GLIBC_2.10 GLIBC_2.11 GLIBC_2.12 GLIBC_2.13 GLIBC_2.14 GLIBC_2.15 GLIBC_2.16 GLIBC_2.17 GLIBC_PRIVATE 是存在GLIBC_2.14的,这是什么原因,应该怎么解决呢,请大家帮忙解决下,谢谢
arm9开发板升级glibc2.14的问题
现在板子里的版本是2.5,然后运行一个Qt程序的时候提示glibc版本太低,运行不了, 于是就开始琢磨着升级板子里的glibc,可是问题来了,我交叉编译了glibc2.14后怎么去替换 板子里原有的2.5呢,每次将libc.so.6软连接到glibc2.14后就出现了段错误,ls cp这些基本 指令都用不了,我也该怎么弄呢??望诸位能点拨一下小弟啊。。。
javaweb服务器linux glibc2.12升级2.14后java命令与tomcat服务失效
最近做的系统需要支持指纹识别,指纹识别放提供的so文件依赖glibc2.14,然而当我升级成功后,java和tomcat命令突然运行失效,不知道是什么原因
我在CentOS6.5升级glibc-2.14 make install出现错误
我在CentOS6.5升级glibc-2.14 make install出现错误:Can't open configuration file /opt/glibc-2.14/etc/ld.so.conf: No such file or directory。 大家有谁遇到过,请帮我解决下子,困扰我了。谢谢!我没有悬赏分数了,抱歉。
linux升级glibc2.11报错
linux升级glibc2.11报错,部分报错信息如下: gcc ../sysdeps/x86_64/dl-trampoline.S -c -I../include -I/usr/glibc/glibc-2.11.1/glibc-build/elf -I/usr/glibc/glibc-2.11.1/glibc-build -I../sysdeps/x86_64/elf -I../nptl/sysdeps/unix/sysv/linux/x86_64 -I../sysdeps/unix/sysv/linux/x86_64 -I../sysdeps/unix/sysv/linux/wordsize-64 -I../nptl/sysdeps/unix/sysv/linux -I../nptl/sysdeps/pthread -I../sysdeps/pthread -I../ports/sysdeps/unix/sysv/linux -I../sysdeps/unix/sysv/linux -I../sysdeps/gnu -I../sysdeps/unix/common -I../sysdeps/unix/mman -I../sysdeps/unix/inet -I../nptl/sysdeps/unix/sysv -I../ports/sysdeps/unix/sysv -I../sysdeps/unix/sysv -I../sysdeps/unix/x86_64 -I../nptl/sysdeps/unix -I../ports/sysdeps/unix -I../sysdeps/unix -I../sysdeps/posix -I../sysdeps/x86_64/fpu -I../nptl/sysdeps/x86_64 -I../sysdeps/x86_64 -I../sysdeps/wordsize-64 -I../sysdeps/ieee754/ldbl-96 -I../sysdeps/ieee754/dbl-64 -I../sysdeps/ieee754/flt-32 -I../sysdeps/ieee754 -I../sysdeps/generic/elf -I../sysdeps/generic -I../nptl -I../ports -I.. -I../libio -I. -D_LIBC_REENTRANT -include ../include/libc-symbols.h -DASSEMBLER -g -Wa,--noexecstack -o /usr/glibc/glibc-2.11.1/glibc-build/elf/dl-trampoline.o -MD -MP -MF /usr/glibc/glibc-2.11.1/glibc-build/elf/dl-trampoline.o.dt -MT /usr/glibc/glibc-2.11.1/glibc-build/elf/dl-trampoline.o ../sysdeps/x86_64/dl-trampoline.h: Assembler messages: ../sysdeps/x86_64/dl-trampoline.h:23: Error: no such instruction: `vmovdqu %ymm0,(192)(%rsp)' ../sysdeps/x86_64/dl-trampoline.h:24: Error: no such instruction: `vmovdqu %ymm1,(192+64)(%rsp)' ../sysdeps/x86_64/dl-trampoline.h:25: Error: no such instruction: `vmovdqu %ymm2,(192+64*2)(%rsp)' ../sysdeps/x86_64/dl-trampoline.h:26: Error: no such instruction: `vmovdqu %ymm3,(192+64*3)(%rsp)' ../sysdeps/x86_64/dl-trampoline.h:27: Error: no such instruction: `vmovdqu %ymm4,(192+64*4)(%rsp)' ../sysdeps/x86_64/dl-trampoline.h:28: Error: no such instruction: `vmovdqu %ymm5,(192+64*5)(%rsp)' ../sysdeps/x86_64/dl-trampoline.h:29: Error: no such instruction: `vmovdqu %ymm6,(192+64*6)(%rsp)' ../sysdeps/x86_64/dl-trampoline.h:30: Error: no such instruction: `vmovdqu %ymm7,(192+64*7)(%rsp)' ../sysdeps/x86_64/dl-trampoline.h:34: Error: no such instruction: `vmovdqa %xmm0,(704)(%rsp)' ../sysdeps/x86_64/dl-trampoline.h:35: Error: no such instruction: `vmovdqa %xmm1,(704+16)(%rsp)' ../sysdeps/x86_64/dl-trampoline.h:36: Error: no such instruction: `vmovdqa %xmm2,(704+16*2)(%rsp)' ../sysdeps/x86_64/dl-trampoline.h:37: Error: no such instruction: `vmovdqa %xmm3,(704+16*3)(%rsp)' ../sysdeps/x86_64/dl-trampoline.h:38: Error: no such instruction: `vmovdqa %xmm4,(704+16*4)(%rsp)' ../sysdeps/x86_64/dl-trampoline.h:39: Error: no such instruction: `vmovdqa %xmm5,(704+16*5)(%rsp)' ../sysdeps/x86_64/dl-trampoline.h:40: Error: no such instruction: `vmovdqa %xmm6,(704+16*6)(%rsp)' ../sysdeps/x86_64/dl-trampoline.h:41: Error: no such instruction: `vmovdqa %xmm7,(704+16*7)(%rsp)' ../sysdeps/x86_64/dl-trampoline.h:70: Error: no such instruction: `vpcmpeqq (704)(%rsp),%xmm0,%xmm8' ../sysdeps/x86_64/dl-trampoline.h:71: Error: no such instruction: `vpmovmskb %xmm8,%esi' ../sysdeps/x86_64/dl-trampoline.h:74: Error: no such instruction: `vmovdqa %xmm0,(192)(%rsp)' ../sysdeps/x86_64/dl-trampoline.h:76: Error: no such instruction: `vmovdqu (192)(%rsp),%ymm0' ../sysdeps/x86_64/dl-trampoline.h:77: Error: no such instruction: `vmovdqa %xmm0,(64)(%rsp)' ../sysdeps/x86_64/dl-trampoline.h:79: Error: no such instruction: `vpcmpeqq (704+16)(%rsp),%xmm1,%xmm8' ../sysdeps/x86_64/dl-trampoline.h:80: Error: no such instruction: `vpmovmskb %xmm8,%esi' ../sysdeps/x86_64/dl-trampoline.h:83: Error: no such instruction: `vmovdqa %xmm1,(192+64)(%rsp)' ../sysdeps/x86_64/dl-trampoline.h:85: Error: no such instruction: `vmovdqu (192+64)(%rsp),%ymm1' ../sysdeps/x86_64/dl-trampoline.h:86: Error: no such instruction: `vmovdqa %xmm1,(64+16)(%rsp)' ../sysdeps/x86_64/dl-trampoline.h:88: Error: no such instruction: `vpcmpeqq (704+16*2)(%rsp),%xmm2,%xmm8' ../sysdeps/x86_64/dl-trampoline.h:89: Error: no such instruction: `vpmovmskb %xmm8,%esi' ../sysdeps/x86_64/dl-trampoline.h:92: Error: no such instruction: `vmovdqa %xmm2,(192+64*2)(%rsp)' ../sysdeps/x86_64/dl-trampoline.h:94: Error: no such instruction: `vmovdqu (192+64*2)(%rsp),%ymm2' ../sysdeps/x86_64/dl-trampoline.h:95: Error: no such instruction: `vmovdqa %xmm2,(64+16*2)(%rsp)' ../sysdeps/x86_64/dl-trampoline.h:97: Error: no such instruction: `vpcmpeqq (704+16*3)(%rsp),%xmm3,%xmm8' ../sysdeps/x86_64/dl-trampoline.h:98: Error: no such instruction: `vpmovmskb %xmm8,%esi' ../sysdeps/x86_64/dl-trampoline.h:101: Error: no such instruction: `vmovdqa %xmm3,(192+64*3)(%rsp)' ../sysdeps/x86_64/dl-trampoline.h:103: Error: no such instruction: `vmovdqu (192+64*3)(%rsp),%ymm3' ../sysdeps/x86_64/dl-trampoline.h:104: Error: no such instruction: `vmovdqa %xmm3,(64+16*3)(%rsp)' ../sysdeps/x86_64/dl-trampoline.h:106: Error: no such instruction: `vpcmpeqq (704+16*4)(%rsp),%xmm4,%xmm8' ../sysdeps/x86_64/dl-trampoline.h:107: Error: no such instruction: `vpmovmskb %xmm8,%esi' ../sysdeps/x86_64/dl-trampoline.h:110: Error: no such instruction: `vmovdqa %xmm4,(192+64*4)(%rsp)' ../sysdeps/x86_64/dl-trampoline.h:112: Error: no such instruction: `vmovdqu (192+64*4)(%rsp),%ymm4' ../sysdeps/x86_64/dl-trampoline.h:113: Error: no such instruction: `vmovdqa %xmm4,(64+16*4)(%rsp)' ../sysdeps/x86_64/dl-trampoline.h:115: Error: no such instruction: `vpcmpeqq (704+16*5)(%rsp),%xmm5,%xmm8' ../sysdeps/x86_64/dl-trampoline.h:116: Error: no such instruction: `vpmovmskb %xmm8,%esi' ../sysdeps/x86_64/dl-trampoline.h:119: Error: no such instruction: `vmovdqa %xmm5,(192+64*5)(%rsp)' ../sysdeps/x86_64/dl-trampoline.h:121: Error: no such instruction: `vmovdqu (192+64*5)(%rsp),%ymm5' ../sysdeps/x86_64/dl-trampoline.h:122: Error: no such instruction: `vmovdqa %xmm5,(64+16*5)(%rsp)' ../sysdeps/x86_64/dl-trampoline.h:124: Error: no such instruction: `vpcmpeqq (704+16*6)(%rsp),%xmm6,%xmm8' ../sysdeps/x86_64/dl-trampoline.h:125: Error: no such instruction: `vpmovmskb %xmm8,%esi' ../sysdeps/x86_64/dl-trampoline.h:128: Error: no such instruction: `vmovdqa %xmm6,(192+64*6)(%rsp)' ../sysdeps/x86_64/dl-trampoline.h:130: Error: no such instruction: `vmovdqu (192+64*6)(%rsp),%ymm6' ../sysdeps/x86_64/dl-trampoline.h:131: Error: no such instruction: `vmovdqa %xmm6,(64+16*6)(%rsp)' ../sysdeps/x86_64/dl-trampoline.h:133: Error: no such instruction: `vpcmpeqq (704+16*7)(%rsp),%xmm7,%xmm8' ../sysdeps/x86_64/dl-trampoline.h:134: Error: no such instruction: `vpmovmskb %xmm8,%esi' ../sysdeps/x86_64/dl-trampoline.h:137: Error: no such instruction: `vmovdqa %xmm7,(192+64*7)(%rsp)' ../sysdeps/x86_64/dl-trampoline.h:139: Error: no such instruction: `vmovdqu (192+64*7)(%rsp),%ymm7' ../sysdeps/x86_64/dl-trampoline.h:140: Error: no such instruction: `vmovdqa %xmm7,(64+16*7)(%rsp)' ../sysdeps/x86_64/dl-trampoline.h:217: Error: no such instruction: `vmovdqu %ymm0,80(%rcx)' ../sysdeps/x86_64/dl-trampoline.h:218: Error: no such instruction: `vmovdqu %ymm1,144(%rcx)' ../sysdeps/x86_64/dl-trampoline.h:222: Error: no such instruction: `vmovdqa %xmm0,(208)(%rcx)' ../sysdeps/x86_64/dl-trampoline.h:223: Error: no such instruction: `vmovdqa %xmm1,(208+16)(%rcx)' ../sysdeps/x86_64/dl-trampoline.h:243: Error: no such instruction: `vpcmpeqq (208)(%rsp),%xmm0,%xmm2' ../sysdeps/x86_64/dl-trampoline.h:244: Error: no such instruction: `vpmovmskb %xmm2,%esi' ../sysdeps/x86_64/dl-trampoline.h:247: Error: no such instruction: `vmovdqu 80(%rsp),%ymm0' ../sysdeps/x86_64/dl-trampoline.h:249: Error: no such instruction: `vpcmpeqq (208+16)(%rsp),%xmm1,%xmm2' ../sysdeps/x86_64/dl-trampoline.h:250: Error: no such instruction: `vpmovmskb %xmm2,%esi' ../sysdeps/x86_64/dl-trampoline.h:253: Error: no such instruction: `vmovdqu 144(%rsp),%ymm1' make[2]: *** [/usr/glibc/glibc-2.11.1/glibc-build/elf/dl-trampoline.o] 错误 1 make[2]: Leaving directory `/usr/glibc/glibc-2.11.1/elf' make[1]: *** [elf/subdir_lib] 错误 2 make[1]: Leaving directory `/usr/glibc/glibc-2.11.1' make: *** [all] 错误 2
Linux Glibc2.12 升级到 2.14之后,Root用户正常,普通用户无法登录无法使用。
如题,普通用户指令全部失效,报错:error while loading shared libraries: libc.so.6: cannot open shared object file: No such file or directory Root用户全部正常。 求大神教我!!!感激不尽
redhat 升级glibc到2.29版本会对系统产生什么影响?
最近在迁移php的服务器,需要手动安装php编译安装所需的依赖包(运维不让用yum,贼恶心),在安装 libxml2-2.9.8-5.fc30.x86_64(安全部门要求的,要比libxml2-2.9.1-6.e17_2.3.x86_64这个版本高,说是有拒绝服务的风险,我也很无奈)的时候,报错了: ``` error: Failed dependencies: libc.so.6(GLIBC_2.28)(64bit) is needed by libxml2-2.9.8-5.fc30.x86_64 libm.so.6(GLIBC_2.29)(64bit) is needed by libxml2-2.9.8-5.fc30.x86_64 ``` * 问题一:如果我按照它的提示去升级glibc到2.29版本,会对系统产生什么影响吗?因为我查了一下,有些人说系统会起不来,建议不轻易去升级这个。 * 问题二:如果要升级glibc,那么该如何升级呢? * 问题三:或者下一个低一点版本的libxml2包,是不是不需要升级glibc了呢? 希望各位大神不吝赐教,再次谢过!
import tensorflow 时报错:version GLIBC_2.14 not found
**Linux下使用 pip install tensorflow --upgrade 命令安装成功,但是在import tensorflow的时候报错,具体错误如下: ** >>> import tensorflow Traceback (most recent call last): File "/usr/local/lib/python3.5/site-packages/tensorflow/python/pywrap_tensorflow.py", line 41, in <module> from tensorflow.python.pywrap_tensorflow_internal import * File "/usr/local/lib/python3.5/site-packages/tensorflow/python/pywrap_tensorflow_internal.py", line 28, in <module> _pywrap_tensorflow_internal = swig_import_helper() File "/usr/local/lib/python3.5/site-packages/tensorflow/python/pywrap_tensorflow_internal.py", line 24, in swig_import_helper _mod = imp.load_module('_pywrap_tensorflow_internal', fp, pathname, description) File "/usr/local/lib/python3.5/imp.py", line 242, in load_module return load_dynamic(name, filename, file) File "/usr/local/lib/python3.5/imp.py", line 342, in load_dynamic return _load(spec) ImportError: /usr/lib64/libstdc++.so.6: version `GLIBCXX_3.4.18' not found (required by /usr/local/lib/python3.5/site-packages/tensorflow/python/_pywrap_tensorflow_internal.so) During handling of the above exception, another exception occurred: Traceback (most recent call last): File "<stdin>", line 1, in <module> File "/usr/local/lib/python3.5/site-packages/tensorflow/__init__.py", line 24, in <module> from tensorflow.python import * File "/usr/local/lib/python3.5/site-packages/tensorflow/python/__init__.py", line 49, in <module> from tensorflow.python import pywrap_tensorflow File "/usr/local/lib/python3.5/site-packages/tensorflow/python/pywrap_tensorflow.py", line 52, in <module> raise ImportError(msg) ImportError: Traceback (most recent call last): File "/usr/local/lib/python3.5/site-packages/tensorflow/python/pywrap_tensorflow.py", line 41, in <module> from tensorflow.python.pywrap_tensorflow_internal import * File "/usr/local/lib/python3.5/site-packages/tensorflow/python/pywrap_tensorflow_internal.py", line 28, in <module> _pywrap_tensorflow_internal = swig_import_helper() File "/usr/local/lib/python3.5/site-packages/tensorflow/python/pywrap_tensorflow_internal.py", line 24, in swig_import_helper _mod = imp.load_module('_pywrap_tensorflow_internal', fp, pathname, description) File "/usr/local/lib/python3.5/imp.py", line 242, in load_module return load_dynamic(name, filename, file) File "/usr/local/lib/python3.5/imp.py", line 342, in load_dynamic return _load(spec) ImportError: /usr/lib64/libstdc++.so.6: version `GLIBCXX_3.4.18' not found (required by /usr/local/lib/python3.5/site-packages/tensorflow/python/_pywrap_tensorflow_internal.so) Failed to load the native TensorFlow runtime. See https://www.tensorflow.org/install/install_sources#common_installation_problems for some common reasons and solutions. Include the entire stack trace above this error message when asking for help. **最开始是 version 'GLIBC2.14' not found,升级到glibc2.14版本后,又报错 version ‘GLIBC2.18’not found,又升级到2.19版本就报现在这个错误,这真是由于GLIBC版本过低引起的吗,怎么解决?**
为什么glibc2.23要修改struct sockaddr_storage?
glibc在2.23版本有一个修改https://patchwork.sourceware.org/patch/12453/. 在我的Cotex A7上试验: 修改前: ``` struct sockaddr_in6 { sin6_family; //0th byte sin6_port; //2nd byte sin6_flowinfo; //4th byte sin6_addr; //8th byte ... }; struct sockaddr_storage { ss_family; //0th byte __ss_align; //4th byte __ss_padding; //8th byte }; ``` 修改后: ``` struct sockaddr_storage { ss_family; //0th byte __ss_padding; //2nd byte __ss_align; //124th byte }; ``` 这次合入把sockaddr__storage结构中的__ss_align和__ss_padding交换了位置。 这样会导致以前常用的下列类型强转的用法出现问题:_ ``` struct sockaddr_storage prefix_addr (struct sockaddr_in6 *)&(prefix_addr)->sin6_addr.s6_addr ``` 请问有没有人能看出glibc这个修改是什么用意? 我上述的强转用法是否本身就不规范(虽然glibc2.23之前一直运行稳定)。
centos7 安装glibc2.23,configure: error: The x86_64 is not supported.
进入python时,导入以下命令出现glibc版本异常 ``` import tensorflow as tf ``` ![图片说明](https://img-ask.csdn.net/upload/201909/11/1568195596_990140.png) 下载对应的glibc版本 ``` ./configure --prefix=/usr/local/glibc-2.2.3 --disable-profile --enable-add-ons --with-headers=/usr/include --with-binutils=/usr/bin ``` 又遇一个坑 ![图片说明](https://img-ask.csdn.net/upload/201909/11/1568195807_735696.png) 也去网上找了一些方法,但问题还是存在! 以下是我找的资料: https://blog.csdn.net/qq_37817129/article/details/89570808 https://blog.csdn.net/f0UiRe/article/details/88736755 https://blog.csdn.net/u013216061/article/details/78813805 http://www.itkeyword.com/doc/2258901672188509x371/how-to-compile-glibc-32bit-on-an-x86-64-machine http://blog.chinaunix.net/uid-26000296-id-5159364.html
libcrypto.so.1.0.0: cannot open shared object file: No such file or directory, 请求帮助。
已经看了很多关于这方面的帖子,知道是libcrypto.so.1.0.0库文件缺失,已经从网上下载了很多的libcrypto.so.1.0.0,可是添加进去后发现新的错误libcrypto.so.1.0.0:version"GLIBC_2.14"not found,我一开始以为是找的库文件有问题,自己搭虚拟机,添加库文件,运行程序发现能跑起来,用的是CentOS7,发现他最高支持glibc-2.17,然后发现自己的实际linux系统时CentOS6.8,64位,它的glibc最高支持2.12,找到的解决办法是升级glibc到2.14,不过看网上都不怎么推荐升级,很容易出事情,我有点怕了,所以我想请问有没有人可以分享给我能在glibc2.12下可以使用的libcrypto.so.1.0.0,不胜感激。
交叉编译 glibc-2.14.1 for ARM平台,make的时候报如下错误,怎么解?
No rule to make target `/root/cross_compile_from_scratch/glibc-build/misc/ioperm.o', needed by `/root/cross_compile_from_scratch/glibc-build/misc/stamp.o'
arm交叉编译STLport-5.2.1库,编译错误?
**编译环境:** Ubuntu 12.04.1 LTS (GNU/Linux 3.2.0-24-generic x86_64) **编译器:** arm-hisiv300nptl-linux **编译过程:** $tar -xvf STLport-5.2.1.tar.bz2 $cd STLport-5.2.1 $./configure --target=arm-hisiv300-linux $make **编译错误打印:** In file included from ../../src/c_locale.c:26:0: ../../src/c_locale_glibc/c_locale_glibc2.c: In function ‘_Locale_ctype_name’: ../../src/c_locale_glibc/c_locale_glibc2.c:162:27: error: dereferencing pointer to incomplete type return ((locale_t)__loc)->__names[LC_CTYPE]; ^ ../../src/c_locale_glibc/c_locale_glibc2.c: In function ‘_Locale_numeric_name’: ../../src/c_locale_glibc/c_locale_glibc2.c:172:27: error: dereferencing pointer to incomplete type return ((locale_t)__loc)->__names[LC_NUMERIC]; ^ ../../src/c_locale_glibc/c_locale_glibc2.c: In function ‘_Locale_time_name’: ../../src/c_locale_glibc/c_locale_glibc2.c:177:27: error: dereferencing pointer to incomplete type return ((locale_t)__loc)->__names[LC_TIME]; ^ ../../src/c_locale_glibc/c_locale_glibc2.c: In function ‘_Locale_collate_name’: ../../src/c_locale_glibc/c_locale_glibc2.c:182:27: error: dereferencing pointer to incomplete type return ((locale_t)__loc)->__names[LC_COLLATE]; ^ ../../src/c_locale_glibc/c_locale_glibc2.c: In function ‘_Locale_monetary_name’: ../../src/c_locale_glibc/c_locale_glibc2.c:187:27: error: dereferencing pointer to incomplete type return ((locale_t)__loc)->__names[LC_MONETARY]; ^ ../../src/c_locale_glibc/c_locale_glibc2.c: In function ‘_Locale_messages_name’: ../../src/c_locale_glibc/c_locale_glibc2.c:192:27: error: dereferencing pointer to incomplete type return ((locale_t)__loc)->__names[LC_MESSAGES]; ^ In file included from ../../src/stlport_prefix.h:21:0, from ../../src/c_locale.c:19: ../../src/c_locale_glibc/c_locale_glibc2.c: In function ‘_Locale_ctype_table’: ../../src/c_locale_glibc/c_locale_glibc2.c:283:74: error: dereferencing pointer to incomplete type _STLP_STATIC_ASSERT( sizeof(_Locale_mask_t) == sizeof(((locale_t)__loc)->__ct ype_b[0]) ) ^ ../../stlport/stl/config/features.h:311:66: note: in definition of macro ‘_STLP_ STATIC_ASSERT’ # define _STLP_STATIC_ASSERT(expr) typedef char __static_assert[expr ? 1 : -1] ; ^ In file included from ../../src/c_locale.c:26:0: ../../src/c_locale_glibc/c_locale_glibc2.c:284:27: error: dereferencing pointer to incomplete type return ((locale_t)__loc)->__ctype_b; ^ ../../src/c_locale_glibc/c_locale_glibc2.c: In function ‘_Locale_toupper’: ../../src/c_locale_glibc/c_locale_glibc2.c:288:27: error: dereferencing pointer to incomplete type { return ((locale_t)__loc)->__ctype_toupper[c]; } ^ ../../src/c_locale_glibc/c_locale_glibc2.c: In function ‘_Locale_tolower’: ../../src/c_locale_glibc/c_locale_glibc2.c:291:27: error: dereferencing pointer to incomplete type { return ((locale_t)__loc)->__ctype_tolower[c]; } ^ ../../src/c_locale_glibc/c_locale_glibc2.c: In function ‘_Locale_decimal_point’: ../../src/c_locale_glibc/c_locale_glibc2.c:463:10: error: invalid type argument of unary ‘*’ (have ‘int’) return *(nl_langinfo_l(RADIXCHAR, (locale_t)__loc)); ^ ../../src/c_locale_glibc/c_locale_glibc2.c: In function ‘_Locale_thousands_sep’: ../../src/c_locale_glibc/c_locale_glibc2.c:468:10: error: invalid type argument of unary ‘*’ (have ‘int’) return *(nl_langinfo_l(THOUSEP, (locale_t)__loc)); ^
linux设置的环境变量无效
我是rhel6.2系统,执行某程序时提示: /lib64/libc.so.6: version `GLIBC_2.14' not found 于是安装glibc-2.14,安装位置在/opt/glibc-2.14,安装完了以后增加临时环境变量: export LD_LIBRARY_PATH=/opt/glibc-2.14/lib,glibc-1.14,这样就ok了。 但环境临时环境变量重启就会失效,于是我在/etc/profile末尾增加了这样一行 export PATH="/opt/glibc-2.14/lib:$PATH 但这样行不管用,重启后仍然会报错: /lib64/libc.so.6: version `GLIBC_2.14' not found , 只能通过设置临时环境变量的方法让其不报错。很困惑
linux安装mysql-5.7.20-linux-glibc2.12-x86_64出错
出错提示:[root@linuxprobe support-files]# ./mysql.server start Starting MySQL.2017-10-26T08:20:34.772472Z mysqld_safe error: log-error set to '/var/log/mariadb/mariadb.log', however file don't exists. Create writable for user 'mysql'. ERROR! The server quit without updating PID file (/var/lib/mysql/linuxprobe.com.pid).
求救:Linux 出现segmentation fault 问题怎么解决
OpenSUSE 11原来安装的glibc-2.11,下载了glibc-2.14. 编译安装, 然后执行了 ln -sf /usr/local/glibc-2.14/lib/libc-2.14.so /lib64/libc.so.6 就出现segmentation fault ,任何操作都无法执行,求救解决方法
linux安装mysql问题~~~~~
有root权限 #rpm -ivh mysql-server-5.6.13.i386.rpm 然后就出现这些 Preparing... ########################################### [100%] file /usr/share/mysql/charsets/README from install of MySQL-server-5.6.1 3-1.linux_glibc2.5.i386 conflicts with file from package mysql-libs-5.1.52-1.el6 _0.1.i686 file /usr/share/mysql/czech/errmsg.sys from install of MySQL-server-5.6. 13-1.linux_glibc2.5.i386 conflicts with file from package mysql-libs-5.1.52-1.el 6_0.1.i686 file /usr/share/mysql/danish/errmsg.sys from install of MySQL-server-5.6 .13-1.linux_glibc2.5.i386 conflicts with file from package mysql-libs-5.1.52-1.e l6_0.1.i686 file /usr/share/mysql/dutch/errmsg.sys from install of MySQL-server-5.6. 13-1.linux_glibc2.5.i386 conflicts with file from package mysql-libs-5.1.52-1.el 6_0.1.i686 file /usr/share/mysql/english/errmsg.sys from install of MySQL-server-5. 6.13-1.linux_glibc2.5.i386 conflicts with file from package mysql-libs-5.1.52-1. el6_0.1.i686 file /usr/share/mysql/estonian/errmsg.sys from install of MySQL-server-5 .6.13-1.linux_glibc2.5.i386 conflicts with file from package mysql-libs-5.1.52-1 .el6_0.1.i686 file /usr/share/mysql/french/errmsg.sys from install of MySQL-server-5.6 .13-1.linux_glibc2.5.i386 conflicts with file from package mysql-libs-5.1.52-1.e l6_0.1.i686 file /usr/share/mysql/german/errmsg.sys from install of MySQL-server-5.6 .13-1.linux_glibc2.5.i386 conflicts with file from package mysql-libs-5.1.52-1.e l6_0.1.i686 file /usr/share/mysql/greek/errmsg.sys from install of MySQL-server-5.6. 13-1.linux_glibc2.5.i386 conflicts with file from package mysql-libs-5.1.52-1.el 6_0.1.i686 file /usr/share/mysql/hungarian/errmsg.sys from install of MySQL-server- 5.6.13-1.linux_glibc2.5.i386 conflicts with file from package mysql-libs-5.1.52- 1.el6_0.1.i686 file /usr/share/mysql/italian/errmsg.sys from install of MySQL-server-5. 6.13-1.linux_glibc2.5.i386 conflicts with file from package mysql-libs-5.1.52-1. el6_0.1.i686 file /usr/share/mysql/japanese/errmsg.sys from install of MySQL-server-5 .6.13-1.linux_glibc2.5.i386 conflicts with file from package mysql-libs-5.1.52-1 .el6_0.1.i686 file /usr/share/mysql/korean/errmsg.sys from install of MySQL-server-5.6 .13-1.linux_glibc2.5.i386 conflicts with file from package mysql-libs-5.1.52-1.e l6_0.1.i686 file /usr/share/mysql/norwegian-ny/errmsg.sys from install of MySQL-serv er-5.6.13-1.linux_glibc2.5.i386 conflicts with file from package mysql-libs-5.1. 52-1.el6_0.1.i686 file /usr/share/mysql/norwegian/errmsg.sys from install of MySQL-server- 5.6.13-1.linux_glibc2.5.i386 conflicts with file from package mysql-libs-5.1.52- 1.el6_0.1.i686 file /usr/share/mysql/polish/errmsg.sys from install of MySQL-server-5.6 .13-1.linux_glibc2.5.i386 conflicts with file from package mysql-libs-5.1.52-1.e l6_0.1.i686 file /usr/share/mysql/portuguese/errmsg.sys from install of MySQL-server -5.6.13-1.linux_glibc2.5.i386 conflicts with file from package mysql-libs-5.1.52 -1.el6_0.1.i686 file /usr/share/mysql/romanian/errmsg.sys from install of MySQL-server-5 .6.13-1.linux_glibc2.5.i386 conflicts with file from package mysql-libs-5.1.52-1 .el6_0.1.i686 file /usr/share/mysql/russian/errmsg.sys from install of MySQL-server-5. 6.13-1.linux_glibc2.5.i386 conflicts with file from package mysql-libs-5.1.52-1. el6_0.1.i686 file /usr/share/mysql/serbian/errmsg.sys from install of MySQL-server-5. 6.13-1.linux_glibc2.5.i386 conflicts with file from package mysql-libs-5.1.52-1. el6_0.1.i686 file /usr/share/mysql/slovak/errmsg.sys from install of MySQL-server-5.6 .13-1.linux_glibc2.5.i386 conflicts with file from package mysql-libs-5.1.52-1.e l6_0.1.i686 file /usr/share/mysql/spanish/errmsg.sys from install of MySQL-server-5. 6.13-1.linux_glibc2.5.i386 conflicts with file from package mysql-libs-5.1.52-1. el6_0.1.i686 file /usr/share/mysql/swedish/errmsg.sys from install of MySQL-server-5. 6.13-1.linux_glibc2.5.i386 conflicts with file from package mysql-libs-5.1.52-1. el6_0.1.i686 file /usr/share/mysql/ukrainian/errmsg.sys from install of MySQL-server- 5.6.13-1.linux_glibc2.5.i386 conflicts with file from package mysql-libs-5.1.52- 1.el6_0.1.i686 file /usr/share/mysql/charsets/Index.xml from install of MySQL-server-5. 6.13-1.linux_glibc2.5.i386 conflicts with file from package mysql-libs-5.1.52-1. el6_0.1.i686 file /usr/share/mysql/charsets/armscii8.xml from install of MySQL-server -5.6.13-1.linux_glibc2.5.i386 conflicts with file from package mysql-libs-5.1.52 -1.el6_0.1.i686 file /usr/share/mysql/charsets/ascii.xml from install of MySQL-server-5. 6.13-1.linux_glibc2.5.i386 conflicts with file from package mysql-libs-5.1.52-1. el6_0.1.i686 file /usr/share/mysql/charsets/cp1250.xml from install of MySQL-server-5 .6.13-1.linux_glibc2.5.i386 conflicts with file from package mysql-libs-5.1.52-1 .el6_0.1.i686 file /usr/share/mysql/charsets/cp1251.xml from install of MySQL-server-5 .6.13-1.linux_glibc2.5.i386 conflicts with file from package mysql-libs-5.1.52-1 .el6_0.1.i686 file /usr/share/mysql/charsets/cp1256.xml from install of MySQL-server-5 .6.13-1.linux_glibc2.5.i386 conflicts with file from package mysql-libs-5.1.52-1 .el6_0.1.i686 file /usr/share/mysql/charsets/cp1257.xml from install of MySQL-server-5 .6.13-1.linux_glibc2.5.i386 conflicts with file from package mysql-libs-5.1.52-1 .el6_0.1.i686 file /usr/share/mysql/charsets/cp850.xml from install of MySQL-server-5. 6.13-1.linux_glibc2.5.i386 conflicts with file from package mysql-libs-5.1.52-1. el6_0.1.i686 file /usr/share/mysql/charsets/cp852.xml from install of MySQL-server-5. 6.13-1.linux_glibc2.5.i386 conflicts with file from package mysql-libs-5.1.52-1. el6_0.1.i686 file /usr/share/mysql/charsets/cp866.xml from install of MySQL-server-5. 6.13-1.linux_glibc2.5.i386 conflicts with file from package mysql-libs-5.1.52-1. el6_0.1.i686 file /usr/share/mysql/charsets/dec8.xml from install of MySQL-server-5.6 .13-1.linux_glibc2.5.i386 conflicts with file from package mysql-libs-5.1.52-1.e l6_0.1.i686 file /usr/share/mysql/charsets/geostd8.xml from install of MySQL-server- 5.6.13-1.linux_glibc2.5.i386 conflicts with file from package mysql-libs-5.1.52- 1.el6_0.1.i686 file /usr/share/mysql/charsets/greek.xml from install of MySQL-server-5. 6.13-1.linux_glibc2.5.i386 conflicts with file from package mysql-libs-5.1.52-1. el6_0.1.i686 file /usr/share/mysql/charsets/hebrew.xml from install of MySQL-server-5 .6.13-1.linux_glibc2.5.i386 conflicts with file from package mysql-libs-5.1.52-1 .el6_0.1.i686 file /usr/share/mysql/charsets/hp8.xml from install of MySQL-server-5.6. 13-1.linux_glibc2.5.i386 conflicts with file from package mysql-libs-5.1.52-1.el 6_0.1.i686 file /usr/share/mysql/charsets/keybcs2.xml from install of MySQL-server- 5.6.13-1.linux_glibc2.5.i386 conflicts with file from package mysql-libs-5.1.52- 1.el6_0.1.i686 file /usr/share/mysql/charsets/koi8r.xml from install of MySQL-server-5. 6.13-1.linux_glibc2.5.i386 conflicts with file from package mysql-libs-5.1.52-1. el6_0.1.i686 file /usr/share/mysql/charsets/koi8u.xml from install of MySQL-server-5. 6.13-1.linux_glibc2.5.i386 conflicts with file from package mysql-libs-5.1.52-1. el6_0.1.i686 file /usr/share/mysql/charsets/latin1.xml from install of MySQL-server-5 .6.13-1.linux_glibc2.5.i386 conflicts with file from package mysql-libs-5.1.52-1 .el6_0.1.i686 file /usr/share/mysql/charsets/latin2.xml from install of MySQL-server-5 .6.13-1.linux_glibc2.5.i386 conflicts with file from package mysql-libs-5.1.52-1 .el6_0.1.i686 file /usr/share/mysql/charsets/latin5.xml from install of MySQL-server-5 .6.13-1.linux_glibc2.5.i386 conflicts with file from package mysql-libs-5.1.52-1 .el6_0.1.i686 file /usr/share/mysql/charsets/latin7.xml from install of MySQL-server-5 .6.13-1.linux_glibc2.5.i386 conflicts with file from package mysql-libs-5.1.52-1 .el6_0.1.i686 file /usr/share/mysql/charsets/macce.xml from install of MySQL-server-5. 6.13-1.linux_glibc2.5.i386 conflicts with file from package mysql-libs-5.1.52-1. el6_0.1.i686 file /usr/share/mysql/charsets/macroman.xml from install of MySQL-server -5.6.13-1.linux_glibc2.5.i386 conflicts with file from package mysql-libs-5.1.52 -1.el6_0.1.i686 file /usr/share/mysql/charsets/swe7.xml from install of MySQL-server-5.6 .13-1.linux_glibc2.5.i386 conflicts with file from package mysql-libs-5.1.52-1.e l6_0.1.i686 file /usr/bin/mysqldumpslow from install of MySQL-server-5.6.13-1.linux_ glibc2.5.i386 conflicts with file from package MySQL-client-5.1.7-0.i386
交叉编译 skipping incompatible libc.so.6
交叉编译libevent,有两个交叉编译工具链,其中一个编译通过了,另一个编译有问题。 ``` root@us16044:/opt/x86/applications/libeventlibevent-2.1.11-stable/# ./configure --prefix=/opt/x86/applications/libevent/libevent-2.1.11-stable/install-arago/ --host=arm-none-linux CC=/opt/vbox/arago-linux-devkit/bin/arm-arago-linux-gnueabi-gcc CXX=/opt/vbox/arago-linux-devkit/bin/arm-arago-linux-gnueabi-g++ root@us16044:/opt/x86/applications/libeventlibevent-2.1.11-stable/#make ...省略 /opt/vbox/arago-linux-devkit/bin/../lib/gcc/arm-arago-linux-gnueabi/4.5.3/../../../../arm-arago-linux-gnueabi/bin/ld: skipping incompatible /opt/vbox/arago-linux-devkit/bin/../lib/gcc/arm-arago-linux-gnueabi/4.5.3/../../../../arm-arago-linux-gnueabi/lib/../../lib/libc.so.6 when searching for ../../lib/libc.so.6 ...省略 ``` libc.so.6是存在的 ``` root@us16044:/opt/x86/applications/libevent# objdump -p /opt/vbox/arago-linux-devkit/lib/libc.so.6 /opt/vbox/arago-linux-devkit/lib/libc.so.6: file format elf32-i386 Program Header: PHDR off 0x00000034 vaddr 0x00000034 paddr 0x00000034 align 2**2 filesz 0x00000140 memsz 0x00000140 flags r-x INTERP off 0x0013ac20 vaddr 0x0013ac20 paddr 0x0013ac20 align 2**5 filesz 0x00000021 memsz 0x00000021 flags r-- LOAD off 0x00000000 vaddr 0x00000000 paddr 0x00000000 align 2**12 filesz 0x00154ae8 memsz 0x00154ae8 flags r-x LOAD off 0x001551c4 vaddr 0x001561c4 paddr 0x001561c4 align 2**12 filesz 0x000027d8 memsz 0x00005804 flags rw- DYNAMIC off 0x00156d7c vaddr 0x00157d7c paddr 0x00157d7c align 2**2 filesz 0x000000f0 memsz 0x000000f0 flags rw- NOTE off 0x00000174 vaddr 0x00000174 paddr 0x00000174 align 2**2 filesz 0x00000020 memsz 0x00000020 flags r-- TLS off 0x001551c4 vaddr 0x001561c4 paddr 0x001561c4 align 2**2 filesz 0x00000008 memsz 0x00000040 flags r-- EH_FRAME off 0x0013ac44 vaddr 0x0013ac44 paddr 0x0013ac44 align 2**2 filesz 0x00003304 memsz 0x00003304 flags r-- STACK off 0x00000000 vaddr 0x00000000 paddr 0x00000000 align 2**2 filesz 0x00000000 memsz 0x00000000 flags rw- RELRO off 0x001551c4 vaddr 0x001561c4 paddr 0x001561c4 align 2**0 filesz 0x00001e3c memsz 0x00001e3c flags r-- Dynamic Section: NEEDED ld-linux.so.2 SONAME libc.so.6 INIT 0x00016af0 FINI_ARRAY 0x001561cc FINI_ARRAYSZ 0x00000004 HASH 0x00151684 GNU_HASH 0x00000194 STRTAB 0x0000cf2c SYMTAB 0x00003dac STRSZ 0x00005a61 SYMENT 0x00000010 PLTGOT 0x00157ff4 PLTRELSZ 0x00000038 PLTREL 0x00000011 JMPREL 0x000169b4 REL 0x00013fb4 RELSZ 0x00002a00 RELENT 0x00000008 VERDEF 0x00013bc0 VERDEFNUM 0x0000001b FLAGS 0x00000010 VERNEED 0x00013f74 VERNEEDNUM 0x00000001 VERSYM 0x0001298e RELCOUNT 0x000004e2 Version definitions: 1 0x01 0x0865f4e6 libc.so.6 2 0x00 0x0d696910 GLIBC_2.0 3 0x00 0x0d696911 GLIBC_2.1 GLIBC_2.0 4 0x00 0x09691f71 GLIBC_2.1.1 GLIBC_2.1 5 0x00 0x09691f72 GLIBC_2.1.2 GLIBC_2.1.1 6 0x00 0x09691f73 GLIBC_2.1.3 GLIBC_2.1.2 7 0x00 0x0d696912 GLIBC_2.2 GLIBC_2.1.3 8 0x00 0x09691a71 GLIBC_2.2.1 GLIBC_2.2 9 0x00 0x09691a72 GLIBC_2.2.2 GLIBC_2.2.1 10 0x00 0x09691a73 GLIBC_2.2.3 GLIBC_2.2.2 11 0x00 0x09691a74 GLIBC_2.2.4 GLIBC_2.2.3 12 0x00 0x09691a76 GLIBC_2.2.6 GLIBC_2.2.4 13 0x00 0x0d696913 GLIBC_2.3 GLIBC_2.2.6 14 0x00 0x09691972 GLIBC_2.3.2 GLIBC_2.3 15 0x00 0x09691973 GLIBC_2.3.3 GLIBC_2.3.2 16 0x00 0x09691974 GLIBC_2.3.4 GLIBC_2.3.3 17 0x00 0x0d696914 GLIBC_2.4 GLIBC_2.3.4 18 0x00 0x0d696915 GLIBC_2.5 GLIBC_2.4 19 0x00 0x0d696916 GLIBC_2.6 GLIBC_2.5 20 0x00 0x0d696917 GLIBC_2.7 GLIBC_2.6 21 0x00 0x0d696918 GLIBC_2.8 GLIBC_2.7 22 0x00 0x0d696919 GLIBC_2.9 GLIBC_2.8 23 0x00 0x06969190 GLIBC_2.10 GLIBC_2.9 24 0x00 0x06969191 GLIBC_2.11 GLIBC_2.10 25 0x00 0x06969192 GLIBC_2.12 GLIBC_2.11 26 0x00 0x0963cf85 GLIBC_PRIVATE GLIBC_2.12 27 0x00 0x0b792650 GCC_3.0 Version References: required from ld-linux.so.2: 0x0963cf85 0x00 30 GLIBC_PRIVATE 0x0d696913 0x00 29 GLIBC_2.3 0x0d696911 0x00 28 GLIBC_2.1 ``` c/c++新手,编译过程这边不太懂,求帮助
Red Hat 2.3.32无法启动进入系统
1、在系统中安装LibreOffice,报错libc.so.6: version GLIBC_2.14 not found 2、升级glibc 3、 4、机房跳电,系统启动报错: ![图片说明](https://img-ask.csdn.net/upload/201911/01/1572581154_869082.png) Linux业务新手,多多指教。
相见恨晚的超实用网站
搞学习 知乎:www.zhihu.com 简答题:http://www.jiandati.com/ 网易公开课:https://open.163.com/ted/ 网易云课堂:https://study.163.com/ 中国大学MOOC:www.icourse163.org 网易云课堂:study.163.com 哔哩哔哩弹幕网:www.bilibili.com 我要自学网:www.51zxw
花了20分钟,给女朋友们写了一个web版群聊程序
参考博客 [1]https://www.byteslounge.com/tutorials/java-ee-html5-websocket-example
爬虫福利二 之 妹子图网MM批量下载
爬虫福利一:27报网MM批量下载    点击 看了本文,相信大家对爬虫一定会产生强烈的兴趣,激励自己去学习爬虫,在这里提前祝:大家学有所成! 目标网站:妹子图网 环境:Python3.x 相关第三方模块:requests、beautifulsoup4 Re:各位在测试时只需要将代码里的变量 path 指定为你当前系统要保存的路径,使用 python xxx.py 或IDE运行即可。
字节跳动视频编解码面经
引言 本文主要是记录一下面试字节跳动的经历。 三四月份投了字节跳动的实习(图形图像岗位),然后hr打电话过来问了一下会不会opengl,c++,shador,当时只会一点c++,其他两个都不会,也就直接被拒了。 七月初内推了字节跳动的提前批,因为内推没有具体的岗位,hr又打电话问要不要考虑一下图形图像岗,我说实习投过这个岗位不合适,不会opengl和shador,然后hr就说秋招更看重基础。我当时
开源一个功能完整的SpringBoot项目框架
福利来了,给大家带来一个福利。 最近想了解一下有关Spring Boot的开源项目,看了很多开源的框架,大多是一些demo或者是一个未成形的项目,基本功能都不完整,尤其是用户权限和菜单方面几乎没有完整的。 想到我之前做的框架,里面通用模块有:用户模块,权限模块,菜单模块,功能模块也齐全了,每一个功能都是完整的。 打算把这个框架分享出来,供大家使用和学习。 为什么用框架? 框架可以学习整体
Java学习的正确打开方式
在博主认为,对于入门级学习java的最佳学习方法莫过于视频+博客+书籍+总结,前三者博主将淋漓尽致地挥毫于这篇博客文章中,至于总结在于个人,实际上越到后面你会发现学习的最好方式就是阅读参考官方文档其次就是国内的书籍,博客次之,这又是一个层次了,这里暂时不提后面再谈。博主将为各位入门java保驾护航,各位只管冲鸭!!!上天是公平的,只要不辜负时间,时间自然不会辜负你。 何谓学习?博主所理解的学习,它
程序员必须掌握的核心算法有哪些?
由于我之前一直强调数据结构以及算法学习的重要性,所以就有一些读者经常问我,数据结构与算法应该要学习到哪个程度呢?,说实话,这个问题我不知道要怎么回答你,主要取决于你想学习到哪些程度,不过针对这个问题,我稍微总结一下我学过的算法知识点,以及我觉得值得学习的算法。这些算法与数据结构的学习大多数是零散的,并没有一本把他们全部覆盖的书籍。下面是我觉得值得学习的一些算法以及数据结构,当然,我也会整理一些看过
Python——画一棵漂亮的樱花树(不同种樱花+玫瑰+圣诞树喔)
最近翻到一篇知乎,上面有不少用Python(大多是turtle库)绘制的树图,感觉很漂亮,我整理了一下,挑了一些我觉得不错的代码分享给大家(这些我都测试过,确实可以生成喔~) one 樱花树 动态生成樱花 效果图(这个是动态的): 实现代码 import turtle as T import random import time # 画樱花的躯干(60,t) def Tree(branch
深深的码丨Java HashMap 透析
HashMap 相关概念 HashTab、HashMap、TreeMap 均以键值对像是存储或操作数据元素。HashTab继承自Dictionary,HashMap、TreeMap继承自AbstractMap,三者均实现Map接口 **HashTab:**同步哈希表,不支持null键或值,因为同步导致性能影响,很少被使用 **HashMap:**应用较多的非同步哈希表,支持null键或值,是键值对...
大学四年自学走来,这些私藏的实用工具/学习网站我贡献出来了
大学四年,看课本是不可能一直看课本的了,对于学习,特别是自学,善于搜索网上的一些资源来辅助,还是非常有必要的,下面我就把这几年私藏的各种资源,网站贡献出来给你们。主要有:电子书搜索、实用工具、在线视频学习网站、非视频学习网站、软件下载、面试/求职必备网站。 注意:文中提到的所有资源,文末我都给你整理好了,你们只管拿去,如果觉得不错,转发、分享就是最大的支持了。 一、电子书搜索 对于大部分程序员...
linux系列之常用运维命令整理笔录
本博客记录工作中需要的linux运维命令,大学时候开始接触linux,会一些基本操作,可是都没有整理起来,加上是做开发,不做运维,有些命令忘记了,所以现在整理成博客,当然vi,文件操作等就不介绍了,慢慢积累一些其它拓展的命令,博客不定时更新 顺便拉下票,我在参加csdn博客之星竞选,欢迎投票支持,每个QQ或者微信每天都可以投5票,扫二维码即可,http://m234140.nofollow.ax.
Python 基础(一):入门必备知识
目录1 标识符2 关键字3 引号4 编码5 输入输出6 缩进7 多行8 注释9 数据类型10 运算符10.1 常用运算符10.2 运算符优先级 1 标识符 标识符是编程时使用的名字,用于给变量、函数、语句块等命名,Python 中标识符由字母、数字、下划线组成,不能以数字开头,区分大小写。 以下划线开头的标识符有特殊含义,单下划线开头的标识符,如:_xxx ,表示不能直接访问的类属性,需通过类提供
程序员接私活怎样防止做完了不给钱?
首先跟大家说明一点,我们做 IT 类的外包开发,是非标品开发,所以很有可能在开发过程中会有这样那样的需求修改,而这种需求修改很容易造成扯皮,进而影响到费用支付,甚至出现做完了项目收不到钱的情况。 那么,怎么保证自己的薪酬安全呢? 我们在开工前,一定要做好一些证据方面的准备(也就是“讨薪”的理论依据),这其中最重要的就是需求文档和验收标准。一定要让需求方提供这两个文档资料作为开发的基础。之后开发
网页实现一个简单的音乐播放器(大佬别看。(⊙﹏⊙))
今天闲着无事,就想写点东西。然后听了下歌,就打算写个播放器。 于是乎用h5 audio的加上js简单的播放器完工了。 欢迎 改进 留言。 演示地点跳到演示地点 html代码如下`&lt;!DOCTYPE html&gt; &lt;html&gt; &lt;head&gt; &lt;title&gt;music&lt;/title&gt; &lt;meta charset="utf-8"&gt
Python十大装B语法
Python 是一种代表简单思想的语言,其语法相对简单,很容易上手。不过,如果就此小视 Python 语法的精妙和深邃,那就大错特错了。本文精心筛选了最能展现 Python 语法之精妙的十个知识点,并附上详细的实例代码。如能在实战中融会贯通、灵活使用,必将使代码更为精炼、高效,同时也会极大提升代码B格,使之看上去更老练,读起来更优雅。 1. for - else 什么?不是 if 和 else 才
数据库优化 - SQL优化
前面一篇文章从实例的角度进行数据库优化,通过配置一些参数让数据库性能达到最优。但是一些“不好”的SQL也会导致数据库查询变慢,影响业务流程。本文从SQL角度进行数据库优化,提升SQL运行效率。 判断问题SQL 判断SQL是否有问题时可以通过两个表象进行判断: 系统级别表象 CPU消耗严重 IO等待严重 页面响应时间过长
2019年11月中国大陆编程语言排行榜
2019年11月2日,我统计了某招聘网站,获得有效程序员招聘数据9万条。针对招聘信息,提取编程语言关键字,并统计如下: 编程语言比例 rank pl_ percentage 1 java 33.62% 2 c/c++ 16.42% 3 c_sharp 12.82% 4 javascript 12.31% 5 python 7.93% 6 go 7.25% 7
通俗易懂地给女朋友讲:线程池的内部原理
餐厅的约会 餐盘在灯光的照耀下格外晶莹洁白,女朋友拿起红酒杯轻轻地抿了一小口,对我说:“经常听你说线程池,到底线程池到底是个什么原理?”我楞了一下,心里想女朋友今天是怎么了,怎么突然问出这么专业的问题,但做为一个专业人士在女朋友面前也不能露怯啊,想了一下便说:“我先给你讲讲我前同事老王的故事吧!” 大龄程序员老王 老王是一个已经北漂十多年的程序员,岁数大了,加班加不动了,升迁也无望,于是拿着手里
经典算法(5)杨辉三角
杨辉三角 是经典算法,这篇博客对它的算法思想进行了讲解,并有完整的代码实现。
腾讯算法面试题:64匹马8个跑道需要多少轮才能选出最快的四匹?
昨天,有网友私信我,说去阿里面试,彻底的被打击到了。问了为什么网上大量使用ThreadLocal的源码都会加上private static?他被难住了,因为他从来都没有考虑过这个问题。无独有偶,今天笔者又发现有网友吐槽了一道腾讯的面试题,我们一起来看看。 腾讯算法面试题:64匹马8个跑道需要多少轮才能选出最快的四匹? 在互联网职场论坛,一名程序员发帖求助到。二面腾讯,其中一个算法题:64匹
面试官:你连RESTful都不知道我怎么敢要你?
面试官:了解RESTful吗? 我:听说过。 面试官:那什么是RESTful? 我:就是用起来很规范,挺好的 面试官:是RESTful挺好的,还是自我感觉挺好的 我:都挺好的。 面试官:… 把门关上。 我:… 要干嘛?先关上再说。 面试官:我说出去把门关上。 我:what ?,夺门而去 文章目录01 前言02 RESTful的来源03 RESTful6大原则1. C-S架构2. 无状态3.统一的接
JDK12 Collectors.teeing 你真的需要了解一下
前言 在 Java 12 里面有个非常好用但在官方 JEP 没有公布的功能,因为它只是 Collector 中的一个小改动,它的作用是 merge 两个 collector 的结果,这句话显得很抽象,老规矩,我们先来看个图(这真是一个不和谐的图????): 管道改造经常会用这个小东西,通常我们叫它「三通」,它的主要作用就是将 downstream1 和 downstre...
为啥国人偏爱Mybatis,而老外喜欢Hibernate/JPA呢?
关于SQL和ORM的争论,永远都不会终止,我也一直在思考这个问题。昨天又跟群里的小伙伴进行了一番讨论,感触还是有一些,于是就有了今天这篇文。 声明:本文不会下关于Mybatis和JPA两个持久层框架哪个更好这样的结论。只是摆事实,讲道理,所以,请各位看官勿喷。 一、事件起因 关于Mybatis和JPA孰优孰劣的问题,争论已经很多年了。一直也没有结论,毕竟每个人的喜好和习惯是大不相同的。我也看
项目中的if else太多了,该怎么重构?
介绍 最近跟着公司的大佬开发了一款IM系统,类似QQ和微信哈,就是聊天软件。我们有一部分业务逻辑是这样的 if (msgType = "文本") { // dosomething } else if(msgType = "图片") { // doshomething } else if(msgType = "视频") { // doshomething } else { // doshom...
致 Python 初学者
欢迎来到“Python进阶”专栏!来到这里的每一位同学,应该大致上学习了很多 Python 的基础知识,正在努力成长的过程中。在此期间,一定遇到了很多的困惑,对未来的学习方向感到迷茫。我非常理解你们所面临的处境。我从2007年开始接触 python 这门编程语言,从2009年开始单一使用 python 应对所有的开发工作,直至今天。回顾自己的学习过程,也曾经遇到过无数的困难,也曾经迷茫过、困惑过。开办这个专栏,正是为了帮助像我当年一样困惑的 Python 初学者走出困境、快速成长。希望我的经验能真正帮到你
“狗屁不通文章生成器”登顶GitHub热榜,分分钟写出万字形式主义大作
一、垃圾文字生成器介绍 最近在浏览GitHub的时候,发现了这样一个骨骼清奇的雷人项目,而且热度还特别高。 项目中文名:狗屁不通文章生成器 项目英文名:BullshitGenerator 根据作者的介绍,他是偶尔需要一些中文文字用于GUI开发时测试文本渲染,因此开发了这个废话生成器。但由于生成的废话实在是太过富于哲理,所以最近已经被小伙伴们给玩坏了。 他的文风可能是这样的: 你发现,...
程序员:我终于知道post和get的区别
是一个老生常谈的话题,然而随着不断的学习,对于以前的认识有很多误区,所以还是需要不断地总结的,学而时习之,不亦说乎
《程序人生》系列-这个程序员只用了20行代码就拿了冠军
你知道的越多,你不知道的越多 点赞再看,养成习惯GitHub上已经开源https://github.com/JavaFamily,有一线大厂面试点脑图,欢迎Star和完善 前言 这一期不算《吊打面试官》系列的,所有没前言我直接开始。 絮叨 本来应该是没有这期的,看过我上期的小伙伴应该是知道的嘛,双十一比较忙嘛,要值班又要去帮忙拍摄年会的视频素材,还得搞个程序员一天的Vlog,还要写BU...
加快推动区块链技术和产业创新发展,2019可信区块链峰会在京召开
11月8日,由中国信息通信研究院、中国通信标准化协会、中国互联网协会、可信区块链推进计划联合主办,科技行者协办的2019可信区块链峰会将在北京悠唐皇冠假日酒店开幕。   区块链技术被认为是继蒸汽机、电力、互联网之后,下一代颠覆性的核心技术。如果说蒸汽机释放了人类的生产力,电力解决了人类基本的生活需求,互联网彻底改变了信息传递的方式,区块链作为构造信任的技术有重要的价值。   1...
程序员把地府后台管理系统做出来了,还有3.0版本!12月7号最新消息:已在开发中有github地址
第一幕:缘起 听说阎王爷要做个生死簿后台管理系统,我们派去了一个程序员…… 996程序员做的梦: 第一场:团队招募 为了应对地府管理危机,阎王打算找“人”开发一套地府后台管理系统,于是就在地府总经办群中发了项目需求。 话说还是中国电信的信号好,地府都是满格,哈哈!!! 经常会有外行朋友问:看某网站做的不错,功能也简单,你帮忙做一下? 而这次,面对这样的需求,这个程序员...
相关热词 c# 图片上传 c# gdi 占用内存 c#中遍历字典 c#控制台模拟dos c# 斜率 最小二乘法 c#进程延迟 c# mysql完整项目 c# grid 总行数 c# web浏览器插件 c# xml 生成xsd
立即提问