LauraChen93
CCEMLLAC
采纳率15.4%
2016-04-23 08:37 阅读 3.6k
已采纳

人脸识别--编译问题 clean时候没有错误,运行时候就出现下面的问题

Information:Gradle tasks [:app:clean, :app:generateDebugSources, :app:prepareDebugUnitTestDependencies, :app:mockableAndroidJar, :app:generateDebugAndroidTestSources, :app:assembleDebug]
:app:clean
:app:preBuild UP-TO-DATE
:app:preDebugBuild UP-TO-DATE
:app:checkDebugManifest
:app:preReleaseBuild UP-TO-DATE
:app:prepareComAndroidSupportAnimatedVectorDrawable2330Library
:app:prepareComAndroidSupportAppcompatV72330Library
:app:prepareComAndroidSupportSupportV42330Library
:app:prepareComAndroidSupportSupportVectorDrawable2330Library
:app:prepareDebugDependencies
:app:compileDebugAidl
:app:compileDebugRenderscript
:app:generateDebugBuildConfig
:app:generateDebugAssets UP-TO-DATE
:app:mergeDebugAssets
:app:generateDebugResValues UP-TO-DATE
:app:generateDebugResources
:app:mergeDebugResources
:app:processDebugManifest
:app:processDebugResources
:app:generateDebugSources
:app:preDebugUnitTestBuild UP-TO-DATE
:app:prepareDebugUnitTestDependencies
:app:mockableAndroidJar UP-TO-DATE
:app:preDebugAndroidTestBuild UP-TO-DATE
:app:prepareDebugAndroidTestDependencies
:app:compileDebugAndroidTestAidl
:app:processDebugAndroidTestManifest
:app:compileDebugAndroidTestRenderscript
:app:generateDebugAndroidTestBuildConfig
:app:generateDebugAndroidTestAssets UP-TO-DATE
:app:mergeDebugAndroidTestAssets
:app:generateDebugAndroidTestResValues UP-TO-DATE
:app:generateDebugAndroidTestResources
:app:mergeDebugAndroidTestResources
:app:processDebugAndroidTestResources
:app:generateDebugAndroidTestSources
:app:compileDebugJavaWithJavac
注: D:\AS-Project\FaceApp4\app\src\main\java\com\example\helenchen\faceapp4\MainActivity.java使用或覆盖了已过时的 API。
注: 有关详细信息, 请使用 -Xlint:deprecation 重新编译。
:app:compileDebugNdk UP-TO-DATE
:app:compileDebugSources
:app:buildInfoDebugLoader
:app:transformClassesWithExtractJarsForDebug
:app:transformClassesWithInstantRunVerifierForDebug
:app:transformClassesWithJavaResourcesVerifierForDebug UP-TO-DATE
:app:mergeDebugJniLibFolders
:app:transformNative_libsWithMergeJniLibsForDebug
:app:processDebugJavaRes UP-TO-DATE
:app:transformResourcesWithMergeJavaResForDebug
:app:transformResourcesAndNative_libsWithJavaResourcesVerifierForDebug UP-TO-DATE
:app:transformClassesWithInstantRunForDebug
:app:transformClasses_enhancedWithInstant+reloadDexForDebug
:app:incrementalDebugTasks
:app:prePackageMarkerForDebug
:app:fastDeployDebugExtractor
:app:generateDebugInstantRunAppInfo
:app:coldswapKickerDebug
:app:transformClassesWithInstantRunSlicerForDebug
:app:transformClassesWithDexForDebug
Error:Error converting bytecode to dex:
Cause: java.lang.RuntimeException: Exception parsing classes
Error:1 error; aborting
Error:Execution failed for task ':app:transformClassesWithDexForDebug'.

com.android.build.api.transform.TransformException: java.lang.RuntimeException: com.android.ide.common.process.ProcessException: java.util.concurrent.ExecutionException: com.android.ide.common.process.ProcessException: org.gradle.process.internal.ExecException: Process 'command 'C:\Program Files\Java\jdk1.7.0_79\bin\java.exe'' finished with non-zero exit value 1
Information:BUILD FAILED
Information:Total time: 5.53 secs
Information:3 errors
Information:0 warnings
Information:See complete output in console

  • 点赞
  • 写回答
  • 关注问题
  • 收藏
  • 复制链接分享

1条回答 默认 最新

  • 已采纳
    LauraChen93 CCEMLLAC 2016-04-23 11:41

    哈哈,鼓捣了很久终于知道为什么了。自己在FaceppDect误多写了一个方法,导致。。。正如网上资料所说,这个一般是引用包/方法等重复了

    点赞 评论 复制链接分享

相关推荐