python安装pcapy报错:vc++ fail with exit status 2

图片说明

之前报没有vc++ 9.0什么的,于是我下了个vicual c++ for python 9.0,然后再安装pcapy这个第三方库,就报这个错。自己从pypi下了运行setup.py安装或pip install pcapy都会报这个错,求怎么解决。

我最开始是要装scapy的,但是装了scapy,编译的时候又报没有pcapy,于是我再装pcapy,可是情况就这样装不了,求怎么解决?

1个回答

你需要选vc版本跟你的库的编译版本一致

freedom_wings5
freedom_wings5 安装库失败的时候说没有vc++ 9.0 ,所以我下了这个,应该也是9.0的啊
3 年多之前 回复
Csdn user default icon
上传中...
上传图片
插入图片
抄袭、复制答案,以达到刷声望分或其他目的的行为,在CSDN问答是严格禁止的,一经发现立刻封号。是时候展现真正的技术了!
其他相关推荐
python安装pcapy报错:vc++ fail with exit status 2
![图片说明](https://img-ask.csdn.net/upload/201604/27/1461720478_61688.png) 之前报没有vc++ 9.0什么的,于是我下了个vicual c++ for python 9.0,然后再安装pcapy这个第三方库,就报这个错。自己从pypi下了运行setup.py安装或pip install pcapy都会报这个错,求怎么解决。 我最开始是要装scapy的,但是装了scapy,编译的时候又报没有pcapy,于是我再装pcapy,可是情况就这样装不了,求怎么解决?
conda安装python-graphviz报错:
用conda安装python-graphviz时报错:CondaError: Cannot link a source that does not exist. C:\ProgramData\Anaconda3\Scripts\conda.exe 代码片段如下 ``` pip-19.1.1-py3 100% |###############################| Time: 0:00:03 590.55 kB/s ERROR conda.core.link:_execute_actions(337): An error occurred while installing package 'defaults::tqdm-4.32.1-py_0'. CondaError: Cannot link a source that does not exist. C:\ProgramData\Anaconda3\Scripts\conda.exe Attempting to roll back. CondaError: Cannot link a source that does not exist. C:\ProgramData\Anaconda3\Scripts\conda.exe ``` 求助如何解决
python安装包时报错:ModuleNotFoundError: No module named 'importlib'
# 问题 python安装包时,在命令行中pip安装路径下安装时,安装包时报错:ModuleNotFoundError: No module named 'importlib' 本来安装包是可以的,在pycharm中运行着一开始正常,突然报这个错误,好头秃啊,求助,谢谢了。 # 问题截图![图片说明](https://img-ask.csdn.net/upload/201911/29/1574994193_154515.jpg) 它在命令行中安装包时如上图所示,我在这个python环境中安装不了包,也没法卸载。 ## 在pycharm中的傻样子 本来python中是有包的,一开始在pycharm中还能显示,只从报了这个错:ModuleNotFoundError: No module named 'importlib'包就一个都没了,![图片说明](https://img-ask.csdn.net/upload/201911/29/1574994457_376710.jpg)
安装pycocotools提示:cl.exe failed with exit status 2
使用如下代码安装pycocotools工具时,提示:error: command 'D:\\vs2015\\VC\\BIN\\x86_amd64\\cl.exe' failed with exit status 2。 命令: python setup.py build_ext --inplace python setup.py build_ext install。 试了很久都找不到解决办法。 补充:python3.6版本的,tensorflow1.14.0版本的。
报错 :error: command 'gcc' failed with exit status 1
系统: CentOS6.5 ,Python3.6 安装 mysqlclient 时候 报错:error: command 'gcc' failed with exit status 1 以下是错误信息: Collecting mysqlclient Using cached mysqlclient-1.3.10.tar.gz Installing collected packages: mysqlclient Running setup.py install for mysqlclient ... error Complete output from command /usr/local/python3/bin/python3.6 -u -c "import setuptools, tokenize;__file__='/tmp/pip-build-t3olsi0s/mysqlclient/setup.py';f=getattr(tokenize, 'open', open)(__file__);code=f.read().replace('\r\n', '\n');f.close();exec(compile(code, __file__, 'exec'))" install --record /tmp/pip-oqq8k4wv-record/install-record.txt --single-version-externally-managed --compile: running install running build running build_py creating build creating build/lib.linux-x86_64-3.6 copying _mysql_exceptions.py -> build/lib.linux-x86_64-3.6 creating build/lib.linux-x86_64-3.6/MySQLdb copying MySQLdb/__init__.py -> build/lib.linux-x86_64-3.6/MySQLdb copying MySQLdb/compat.py -> build/lib.linux-x86_64-3.6/MySQLdb copying MySQLdb/connections.py -> build/lib.linux-x86_64-3.6/MySQLdb copying MySQLdb/converters.py -> build/lib.linux-x86_64-3.6/MySQLdb copying MySQLdb/cursors.py -> build/lib.linux-x86_64-3.6/MySQLdb copying MySQLdb/release.py -> build/lib.linux-x86_64-3.6/MySQLdb copying MySQLdb/times.py -> build/lib.linux-x86_64-3.6/MySQLdb creating build/lib.linux-x86_64-3.6/MySQLdb/constants copying MySQLdb/constants/__init__.py -> build/lib.linux-x86_64-3.6/MySQLdb/constants copying MySQLdb/constants/CLIENT.py -> build/lib.linux-x86_64-3.6/MySQLdb/constants copying MySQLdb/constants/CR.py -> build/lib.linux-x86_64-3.6/MySQLdb/constants copying MySQLdb/constants/ER.py -> build/lib.linux-x86_64-3.6/MySQLdb/constants copying MySQLdb/constants/FIELD_TYPE.py -> build/lib.linux-x86_64-3.6/MySQLdb/constants copying MySQLdb/constants/FLAG.py -> build/lib.linux-x86_64-3.6/MySQLdb/constants copying MySQLdb/constants/REFRESH.py -> build/lib.linux-x86_64-3.6/MySQLdb/constants running build_ext building '_mysql' extension creating build/temp.linux-x86_64-3.6 gcc -pthread -Wsign-compare -DNDEBUG -g -fwrapv -O3 -Wall -Wstrict-prototypes -fPIC -Dversion_info=(1,3,10,'final',0) -D__version__=1.3.10 -I/usr/include/mysql -I/usr/local/python3/include/python3.6m -c _mysql.c -o build/temp.linux-x86_64-3.6/_mysql.o -g -fstack-protector -m64 -fPIC -g -fabi-version=2 -fno-omit-frame-pointer -fno-strict-aliasing In file included from /usr/local/python3/include/python3.6m/Python.h:8, from _mysql.c:40: /usr/local/python3/include/python3.6m/pyconfig.h:600:1: warning: "HAVE_MBRTOWC" redefined In file included from _mysql.c:29: /usr/include/mysql/my_config.h:439:1: warning: this is the location of the previous definition gcc -pthread -shared build/temp.linux-x86_64-3.6/_mysql.o -L/usr/lib64 -lmysqlclient -lpthread -lm -lrt -ldl -o build/lib.linux-x86_64-3.6/_mysql.cpython-36m-x86_64-linux-gnu.so /usr/bin/ld: cannot find -lmysqlclient collect2: ld returned 1 exit status error: command 'gcc' failed with exit status 1 ---------------------------------------- Command "/usr/local/python3/bin/python3.6 -u -c "import setuptools, tokenize;__file__='/tmp/pip-build-t3olsi0s/mysqlclient/setup.py';f=getattr(tokenize, 'open', open)(__file__);code=f.read().replace('\r\n', '\n');f.close();exec(compile(code, __file__, 'exec'))" install --record /tmp/pip-oqq8k4wv-record/install-record.txt --single-version-externally-managed --compile" failed with error code 1 in /tmp/pip-build-t3olsi0s/mysqlclient/ 按照别的帖子 yum install 了 python-devel了还是一样..而且 安装的python-devel的version 是2.6.6的 跟我的Python版本不符,但是yum仓库里又没有 3.6的 python-devel 如何解决?菜鸡求助...
python安装包报错TabError: inconsistent use of tabs and spaces in indentation
* 描述问题 > python安装包报错TabError: inconsistent use of tabs and spaces in indentation numpy、pycorenlp、nltk安装均出现此报错信息 * 报错信息 ![图片说明](https://img-ask.csdn.net/upload/201907/09/1562653865_507205.png)
python报错:AttributeError: module 'curses' has no attribute 'wrapper'
windows平台 python3.7.0 在vscode下运行程序时 其中curses.wrapper(main)报错 ``` PS E:\dai ma\aaa> C:/Users/夏洛洛/AppData/Local/Programs/Python/Python37/python.exe "e:/dai ma/aaa/项目/2048.py" Traceback (most recent call last): File "e:/dai ma/aaa/项目/2048.py", line 219, in <module> curses.wrapper(main) AttributeError: module 'curses' has no attribute 'wrapper' ``` 查询了下这个错误,可能是文件名并没有发生冲突,但换文件名后并没有排除。难道是windows平台问题吗? 求解,感激不尽。
python笔趣阁报错:SyntaxError: invalid syntax
自己在论坛上面找了一份python3爬虫的代码,但是比照着写就出现了上面的问题,求助大家帮我看一下。 import requests from bs4 import BeautifulSoup """ 说明:下载《笔趣阁》小说《一念永恒》 parameter: 无 Return: 无 Modify: 2019-06-27 """ class downloader(object): def _init_(self): self.server='https://www.biqukan.com/' self.url='https://www.biqukan.com/1_1094/' self.name=[] self.urls=[] self.nums=0 """ 函数说明:获取下载链接 Parameters: 无 Returns: 无 Modify: 2019-06-27 """ def get_download_url(self): resp = requests.get(url) html=resp.text resp.encoding=resp.apparent_encoding if html: with open('test.html',mode='a+',encoding=resp.apparent_encoding) as file: file.write(html) div_bf = BeautifulSoup(html) div=div_bf.find_all('div', class_ = 'listmain') a_bf = BeautifulSoup(str(div[0])) a = a_bf.find_all('a') self.nums=len(a[15:]) for each in a[15:]: self.names.append(each.string) self.urls.append(self.server+each.get('href') """ 函数说明:获取章节内容 Parameters: url - 下载连接(string) Returns: texts - 章节内容(string) Modify: 2019-6-27 """ def get_contents(self, url): req = requests.get(url) html = resp.text bf = BeautifulSoup(html) texts = bf.find_all('div', class_ = 'showtxt') texts = texts[0].text.replace('\xa0'*8,'\n\n') return texts """ 函数说明:将爬取的文章内容写入文件 Parameters: name - 章节名称(string) path - 当前路径下,小说保存名称(string) text - 章节内容(string) Returns: 无 Modify: 2019-06-27 """ def writer(self, name, path, text): write_flag = True with open(path, 'a', encoding='utf-8') as f: f.write(name + '\n') f.writelines(text) f.write('\n\n') dl = downloader() dl.get_download_url() print('《一年永恒》开始下载:') for i in range(dl.nums): dl.writer(dl.names[i], '一念永恒.txt', dl.get_contents(dl.urls[i])) sys.stdout.write("已下载:%.3f%%" % float(i/dl.nums) + '\r') sys.stdout.flush() print('《一年永恒》下载完成')
python安装pyinstaller报错
``` ERROR: Command errored out with exit status 1: command: 'c:\users\巩子昆\appdata\local\programs\python\python37-32\python.exe' 'c:\users\巩子昆\appdata\local\programs\python\python37-32\lib\site-packages\pip\_vendor\pep517\_in_process.py' prepare_metadata_for_build_wheel 'C:\Users\巩子昆\AppData\Local\Temp\tmp5hj8yy69' cwd: C:\Users\巩子昆\AppData\Local\Temp\pip-install-_y8nunuv\pyinstaller Complete output (36 lines): running dist_info creating C:\Users\巩子昆\AppData\Local\Temp\pip-install-_y8nunuv\pyinstaller\pip-wheel-metadata\PyInstaller.egg-info writing C:\Users\巩子昆\AppData\Local\Temp\pip-install-_y8nunuv\pyinstaller\pip-wheel-metadata\PyInstaller.egg-info\PKG-INFO writing dependency_links to C:\Users\巩子昆\AppData\Local\Temp\pip-install-_y8nunuv\pyinstaller\pip-wheel-metadata\PyInstaller.egg-info\dependency_links.txt writing entry points to C:\Users\巩子昆\AppData\Local\Temp\pip-install-_y8nunuv\pyinstaller\pip-wheel-metadata\PyInstaller.egg-info\entry_points.txt writing requirements to C:\Users\巩子昆\AppData\Local\Temp\pip-install-_y8nunuv\pyinstaller\pip-wheel-metadata\PyInstaller.egg-info\requires.txt writing top-level names to C:\Users\巩子昆\AppData\Local\Temp\pip-install-_y8nunuv\pyinstaller\pip-wheel-metadata\PyInstaller.egg-info\top_level.txt writing manifest file 'C:\Users\巩子昆\AppData\Local\Temp\pip-install-_y8nunuv\pyinstaller\pip-wheel-metadata\PyInstaller.egg-info\SOURCES.txt' reading manifest file 'C:\Users\巩子昆\AppData\Local\Temp\pip-install-_y8nunuv\pyinstaller\pip-wheel-metadata\PyInstaller.egg-info\SOURCES.txt' reading manifest template 'MANIFEST.in' Error in sitecustomize; set PYTHONVERBOSE for traceback: SyntaxError: (unicode error) 'utf-8' codec can't decode byte 0xb9 in position 0: invalid start byte (sitecustomize.py, line 7) no previously-included directories found matching 'bootloader\build' no previously-included directories found matching 'bootloader\.waf-*' no previously-included directories found matching 'bootloader\.waf3-*' no previously-included directories found matching 'bootloader\waf-*' no previously-included directories found matching 'bootloader\waf3-*' no previously-included directories found matching 'bootloader\_sdks' no previously-included directories found matching 'bootloader\.vagrant' warning: no previously-included files found matching 'bootloader\.lock-waf*' no previously-included directories found matching 'doc\source' no previously-included directories found matching 'doc\_build' warning: no previously-included files matching '*.tmp' found under directory 'doc' warning: no files found matching 'news\_template.rst' no previously-included directories found matching 'news' no previously-included directories found matching 'old' no previously-included directories found matching 'scripts' no previously-included directories found matching 'tests\scripts' no previously-included directories found matching '.github' warning: no previously-included files found matching '.*' warning: no previously-included files found matching '*.yml' warning: no previously-included files found matching '*~' warning: no previously-included files found matching '.directory' writing manifest file 'C:\Users\巩子昆\AppData\Local\Temp\pip-install-_y8nunuv\pyinstaller\pip-wheel-metadata\PyInstaller.egg-info\SOURCES.txt' creating 'C:\Users\巩子昆\AppData\Local\Temp\pip-install-_y8nunuv\pyinstaller\pip-wheel-metadata\PyInstaller.dist-info' error: invalid command 'bdist_wheel' ---------------------------------------- ERROR: Command errored out with exit status 1: 'c:\users\巩子昆\appdata\local\programs\python\python37-32\python.exe' 'c:\users\巩子昆\appdata\local\programs\python\python37-32\lib\site-packages\pip\_vendor\pep517\_in_process.py' prepare_metadata_for_build_wheel 'C:\Users\巩子昆\AppData\Local\Temp\tmp5hj8yy69' Check the logs for full command output. ``` 饶了我吧 我就一小白
python操作word报错ValueError: can only parse strings。
1、问题描述: 学习Python操作word文件,使用render()方法时报错ValueError: can only parse strings。 2、相关代码 ``` # _*_ encoding:utf-8 _*_ from docxtpl import DocxTemplate data_dic = { 't1':'燕子', 't2':'杨柳', 't3':'桃花', 't4':'针尖', 't5':'头涔涔', 't6':'泪潸潸', 't7':'茫茫然', 't8':'伶伶俐俐', } doc = DocxTemplate("/test/test.doc") #加载模板文件 doc.render(data_dic) #填充数据 doc.save("/test/target.doc") ``` 3、模板信息: ``` {{r t1}}去了,有再来的时候;{{r t2}}枯了,有再青的时候;{{r t3}}谢了,有再开的时候。但是,聪明的,你告诉我,我们的日子为什么一去不复返呢?——是有人偷了他们罢:那是谁?又藏在何处呢?是他们自己逃走了罢:现在又到了哪里呢? 我不知道他们给了我多少日子;但我的手确乎是渐渐空虚了。在默默里算着,八千多日子已经从我手中溜去;像{{r t4}}上一滴水滴在大海里,我的日子滴在时间的流里,没有声音,也没有影子。我不禁{{r t5}}而{{r t6}}了。 去的尽管去了,来的尽管来着;去来的中间,又怎样地匆匆呢?早上我起来的时候,小屋里射进两三方斜斜的太阳。太阳他有脚啊,轻轻悄悄地挪移了;我也{{r t7}}跟着旋转。于是——洗手的时候,日子从水盆里过去;吃饭的时候,日子从饭碗里过去;默默时,便从凝然的双眼前过去。我觉察他去的匆匆了,伸出手遮挽时,他又从遮挽着的手边过去,天黑时,我躺在床上,他便{{r t8}}地从我身上跨过,从我脚边飞去了。等我睁开眼和太阳再见,这算又溜走了一日。我掩着面叹息。但是新来的日子的影儿又开始在叹息里闪过了。 ``` 4、报错信息: ![图片说明](https://img-ask.csdn.net/upload/202001/15/1579068250_471502.png) 5、相关依赖包版本 ``` doc 0.1.0 docx 0.2.4 docxtpl 0.6.3 lxml 3.2.1 Jinja2 2.10.3 ``` 6、我尝试更换了lxml的版本发现报错信息一样。我又尝试跟踪错误,在这个文件里: ![图片说明](https://img-ask.csdn.net/upload/202001/15/1579068951_317573.png) 打印了一下text: ![图片说明](https://img-ask.csdn.net/upload/202001/15/1579068974_898727.png) 发现有一步text为None: ![图片说明](https://img-ask.csdn.net/upload/202001/15/1579069045_944104.png) 7、所以想问一下有没有大佬遇到并解决过这个问题,怎么解决这个问题。救救一下小萌新吧,还有就是val._target._blob这个变量里存的是什么数据,为什么会出现None的情况?谢谢大佬的指点! 8、追加: 问题暂时得到了解决,我在get_headers_footers_xml这个函数里添加了不为空的判断if val._target._blob != None:yield relKey, self.xml_to_string(parse_xml(val._target._blob)) 就不再报错并且成功写入到目标文件里,但是我仍然不清楚这是不是依赖包本身的BUG。如果有大佬知道的话请指点我一下。如果也有遇到这个问题的朋友,可以试一试我这个方法暂时解决一下。下面是我修改的图片: ![图片说明](https://img-ask.csdn.net/upload/202001/15/1579074850_454765.png)
安装pylearn2,一直报“failed with exit status 2”这个错,咋回事呢……
``` C:\Users\Administrator>cd/d G:\Documents\GitHub\pylearn2 G:\Documents\GitHub\pylearn2>python setup.py install C:\ProgramData\Anaconda3\lib\site-packages\setuptools\dist.py:475: UserWarning: Normalizing '0.1dev' to '0.1.dev0' normalized_version, running install Because Pylearn2 is under heavy development, we generally do not advice using the `setup.py install` command. Please consider using the `setup.py develop` command instead for the following reasons: 1. Using `setup.py install` creates a copy of the Pylearn2 source code in your Python installation path. In order to update Pylearn2 afterwards you will need to rerun `setup.py install` (!). Simply using `git pull` to update your local copy of Pylearn2 code will not suffice. 2. When using `sudo` to install Pylearn2, all files, including the tutorials, will be copied to a directory owned by root. Not only is running tutorials as root unsafe, it also means that all Pylearn2-related environment variables which were defined for the user will be unavailable. Pressing enter will continue the installation of Pylearn2 in `develop` mode instead. Note that this means that you need to keep this folder with the Pylearn2 code in its current location. If you know what you are doing, and are very sure that you want to install Pylearn2 using the `install` command instead, please type `install`. Installation mode: [develop]/install/cancel: running develop running egg_info writing pylearn2.egg-info\PKG-INFO writing dependency_links to pylearn2.egg-info\dependency_links.txt writing requirements to pylearn2.egg-info\requires.txt writing top-level names to pylearn2.egg-info\top_level.txt reading manifest file 'pylearn2.egg-info\SOURCES.txt' reading manifest template 'MANIFEST.in' writing manifest file 'pylearn2.egg-info\SOURCES.txt' running build_ext skipping 'pylearn2/utils\_window_flip.c' Cython extension (up-to-date) building 'pylearn2.utils._window_flip' extension G:\software\Microsoft Visual Studio\2019\Community\VC\Tools\MSVC\14.23.28105\bin\HostX86\x64\cl.exe /c /nologo /Ox /W3 /GL /DNDEBUG /MT -IC:\ProgramData\Anaconda3\lib\site-packages\numpy\core\include -IC:\ProgramData\Anaconda3\include -IC:\ProgramData\Anaconda3\include "-IG:\software\Microsoft Visual Studio\2019\Community\VC\Tools\MSVC\14.23.28105\ATLMFC\include" "-IG:\software\Microsoft Visual Studio\2019\Community\VC\Tools\MSVC\14.23.28105\include" /Tcpylearn2/utils\_window_flip.c /Fobuild\temp.win-amd64-3.7\Release\pylearn2/utils\_window_flip.obj _window_flip.c C:\ProgramData\Anaconda3\include\pyconfig.h(59): fatal error C1083: 无法打开包括文件: “io.h”: **No such file or directory error: command 'G:\\software\\Microsoft Visual Studio\\2019\\Community\\VC\\Tools\\MSVC\\14.23.28105\\bin\\HostX86\\x64\\cl.exe' failed with exit status 2 ```**
python2.7安装sklearn报错:ImportError: DLL load failed
import sklearn 报错: Traceback (most recent call last): File "<pyshell#3>", line 1, in <module> import sklearn File "D:\Python27\lib\site-packages\scikit_learn-0.15.2-py2.7-win-amd64.egg\sklearn\__init__.py", line 38, in <module> from .base import clone File "D:\Python27\lib\site-packages\scikit_learn-0.15.2-py2.7-win-amd64.egg\sklearn\base.py", line 10, in <module> from scipy import sparse File "D:\Python27\lib\site-packages\scipy\sparse\__init__.py", line 182, in <module> from .csr import * File "D:\Python27\lib\site-packages\scipy\sparse\csr.py", line 15, in <module> from .sparsetools import csr_tocsc, csr_tobsr, csr_count_blocks, \ File "D:\Python27\lib\site-packages\scipy\sparse\sparsetools\__init__.py", line 5, in <module> from .csr import * File "D:\Python27\lib\site-packages\scipy\sparse\sparsetools\csr.py", line 26, in <module> _csr = swig_import_helper() File "D:\Python27\lib\site-packages\scipy\sparse\sparsetools\csr.py", line 22, in swig_import_helper _mod = imp.load_module('_csr', fp, pathname, description) ImportError: DLL load failed: %1 不是有效的 Win32 应用程序。 用的python2.7.9,我已经安装了numpy1.9.1,scipy0.12.0,sklearn0.15.1,这些都是支持64位系统的,遇到这个问题我该怎么办
python使用pygal报错:
ValueError: Invalid PI name 'b'xml'' 相关代码:hist.render_to_file('1.svg') 详细错误: ![图片说明](https://img-ask.csdn.net/upload/201708/05/1501922019_825617.png) I have try to solve it by install new version of lxml,but can't work just like this blog.csdn.net/shuxue051/article/details/47686761 I hope somenoe can help me to solve it,Thank you!
python3.6安装pypsa包时报错,无法安装。
在使用pip install pypsa,安装报错如下![图片说明](https://img-ask.csdn.net/upload/201910/15/1571110476_72432.png)![图片说明](https://img-ask.csdn.net/upload/201910/15/1571110486_931164.png) ERROR: Command errored out with exit status 1: command: 'd:\python3\python.exe' 'd:\python3\lib\site-packages\pip\_vendor\pep517\_in_process.py' get_requires_for_build_wheel 'C:\Users\xyrrrr\AppData\Local\Temp\tmpk8s4cp1x' cwd: C:\Users\xyrrrr\AppData\Local\Temp\pip-install-y9r5hyt9\cartopy Complete output (3 lines): setup.py:171: UserWarning: Unable to determine GEOS version. Ensure you have 3.3.3 or later installed, or installation may fail. '.'.join(str(v) for v in GEOS_MIN_VERSION), )) Proj 4.9.0 must be installed. ---------------------------------------- ERROR: Command errored out with exit status 1: 'd:\python3\python.exe' 'd:\python3\lib\site-packages\pip\_vendor\pep517\_in_process.py' get_requires_for_build_wheel 'C:\Users\xyrrrr\AppData\Local\Temp\tmpk8s4cp1x' Check the logs for full command output. 查了很多,真的不懂如何解决,小白求专业人士帮助!谢谢。 一天也没解决,我就是一个刚下载python的小白 饶了我吧
pycharm运行pyqt5报错‘finished with exit code -1073740791 (0xC0000409)
用pycharm运行由 qt designer 设计的gui,已经填充一些槽函数代码,GUI的首页可以显示,一旦点击按钮就会程序退出,出现代码报错代码‘finished with exit code -1073740791 (0xC0000409)’
fatal error: boost/python/numpy.hpp: No such file or directory
哪个大神能解决这个问题,感激不尽!!! ``` fatal error: boost/python/numpy.hpp: No such file or directory ```
tensorflow报错:ImportError:No module named 'tensorflow.python.platform'?
今天要打开tensorboard的时候出现报错: ![图片说明](https://img-ask.csdn.net/upload/201906/02/1559476838_499887.png) 然后试着用python import tensorflow as tf 检查了一下,还是同样的报错。 所有用到import TensorFlow的程序都无法运行了。 用网上的方法,添加PATH或者给tensorflow升级、重新安装后都是这样,不知道是为啥。
Python 程序报错 AttributeError: 'NoneType' object has no attribute 'commit'
Python 程序执行错误 AttributeError: 'NoneType' object has no attribute 'commit' 运行 Python 2.7.5 Mysql 5.7 CentOS 7.2
python 安装 pymssql 库时报错
安装第三方库 ``` pip install pymssql Traceback (most recent call last): File "c:\users\XXX\appdata\local\programs\python\python37\lib\site-packages\pip\_vendor\urllib3\response.py", line 425, in _error_catcher yield File "c:\users\XXX\appdata\local\programs\python\python37\lib\site-packages\pip\_vendor\urllib3\response.py", line 507, in read data = self._fp.read(amt) if not fp_closed else b"" File "c:\users\XXX\appdata\local\programs\python\python37\lib\site-packages\pip\_vendor\cachecontrol\filewrapper.py", line 62, in read data = self.__fp.read(amt) File "c:\users\XXX\appdata\local\programs\python\python37\lib\http\client.py", line 457, in read n = self.readinto(b) File "c:\users\XXX\appdata\local\programs\python\python37\lib\http\client.py", line 501, in readinto n = self.fp.readinto(b) File "c:\users\XXX\appdata\local\programs\python\python37\lib\socket.py", line 589, in readinto return self._sock.recv_into(b) File "c:\users\XXX\appdata\local\programs\python\python37\lib\ssl.py", line 1071, in recv_into return self.read(nbytes, buffer) File "c:\users\XXX\appdata\local\programs\python\python37\lib\ssl.py", line 929, in read return self._sslobj.read(len, buffer) socket.timeout: The read operation timed out During handling of the above exception, another exception occurred: Traceback (most recent call last): File "c:\users\XXX\appdata\local\programs\python\python37\lib\site-packages\pip\_internal\cli\base_command.py", line 153, in _main status = self.run(options, args) File "c:\users\XXX\appdata\local\programs\python\python37\lib\site-packages\pip\_internal\commands\install.py", line 382, in run resolver.resolve(requirement_set) File "c:\users\XXX\appdata\local\programs\python\python37\lib\site-packages\pip\_internal\legacy_resolve.py", line 201, in resolve self._resolve_one(requirement_set, req) File "c:\users\XXX\appdata\local\programs\python\python37\lib\site-packages\pip\_internal\legacy_resolve.py", line 365, in _resolve_one abstract_dist = self._get_abstract_dist_for(req_to_install) File "c:\users\XXX\appdata\local\programs\python\python37\lib\site-packages\pip\_internal\legacy_resolve.py", line 313, in _get_abstract_dist_for req, self.session, self.finder, self.require_hashes File "c:\users\XXX\appdata\local\programs\python\python37\lib\site-packages\pip\_internal\operations\prepare.py", line 194, in prepare_linked_requirement progress_bar=self.progress_bar File "c:\users\XXX\appdata\local\programs\python\python37\lib\site-packages\pip\_internal\download.py", line 465, in unpack_url progress_bar=progress_bar File "c:\users\XXX\appdata\local\programs\python\python37\lib\site-packages\pip\_internal\download.py", line 316, in unpack_http_url progress_bar) File "c:\users\XXX\appdata\local\programs\python\python37\lib\site-packages\pip\_internal\download.py", line 551, in _download_http_url _download_url(resp, link, content_file, hashes, progress_bar) File "c:\users\XXX\appdata\local\programs\python\python37\lib\site-packages\pip\_internal\download.py", line 253, in _download_url hashes.check_against_chunks(downloaded_chunks) File "c:\users\XXX\appdata\local\programs\python\python37\lib\site-packages\pip\_internal\utils\hashes.py", line 80, in check_against_chunks for chunk in chunks: File "c:\users\XXX\appdata\local\programs\python\python37\lib\site-packages\pip\_internal\download.py", line 223, in written_chunks for chunk in chunks: File "c:\users\XXX\appdata\local\programs\python\python37\lib\site-packages\pip\_internal\utils\ui.py", line 160, in iter for x in it: File "c:\users\XXX\appdata\local\programs\python\python37\lib\site-packages\pip\_internal\download.py", line 212, in resp_read decode_content=False): File "c:\users\XXX\appdata\local\programs\python\python37\lib\site-packages\pip\_vendor\urllib3\response.py", line 564, in stream data = self.read(amt=amt, decode_content=decode_content) File "c:\users\XXX\appdata\local\programs\python\python37\lib\site-packages\pip\_vendor\urllib3\response.py", line 529, in read raise IncompleteRead(self._fp_bytes_read, self.length_remaining) File "c:\users\XXX\appdata\local\programs\python\python37\lib\contextlib.py", line 130, in __exit__ self.gen.throw(type, value, traceback) File "c:\users\XXX\appdata\local\programs\python\python37\lib\site-packages\pip\_vendor\urllib3\response.py", line 430, in _error_catcher raise ReadTimeoutError(self._pool, None, "Read timed out.") pip._vendor.urllib3.exceptions.ReadTimeoutError: HTTPSConnectionPool(host='pypi.tuna.tsinghua.edu.cn', port=443): Read timed out. ``` 也下载了 wordcloud-1.6.0-cp37-cp37m-win_amd64.whl python版本是3.7 64位
Django已有的model表新增字段,执行migrate报错:django.db.utils.DatabaseError:ORA-00955: name is already used by an existing object,出现重名是啥情况。。。
Django已有的model表新增字段,执行migrate报错:django.db.utils.DatabaseError:ORA-00955: name is already used by an existing object,出现重名是啥情况。。。
Kafka实战(三) - Kafka的自我修养与定位
Apache Kafka是消息引擎系统,也是一个分布式流处理平台(Distributed Streaming Platform) Kafka是LinkedIn公司内部孵化的项目。LinkedIn最开始有强烈的数据强实时处理方面的需求,其内部的诸多子系统要执行多种类型的数据处理与分析,主要包括业务系统和应用程序性能监控,以及用户行为数据处理等。 遇到的主要问题: 数据正确性不足 数据的收集主要...
volatile 与 synchronize 详解
Java支持多个线程同时访问一个对象或者对象的成员变量,由于每个线程可以拥有这个变量的拷贝(虽然对象以及成员变量分配的内存是在共享内存中的,但是每个执行的线程还是可以拥有一份拷贝,这样做的目的是加速程序的执行,这是现代多核处理器的一个显著特性),所以程序在执行过程中,一个线程看到的变量并不一定是最新的。 volatile 关键字volatile可以用来修饰字段(成员变量),就是告知程序任何对该变量...
Java学习的正确打开方式
在博主认为,对于入门级学习java的最佳学习方法莫过于视频+博客+书籍+总结,前三者博主将淋漓尽致地挥毫于这篇博客文章中,至于总结在于个人,实际上越到后面你会发现学习的最好方式就是阅读参考官方文档其次就是国内的书籍,博客次之,这又是一个层次了,这里暂时不提后面再谈。博主将为各位入门java保驾护航,各位只管冲鸭!!!上天是公平的,只要不辜负时间,时间自然不会辜负你。 何谓学习?博主所理解的学习,它是一个过程,是一个不断累积、不断沉淀、不断总结、善于传达自己的个人见解以及乐于分享的过程。
程序员必须掌握的核心算法有哪些?
由于我之前一直强调数据结构以及算法学习的重要性,所以就有一些读者经常问我,数据结构与算法应该要学习到哪个程度呢?,说实话,这个问题我不知道要怎么回答你,主要取决于你想学习到哪些程度,不过针对这个问题,我稍微总结一下我学过的算法知识点,以及我觉得值得学习的算法。这些算法与数据结构的学习大多数是零散的,并没有一本把他们全部覆盖的书籍。下面是我觉得值得学习的一些算法以及数据结构,当然,我也会整理一些看过...
有哪些让程序员受益终生的建议
从业五年多,辗转两个大厂,出过书,创过业,从技术小白成长为基层管理,联合几个业内大牛回答下这个问题,希望能帮到大家,记得帮我点赞哦。 敲黑板!!!读了这篇文章,你将知道如何才能进大厂,如何实现财务自由,如何在工作中游刃有余,这篇文章很长,但绝对是精品,记得帮我点赞哦!!!! 一腔肺腑之言,能看进去多少,就看你自己了!!! 目录: 在校生篇: 为什么要尽量进大厂? 如何选择语言及方...
大学四年自学走来,这些私藏的实用工具/学习网站我贡献出来了
大学四年,看课本是不可能一直看课本的了,对于学习,特别是自学,善于搜索网上的一些资源来辅助,还是非常有必要的,下面我就把这几年私藏的各种资源,网站贡献出来给你们。主要有:电子书搜索、实用工具、在线视频学习网站、非视频学习网站、软件下载、面试/求职必备网站。 注意:文中提到的所有资源,文末我都给你整理好了,你们只管拿去,如果觉得不错,转发、分享就是最大的支持了。 一、电子书搜索 对于大部分程序员...
linux系列之常用运维命令整理笔录
本博客记录工作中需要的linux运维命令,大学时候开始接触linux,会一些基本操作,可是都没有整理起来,加上是做开发,不做运维,有些命令忘记了,所以现在整理成博客,当然vi,文件操作等就不介绍了,慢慢积累一些其它拓展的命令,博客不定时更新 free -m 其中:m表示兆,也可以用g,注意都要小写 Men:表示物理内存统计 total:表示物理内存总数(total=used+free) use...
比特币原理详解
一、什么是比特币 比特币是一种电子货币,是一种基于密码学的货币,在2008年11月1日由中本聪发表比特币白皮书,文中提出了一种去中心化的电子记账系统,我们平时的电子现金是银行来记账,因为银行的背后是国家信用。去中心化电子记账系统是参与者共同记账。比特币可以防止主权危机、信用风险。其好处不多做赘述,这一层面介绍的文章很多,本文主要从更深层的技术原理角度进行介绍。 二、问题引入 假设现有4个人...
GitHub开源史上最大规模中文知识图谱
近日,一直致力于知识图谱研究的 OwnThink 平台在 Github 上开源了史上最大规模 1.4 亿中文知识图谱,其中数据是以(实体、属性、值),(实体、关系、实体)混合的形式组织,数据格式采用 csv 格式。 到目前为止,OwnThink 项目开放了对话机器人、知识图谱、语义理解、自然语言处理工具。知识图谱融合了两千五百多万的实体,拥有亿级别的实体属性关系,机器人采用了基于知识图谱的语义感...
程序员接私活怎样防止做完了不给钱?
首先跟大家说明一点,我们做 IT 类的外包开发,是非标品开发,所以很有可能在开发过程中会有这样那样的需求修改,而这种需求修改很容易造成扯皮,进而影响到费用支付,甚至出现做完了项目收不到钱的情况。 那么,怎么保证自己的薪酬安全呢? 我们在开工前,一定要做好一些证据方面的准备(也就是“讨薪”的理论依据),这其中最重要的就是需求文档和验收标准。一定要让需求方提供这两个文档资料作为开发的基础。之后开发...
网页实现一个简单的音乐播放器(大佬别看。(⊙﹏⊙))
今天闲着无事,就想写点东西。然后听了下歌,就打算写个播放器。 于是乎用h5 audio的加上js简单的播放器完工了。 演示地点演示 html代码如下` music 这个年纪 七月的风 音乐 ` 然后就是css`*{ margin: 0; padding: 0; text-decoration: none; list-...
微信支付崩溃了,但是更让马化腾和张小龙崩溃的竟然是……
loonggg读完需要3分钟速读仅需1分钟事件还得还原到昨天晚上,10 月 29 日晚上 20:09-21:14 之间,微信支付发生故障,全国微信支付交易无法正常进行。然...
Python十大装B语法
Python 是一种代表简单思想的语言,其语法相对简单,很容易上手。不过,如果就此小视 Python 语法的精妙和深邃,那就大错特错了。本文精心筛选了最能展现 Python 语法之精妙的十个知识点,并附上详细的实例代码。如能在实战中融会贯通、灵活使用,必将使代码更为精炼、高效,同时也会极大提升代码B格,使之看上去更老练,读起来更优雅。
数据库优化 - SQL优化
以实际SQL入手,带你一步一步走上SQL优化之路!
2019年11月中国大陆编程语言排行榜
2019年11月2日,我统计了某招聘网站,获得有效程序员招聘数据9万条。针对招聘信息,提取编程语言关键字,并统计如下: 编程语言比例 rank pl_ percentage 1 java 33.62% 2 cpp 16.42% 3 c_sharp 12.82% 4 javascript 12.31% 5 python 7.93% 6 go 7.25% 7 p...
通俗易懂地给女朋友讲:线程池的内部原理
餐盘在灯光的照耀下格外晶莹洁白,女朋友拿起红酒杯轻轻地抿了一小口,对我说:“经常听你说线程池,到底线程池到底是个什么原理?”
《奇巧淫技》系列-python!!每天早上八点自动发送天气预报邮件到QQ邮箱
将代码部署服务器,每日早上定时获取到天气数据,并发送到邮箱。 也可以说是一个小型人工智障。 知识可以运用在不同地方,不一定非是天气预报。
经典算法(5)杨辉三角
杨辉三角 是经典算法,这篇博客对它的算法思想进行了讲解,并有完整的代码实现。
英特尔不为人知的 B 面
从 PC 时代至今,众人只知在 CPU、GPU、XPU、制程、工艺等战场中,英特尔在与同行硬件芯片制造商们的竞争中杀出重围,且在不断的成长进化中,成为全球知名的半导体公司。殊不知,在「刚硬」的背后,英特尔「柔性」的软件早已经做到了全方位的支持与支撑,并持续发挥独特的生态价值,推动产业合作共赢。 而对于这一不知人知的 B 面,很多人将其称之为英特尔隐形的翅膀,虽低调,但是影响力却不容小觑。 那么,在...
腾讯算法面试题:64匹马8个跑道需要多少轮才能选出最快的四匹?
昨天,有网友私信我,说去阿里面试,彻底的被打击到了。问了为什么网上大量使用ThreadLocal的源码都会加上private static?他被难住了,因为他从来都没有考虑过这个问题。无独有偶,今天笔者又发现有网友吐槽了一道腾讯的面试题,我们一起来看看。 腾讯算法面试题:64匹马8个跑道需要多少轮才能选出最快的四匹? 在互联网职场论坛,一名程序员发帖求助到。二面腾讯,其中一个算法题:64匹...
面试官:你连RESTful都不知道我怎么敢要你?
干货,2019 RESTful最贱实践
刷了几千道算法题,这些我私藏的刷题网站都在这里了!
遥想当年,机缘巧合入了 ACM 的坑,周边巨擘林立,从此过上了"天天被虐似死狗"的生活… 然而我是谁,我可是死狗中的战斗鸡,智力不够那刷题来凑,开始了夜以继日哼哧哼哧刷题的日子,从此"读题与提交齐飞, AC 与 WA 一色 ",我惊喜的发现被题虐既刺激又有快感,那一刻我泪流满面。这么好的事儿作为一个正直的人绝不能自己独享,经过激烈的颅内斗争,我决定把我私藏的十几个 T 的,阿不,十几个刷题网...
为啥国人偏爱Mybatis,而老外喜欢Hibernate/JPA呢?
关于SQL和ORM的争论,永远都不会终止,我也一直在思考这个问题。昨天又跟群里的小伙伴进行了一番讨论,感触还是有一些,于是就有了今天这篇文。 声明:本文不会下关于Mybatis和JPA两个持久层框架哪个更好这样的结论。只是摆事实,讲道理,所以,请各位看官勿喷。 一、事件起因 关于Mybatis和JPA孰优孰劣的问题,争论已经很多年了。一直也没有结论,毕竟每个人的喜好和习惯是大不相同的。我也看...
白话阿里巴巴Java开发手册高级篇
不久前,阿里巴巴发布了《阿里巴巴Java开发手册》,总结了阿里巴巴内部实际项目开发过程中开发人员应该遵守的研发流程规范,这些流程规范在一定程度上能够保证最终的项目交付质量,通过在时间中总结模式,并推广给广大开发人员,来避免研发人员在实践中容易犯的错误,确保最终在大规模协作的项目中达成既定目标。 无独有偶,笔者去年在公司里负责升级和制定研发流程、设计模板、设计标准、代码标准等规范,并在实际工作中进行...
SQL-小白最佳入门sql查询一
不要偷偷的查询我的个人资料,即使你再喜欢我,也不要这样,真的不好;
项目中的if else太多了,该怎么重构?
介绍 最近跟着公司的大佬开发了一款IM系统,类似QQ和微信哈,就是聊天软件。我们有一部分业务逻辑是这样的 if (msgType = "文本") { // dosomething } else if(msgType = "图片") { // doshomething } else if(msgType = "视频") { // doshomething } else { // doshom...
Nginx 原理和架构
Nginx 是一个免费的,开源的,高性能的 HTTP 服务器和反向代理,以及 IMAP / POP3 代理服务器。Nginx 以其高性能,稳定性,丰富的功能,简单的配置和低资源消耗而闻名。 Nginx 的整体架构 Nginx 里有一个 master 进程和多个 worker 进程。master 进程并不处理网络请求,主要负责调度工作进程:加载配置、启动工作进程及非停升级。worker 进程负责处...
YouTube排名第一的励志英文演讲《Dream(梦想)》
Idon’t know what that dream is that you have, I don't care how disappointing it might have been as you've been working toward that dream,but that dream that you’re holding in your mind, that it’s po...
“狗屁不通文章生成器”登顶GitHub热榜,分分钟写出万字形式主义大作
一、垃圾文字生成器介绍 最近在浏览GitHub的时候,发现了这样一个骨骼清奇的雷人项目,而且热度还特别高。 项目中文名:狗屁不通文章生成器 项目英文名:BullshitGenerator 根据作者的介绍,他是偶尔需要一些中文文字用于GUI开发时测试文本渲染,因此开发了这个废话生成器。但由于生成的废话实在是太过富于哲理,所以最近已经被小伙伴们给玩坏了。 他的文风可能是这样的: 你发现,...
程序员:我终于知道post和get的区别
是一个老生常谈的话题,然而随着不断的学习,对于以前的认识有很多误区,所以还是需要不断地总结的,学而时习之,不亦说乎
相关热词 c# 二进制截断字符串 c#实现窗体设计器 c#检测是否为微信 c# plc s1200 c#里氏转换原则 c# 主界面 c# do loop c#存为组套 模板 c# 停掉协程 c# rgb 读取图片
立即提问