android studio gradle failed问题

本人是安卓实习生一枚,遇到这个问题,求大神解答。

Error:Unable to start the daemon process.
This problem might be caused by incorrect configuration of the daemon.
For example, an unrecognized jvm option is used.
Please refer to the user guide chapter on the daemon at http://gradle.org/docs/2.4/userguide/gradle_daemon.html

Please read the following process output to find out more:

Error occurred during initialization of VM
Could not reserve enough space for 2097152KB object heap
Java HotSpot(TM) Client VM warning: ignoring option MaxPermSize=512m; support was removed in 8.0

Csdn user default icon
上传中...
上传图片
插入图片
抄袭、复制答案,以达到刷声望分或其他目的的行为,在CSDN问答是严格禁止的,一经发现立刻封号。是时候展现真正的技术了!
其他相关推荐
Android Studio Gradle project sync failed,Configure project:app 前出现红叹号
Android Studio Gradle project sync failed,Configure project:app 前出现红叹号 ![图片说明](https://img-ask.csdn.net/upload/201905/13/1557746272_155433.jpg) 提示为 ``` org.gradle.api.ProjectConfigurationException: A problem occurred configuring project ':app' at java.util.concurrent.ThreadPoolExecutor.runWorker(ThreadPoolExecutor.java:1142) at java.util.concurrent.ThreadPoolExecutor$Worker.run(ThreadPoolExecutor.java:617) at org.gradle.internal.concurrent.ThreadFactoryImpl$ManagedThreadRunnable.run(ThreadFactoryImpl.java:55) at java.lang.Thread.run(Thread.java:745) Caused by: com.android.builder.errors.EvalIssueException: Failed to install the following Android SDK packages as some licences have not been accepted. build-tools;28.0.2 Android SDK Build-Tools 28.0.2 To build this project, accept the SDK license agreements and install the missing components using the Android Studio SDK Manager. Alternatively, to transfer the license agreements from one workstation to another, see http://d.android.com/r/studio-ui/export-licenses.html Using Android SDK: D:\Android\SDK at com.android.build.gradle.internal.SdkHandler.initTarget(SdkHandler.java:194) at com.android.build.gradle.BasePlugin.ensureTargetSetup(BasePlugin.java:980) at com.android.build.gradle.BasePlugin.createAndroidTasks(BasePlugin.java:752) at com.android.build.gradle.BasePlugin.lambda$null$4(BasePlugin.java:690) at com.android.builder.profile.ThreadRecorder.record(ThreadRecorder.java:81) at com.android.build.gradle.BasePlugin.lambda$createTasks$5(BasePlugin.java:686) at org.gradle.internal.event.BroadcastDispatch$ActionInvocationHandler.dispatch(BroadcastDispatch.java:91) at org.gradle.internal.event.BroadcastDispatch$ActionInvocationHandler.dispatch(BroadcastDispatch.java:80) at org.gradle.internal.event.AbstractBroadcastDispatch.dispatch(AbstractBroadcastDispatch.java:42) at org.gradle.internal.event.BroadcastDispatch$SingletonDispatch.dispatch(BroadcastDispatch.java:230) at org.gradle.internal.event.BroadcastDispatch$SingletonDispatch.dispatch(BroadcastDispatch.java:149) at org.gradle.internal.event.AbstractBroadcastDispatch.dispatch(AbstractBroadcastDispatch.java:58) at org.gradle.internal.event.BroadcastDispatch$CompositeDispatch.dispatch(BroadcastDispatch.java:324) at org.gradle.internal.event.BroadcastDispatch$CompositeDispatch.dispatch(BroadcastDispatch.java:234) at org.gradle.internal.event.ListenerBroadcast.dispatch(ListenerBroadcast.java:140) at org.gradle.internal.event.ListenerBroadcast.dispatch(ListenerBroadcast.java:37) at org.gradle.internal.dispatch.ProxyDispatchAdapter$DispatchingInvocationHandler.invoke(ProxyDispatchAdapter.java:93) at com.sun.proxy.$Proxy27.afterEvaluate(Unknown Source) at org.gradle.configuration.project.LifecycleProjectEvaluator.notifyAfterEvaluate(LifecycleProjectEvaluator.java:76) ... 85 more ```
Android Studio一直提示Gradle Project sync failed
[图片说明](https://img-ask.csdn.net/upload/201805/22/1527001931_324578.png)
Andriod Studio 出现Gradle sync failed
Android studio 启动出现Gradle sync failed: Plugin is too old, please update to a more recent version, or set ANDROID_DAILY_OVERRIDE environment variable to "358d78636eb2134e9cd5c11fea4fbdaa703d0ad6" 怎么去更新插件呢?
Android Studio2.3.3gradle Failed to resolve
![图片说明](https://img-ask.csdn.net/upload/201707/26/1501055102_678890.png) 按照步骤安装了Studio 创建一个新项目就报错了,第三方以来导入不了,试过各种 maven镜像都不行
刚安装好android studio 后新建第一个项目报错 Gradle sync failed
android studio 新建项目 Gradle sync failed: The first result from the daemon was empty. Most likely the process died immediately after connection. ![图片说明](https://img-ask.csdn.net/upload/201701/24/1485259415_875463.png) 关闭了杀毒软件,但还是报错; File->Invalidate Caches/Restart仍然出现这样的错误 ![图片说明](https://img-ask.csdn.net/upload/201701/24/1485259599_139647.png) 电脑没有连接任何其他设备 关于gradle的设置和文件是这样的:![图片说明](https://img-ask.csdn.net/upload/201701/24/1485259902_92537.png) ![图片说明](https://img-ask.csdn.net/upload/201701/24/1485259913_196525.png) ![图片说明](https://img-ask.csdn.net/upload/201701/24/1485261039_326185.png) 打开后看到: Caused by: org.gradle.launcher.daemon.client.NoUsableDaemonFoundException: Unable to find a usable idle daemon. I have connected to 100 different daemons but I could not use any of them to run the build. BuildActionParameters were DefaultBuildActionParameters {, currentDir=F:\Android_studio_projects\MyApplication, systemProperties size=91, envVariables size=43, logLevel=LIFECYCLE, daemonUsage=IMPLICITLY_DISABLED, continuous=false, interactive=false, injectedPluginClasspath=[]}.
Android Studio;Gradle:unable to delete file
Android Studio顺利启动;然后Build->Clean Project就出问题了 Error:Exception failed for task':accountms:clean'. >Unable to delete file: F:\.....\accountms\build\exploded-bundles\ComAndroidSupportAppcompatV71901.aar\classes.jar 然后Google了,没找到解决办法。 恳请各位大神指引一下小弟 说明:AccountMS为项目名
Android studio 导入项目后出现sync failed
我的Android studio在git上面将项目clone下来之后打开,就出现了这个状况,查看C:\Users\Administrator\.gradle\wrapper\dists里的gradle,发现文件夹文件大小为0k。而后我再网页上下载了4.1的zip包放到该文件下,重启studio,发现还是这个样子,再看4.1的文件夹里,文件大小还是0k
如何解决Unity打包Gradle build failed问题
问题: CommandInvokationFailure: Gradle build failed. F:/Program Files/Unity/2019.3.0b3/Editor/Data/PlaybackEngines/AndroidPlayer/Tools\OpenJDK\Windows\bin\java.exe -classpath "F:\Program Files\Unity\2019.3.0b3\Editor\Data\PlaybackEngines\AndroidPlayer\Tools\gradle\lib\gradle-launcher-5.1.1.jar" org.gradle.launcher.GradleMain "-Dorg.gradle.jvmargs=-Xmx4096m" "assembleRelease" FAILURE: Build failed with an exception. * What went wrong: Execution failed for task ':unityLibrary:packageReleaseResources'. > Could not resolve all files for configuration ':unityLibrary:_internal_aapt2_binary'. > Could not resolve com.android.tools.build:aapt2:3.4.0-5326820. Required by: project :unityLibrary > Could not resolve com.android.tools.build:aapt2:3.4.0-5326820. > Could not get resource 'https://dl.google.com/dl/android/maven2/com/android/tools/build/aapt2/3.4.0-5326820/aapt2-3.4.0-5326820.pom'. > Could not GET 'https://dl.google.com/dl/android/maven2/com/android/tools/build/aapt2/3.4.0-5326820/aapt2-3.4.0-5326820.pom'. > Connect to mirrors.opencas.ac.cn:80 [mirrors.opencas.ac.cn/124.16.75.211] failed: Connection timed out: connect > Could not resolve com.android.tools.build:aapt2:3.4.0-5326820. > Could not get resource 'https://jcenter.bintray.com/com/android/tools/build/aapt2/3.4.0-5326820/aapt2-3.4.0-5326820.pom'. > Could not GET 'https://jcenter.bintray.com/com/android/tools/build/aapt2/3.4.0-5326820/aapt2-3.4.0-5326820.pom'. > Connect to mirrors.opencas.ac.cn:80 [mirrors.opencas.ac.cn/124.16.75.211] failed: Connection timed out: connect 尝试过论坛里的方法,目前JDK的版本是1.8.0,SDK的版本是26.1.1,之前是25,但是因为报错需要26,所以升级上去了,但是还是没有解决 怀疑是环境变量设置的问题,但是小弟并非计算机专业,没有办法非常系统的debug,麻烦各位大佬帮我看看具体是哪里出现了问题 ![图片说明](https://img-ask.csdn.net/upload/201909/20/1568912455_512805.png)![图片说明](https://img-ask.csdn.net/upload/201909/20/1568912467_242775.png)![图片说明](https://img-ask.csdn.net/upload/201909/20/1568912486_584120.png)![图片说明](https://img-ask.csdn.net/upload/201909/20/1568912494_751240.png)![图片说明](https://img-ask.csdn.net/upload/201909/20/1568912502_553839.png)![图片说明](https://img-ask.csdn.net/upload/201909/20/1568912507_195203.png)
Android studio 的confugure build和Gradle Sync lssues报错
![图片说明](https://img-ask.csdn.net/upload/201909/20/1568948677_314838.png) confugure build报错内容如下: Caused by: org.gradle.internal.event.ListenerNotificationException: Failed to notify project evaluation listener. Caused by: java.lang.VerifyError: Uninitialized object exists on backward branch 142 Exception Details: Location: com/android/build/gradle/internal/pipeline/VariantInfoImpl.<init>(Lcom/android/build/gradle/internal/scope/VariantScope;)V @200: goto Reason: Error exists in the bytecode Gradle Sync lssues报错内容如下: ERROR: Uninitialized object exists on backward branch 142 Exception Details: Location: com/android/build/gradle/internal/pipeline/VariantInfoImpl.<init>(Lcom/android/build/gradle/internal/scope/VariantScope;)V @200: goto Reason: Error exists in the bytecode
android studio 编译问题
最近用android studio2.3 run一个项目发现报错,android studio2.3,gradle 2.3.1, gradle wrapper 是3.3-all, 报错如下,怎么破? Error:Execution failed for task ':app:packageXxxxDebug'. > java.io.IOException: Failed to read zip file 'D:\xxx\app\build\intermediates\transforms\mergeJavaRes\xxx\debug\jars\2\1f\main.jar'.
Android Studio 新建项目sync failed 失败 gradle包 下载好了,第一步能通过 就是如图的错误
![图片说明](https://img-ask.csdn.net/upload/201904/24/1556068345_388683.png) 8:53 Gradle sync failed: Connection timed out: connect Consult IDE log for more details (Help | Show Log) (37 s 239 ms) 换文件夹位置也试过了 就感觉Load通过了 Configure失败 是哪里的配置问题吗 安装的Studio是1.8.1 使用的gradle是4.6 https\://services.gradle.org/distributions/gradle-4.6-all.zip 这个也能下载 也放进去了 Gradle sync failed: Connection timed out: connect Consult IDE log for more details (Help | Show Log)
新电脑第一次安装Android studio 报错 gradle project
下面是IDEA里的最后一段 ``` 2017-11-22 00:35:54,284 [ thread 14] WARN - ect.sync.idea.ProjectSetUpTask - Failed to find target with hash string 'android-26' in: C:\Users\Lan\AppData\Local\Android\Sdk Consult IDE log for more details (Help | Show Log) 2017-11-22 00:35:54,285 [ thread 14] INFO - e.project.sync.GradleSyncState - Gradle sync failed: Failed to find target with hash string 'android-26' in: C:\Users\Lan\AppData\Local\Android\Sdk Consult IDE log for more details (Help | Show Log) (924ms) 2017-11-22 00:35:54,501 [ thread 18] INFO - #com.jetbrains.cidr.lang - Clearing symbols finished in 0 s. 2017-11-22 00:35:54,524 [ thread 18] INFO - #com.jetbrains.cidr.lang - Loading symbols finished in 0 s. 2017-11-22 00:35:54,529 [ thread 18] INFO - #com.jetbrains.cidr.lang - Building symbols finished in 0 s. 2017-11-22 00:35:54,541 [ thread 18] INFO - #com.jetbrains.cidr.lang - Saving symbols finished in 0 s. 2017-11-22 00:36:14,763 [se-915-b01] INFO - ide.actions.ShowFilePathAction - Exit code 1 ```
android studio 安装成功后不是有效的 Win32 应用程序
android studio 安装成功后出现Gradle sync failed: CreateProcess error=193, %1 不是有效的 Win32 应用程序。
新手提问,Android Studio 编译错误的问题,估计可能跟gradle有关系
Information:Gradle tasks [:app:clean, :app:generateDebugSources, :app:mockableAndroidJar, :app:prepareDebugUnitTestDependencies, :app:generateDebugAndroidTestSources, :app:assembleDebug] C:\Users\abc\AndroidStudioProjects\3.26\app\build\intermediates\res\merged\debug\values\values.xml Error:(334) Apostrophe not preceded by \ (in Find Shoes Shoe's Ball) Error:(334) Apostrophe not preceded by \ (in Find Shoes Shoe's Ball) Error:Execution failed for task ':app:processDebugResources'. > com.android.ide.common.process.ProcessException: Failed to execute aapt Information:BUILD FAILED Information:Total time: 8.663 secs Information:3 errors Information:0 warnings 因为刚接触论坛不久,没有钱来悬赏。。。望热心人士慷慨解囊
Android Studio明明依赖都安装的好好的,为什么一直出现“Gradle project sync failed”?
刚刚安装Android Studio3.4.1,各种问题不断,现在每新建一个项目都会出现如图9个error: ![图片说明](https://img-ask.csdn.net/upload/201907/05/1562332526_309281.png) 说unable to resolve dependency for xxx,但是我看dependency安装的好好的,如图: ![图片说明](https://img-ask.csdn.net/upload/201907/05/1562334355_301356.png) 有大神解释一下为什么吗?
升级android gradle 版本到3.5后打包报错 com.android.tools.r8.CompilationFailedException: Compilation failed to complete
升级android gradle 版本到3.5后打包报错,编译是没问题的 但是打签名包时报错,有没有遇到这个问题的大佬麻烦指点一下 ![图片说明](https://img-ask.csdn.net/upload/201910/07/1570462599_316228.jpg)
Android Studio更新后Failed to parse XML
Android Studio更新后一直显示Sync 错误,但是程序还是可以在手机上运行,但也一直显示Project未创建成功,试了好多方法也找不到原因。 错误提示: ERROR: Failed to parse XML in C:\Users\Administrator\Desktop\Gesture_Lock_Master-master\app\src\main\AndroidManifest.xml ParseError at [row,col]:[6,5] Message: expected start or end tag Affected Modules: app 尝试解决方法 distributionUrl=https\://services.gradle.org/distributions/gradle-4.10.1-all.zip 重新下载了这个压缩包并放置在相应的文件夹中,再次尝试无果。 求大神们帮助!万分感谢。 ![图片说明](https://img-ask.csdn.net/upload/201904/21/1555809169_763397.png) ![图片说明](https://img-ask.csdn.net/upload/201904/21/1555809203_543648.png) ![图片说明](https://img-ask.csdn.net/upload/201904/23/1555988311_673925.png) ![图片说明](https://img-ask.csdn.net/upload/201904/23/1555988413_845310.png) 上传了新的截图
android studio远行项目的问题
今天试了一下android studio,开始时用着没什么事。可是弄一个Java内容较多的Activity时,运行不了项目,提示以下错误: Gradle: FAILURE: Build failed with an exception. * What went wrong: Execution failed for task ':ImageCropper:compileDebug'. > Compilation failed; see the compiler error output for details. * Try: Run with --stacktrace option to get the stack trace. Run with --info or --debug option to get more log output. Could not execute build using Gradle distribution 'http://services.gradle.org/distributions/gradle-1.6-bin.zip'. 注释代码后又可以了,代码没有错啊。不知道有没有哪们兄弟也遇到这样的问题,又如何解决?
unity打包问题,unity 和android studio交互
CommandInvokationFailure: Gradle build failed. D:\Unity2018\Editor\Data\PlaybackEngines\AndroidPlayer/Tools\OpenJDK\Windows\bin\java.exe -classpath "D:\Unity2018\Editor\Data\PlaybackEngines\AndroidPlayer\Tools\gradle\lib\gradle-launcher-5.1.1.jar" org.gradle.launcher.GradleMain "-Dorg.gradle.jvmargs=-Xmx4096m" "assembleRelease" stderr[ FAILURE: Build failed with an exception. * What went wrong: Execution failed for task ':processReleaseResources'. > Android resource linking failed error: resource style/Theme.AppCompat.Light.DarkActionBar (aka com.ab1.ProductName:style/Theme.AppCompat.Light.DarkActionBar) not found. D:\WorkProject\test\TestPath\Temp\gradleOut\src\main\res\values\styles.xml:6:1-7:9: AAPT: error: style attribute 'attr/colorPrimary (aka com.ab1.ProductName:attr/colorPrimary)' not found. D:\WorkProject\test\TestPath\Temp\gradleOut\src\main\res\values\styles.xml:6:1-7:9: AAPT: error: style attribute 'attr/colorPrimaryDark (aka com.ab1.ProductName:attr/colorPrimaryDark)' not found. D:\WorkProject\test\TestPath\Temp\gradleOut\src\main\res\values\styles.xml:6:1-7:9: AAPT: error: style attribute 'attr/colorAccent (aka com.ab1.ProductName:attr/colorAccent)' not found. error: failed linking references. * Try: Run with --stacktrace option to get the stack trace. Run with --info or --debug option to get more log output. Run with --scan to get full insights. * Get more help at https://help.gradle.org BUILD FAILED in 8s ] stdout[ > Task :preBuild UP-TO-DATE > Task :preReleaseBuild > Task :compileReleaseAidl NO-SOURCE > Task :compileReleaseRenderscript NO-SOURCE > Task :checkReleaseManifest > Task :generateReleaseBuildConfig > Task :prepareLintJar > Task :generateReleaseSources > Task :javaPreCompileRelease > Task :mainApkListPersistenceRelease > Task :generateReleaseResValues > Task :generateReleaseResources > Task :mergeReleaseResources > Task :createReleaseCompatibleScreenManifests > Task :processReleaseManifest > Task :processReleaseResources FAILED Deprecated Gradle features were used in this build, making it incompatible with Gradle 6.0. Use '--warning-mode all' to show the individual deprecation warnings. See https://docs.gradle.org/5.1.1/userguide/command_line_interface.html#sec:command_line_warnings 11 actionable tasks: 11 executed ] exit code: 1 UnityEditor.Android.Command.WaitForProgramToRun (UnityEditor.Utils.Program p, UnityEditor.Android.Command+WaitingForProcessToExit waitingForProcessToExit, System.String errorMsg) (at <67e4f96bbb8d486db6550813353bb5eb>:0) UnityEditor.Android.Command.Run (System.Diagnostics.ProcessStartInfo psi, UnityEditor.Android.Command+WaitingForProcessToExit waitingForProcessToExit, System.String errorMsg) (at <67e4f96bbb8d486db6550813353bb5eb>:0) UnityEditor.Android.Command.Run (System.String command, System.String args, System.String workingdir, UnityEditor.Android.Command+WaitingForProcessToExit waitingForProcessToExit, System.String errorMsg) (at <67e4f96bbb8d486db6550813353bb5eb>:0) UnityEditor.Android.AndroidJavaTools.RunJava (System.String args, System.String workingdir, System.Action`1[T] progress, System.String error) (at <67e4f96bbb8d486db6550813353bb5eb>:0) UnityEditor.Android.GradleWrapper.Run (UnityEditor.Android.AndroidJavaTools javaTools, System.String workingdir, System.String task, System.Action`1[T] progress) (at <67e4f96bbb8d486db6550813353bb5eb>:0) Rethrow as GradleInvokationException: Gradle build failed UnityEditor.Android.GradleWrapper.Run (UnityEditor.Android.AndroidJavaTools javaTools, System.String workingdir, System.String task, System.Action`1[T] progress) (at <67e4f96bbb8d486db6550813353bb5eb>:0) UnityEditor.Android.PostProcessor.Tasks.BuildGradleProject.Execute (UnityEditor.Android.PostProcessor.PostProcessorContext context) (at <67e4f96bbb8d486db6550813353bb5eb>:0) UnityEditor.Android.PostProcessor.PostProcessRunner.RunAllTasks (UnityEditor.Android.PostProcessor.PostProcessorContext context) (at <67e4f96bbb8d486db6550813353bb5eb>:0) UnityEngine.GUIUtility:ProcessEvent(Int32, IntPtr)
在中国程序员是青春饭吗?
今年,我也32了 ,为了不给大家误导,咨询了猎头、圈内好友,以及年过35岁的几位老程序员……舍了老脸去揭人家伤疤……希望能给大家以帮助,记得帮我点赞哦。 目录: 你以为的人生 一次又一次的伤害 猎头界的真相 如何应对互联网行业的「中年危机」 一、你以为的人生 刚入行时,拿着傲人的工资,想着好好干,以为我们的人生是这样的: 等真到了那一天,你会发现,你的人生很可能是这样的: ...
深析Synchronized关键字(小白慎入,深入jvm源码,两万字长文)
目录一、synchronized基础1.1synchronized的使用1.1示例1.2验证1.2.1 普通方法和代码块中使用this是同一个监视器(锁),即某个具体调用该代码的对象1.2.2 静态方法和代码块中使用该类的class对象是同一个监视器,任何该类的对象调用该段代码时都是在争夺同一个监视器的锁定1.2、synchronized的特点二、synchronized进阶2.1对象头2.2sy
GitHub 总星 4w+!删库?女装?表情包?这些沙雕中文项目真是我每天快乐的源泉!
大家好,我是 Rocky0429,一个喜欢在 GitHub 上瞎逛的蒟蒻… 好看的皮囊千篇一律,有趣的灵魂没有底线。作为全球最大的同性交友网站,GayHub GitHub 上不止有鲜活的代码,秃头的算法,还有很多拥有有(sha)趣(diao)灵魂的宝藏。 还记得我之前给大家介绍的 Sorry 项目嘛,一个可以自己做表情包的项目,这个的沙雕程度在下面这些项目面前只能算弟弟。虽然说沙雕不分国...
程序员请照顾好自己,周末病魔差点一套带走我。
程序员在一个周末的时间,得了重病,差点当场去世,还好及时挽救回来了。
卸载 x 雷某度!GitHub 标星 1.5w+,从此我只用这款全能高速下载工具!
作者 | Rocky0429 来源 | Python空间 大家好,我是 Rocky0429,一个喜欢在网上收集各种资源的蒟蒻… 网上资源眼花缭乱,下载的方式也同样千奇百怪,比如 BT 下载,磁力链接,网盘资源等等等等,下个资源可真不容易,不一样的方式要用不同的下载软件,因此某比较有名的 x 雷和某度网盘成了我经常使用的工具。 作为一个没有钱的穷鬼,某度网盘几十 kb 的下载速度让我...
20道你必须要背会的微服务面试题,面试一定会被问到
这篇博客总结了面试中最常见的微服务面试题,相信对你有所帮助。
讲真,这两个IDE插件,可以让你写出质量杠杠的代码
周末躺在床上看《拯救大兵瑞恩》 周末在闲逛的时候,发现了两个优秀的 IDE 插件,据说可以提高代码的质量,我就安装了一下,试了试以后发现,确实很不错,就推荐给大家。 01、Alibaba Java 代码规范插件 《阿里巴巴 Java 开发手册》,相信大家都不会感到陌生,其 IDEA 插件的下载次数据说达到了 80 万次,我今天又贡献了一次。嘿嘿。 该项目的插件地址: https://github....
为什么猝死的都是程序员,基本上不见产品经理猝死呢?
相信大家时不时听到程序员猝死的消息,但是基本上听不到产品经理猝死的消息,这是为什么呢? 我们先百度搜一下:程序员猝死,出现将近700多万条搜索结果: 搜索一下:产品经理猝死,只有400万条的搜索结果,从搜索结果数量上来看,程序员猝死的搜索结果就比产品经理猝死的搜索结果高了一倍,而且从下图可以看到,首页里面的五条搜索结果,其实只有两条才是符合条件。 所以程序员猝死的概率真的比产品经理大,并不是错...
毕业5年,我问遍了身边的大佬,总结了他们的学习方法
我问了身边10个大佬,总结了他们的学习方法,原来成功都是有迹可循的。
推荐10个堪称神器的学习网站
每天都会收到很多读者的私信,问我:“二哥,有什么推荐的学习网站吗?最近很浮躁,手头的一些网站都看烦了,想看看二哥这里有什么新鲜货。” 今天一早做了个恶梦,梦到被老板辞退了。虽然说在我们公司,只有我辞退老板的份,没有老板辞退我这一说,但是还是被吓得 4 点多都起来了。(主要是因为我掌握着公司所有的核心源码,哈哈哈) 既然 4 点多起来,就得好好利用起来。于是我就挑选了 10 个堪称神器的学习网站,推...
良心推荐,我珍藏的一些Chrome插件
上次搬家的时候,发了一个朋友圈,附带的照片中不小心暴露了自己的 Chrome 浏览器插件之多,于是就有小伙伴评论说分享一下我觉得还不错的浏览器插件。 我下面就把我日常工作和学习中经常用到的一些 Chrome 浏览器插件分享给大家,随便一个都能提高你的“生活品质”和工作效率。 Markdown Here Markdown Here 可以让你更愉快的写邮件,由于支持 Markdown 直接转电子邮...
看完这篇HTTP,跟面试官扯皮就没问题了
我是一名程序员,我的主要编程语言是 Java,我更是一名 Web 开发人员,所以我必须要了解 HTTP,所以本篇文章就来带你从 HTTP 入门到进阶,看完让你有一种恍然大悟、醍醐灌顶的感觉。 最初在有网络之前,我们的电脑都是单机的,单机系统是孤立的,我还记得 05 年前那会儿家里有个电脑,想打电脑游戏还得两个人在一个电脑上玩儿,及其不方便。我就想为什么家里人不让上网,我的同学 xxx 家里有网,每...
2020 年,大火的 Python 和 JavaScript 是否会被取而代之?
Python 和 JavaScript 是目前最火的两大编程语言,但是2020 年,什么编程语言将会取而代之呢? 作者 |Richard Kenneth Eng 译者 |明明如月,责编 | 郭芮 出品 | CSDN(ID:CSDNnews) 以下为译文: Python 和 JavaScript 是目前最火的两大编程语言。然而,他们不可能永远屹立不倒。最终,必将像其他编程语言一...
C语言数字图像处理---1.4直方图拉伸和直方图均衡化
本篇将延续上一篇的内容,对直方图进行扩展,讲述直方图拉伸和直方图均衡化两个内容,并通过简单的C语言来实现这两个基础功能,让初学者通俗易懂。
史上最全的IDEA快捷键总结
现在Idea成了主流开发工具,这篇博客对其使用的快捷键做了总结,希望对大家的开发工作有所帮助。
阿里程序员写了一个新手都写不出的低级bug,被骂惨了。
这种新手都不会范的错,居然被一个工作好几年的小伙子写出来,差点被当场开除了。
谁是华为扫地僧?
是的,华为也有扫地僧!2020年2月11-12日,“养在深闺人不知”的华为2012实验室扫地僧们,将在华为开发者大会2020(Cloud)上,和大家见面。到时,你可以和扫地僧们,吃一个洋...
没用过这些 IDEA 插件?怪不得写代码头疼
使用插件,可以提高开发效率。对于开发人员很有帮助。这篇博客介绍了IDEA中最常用的一些插件。
AI 没让人类失业,搞 AI 的人先失业了
最近和几个 AI 领域的大佬闲聊 根据他们讲的消息和段子 改编出下面这个故事 如有雷同 都是巧合 1. 老王创业失败,被限制高消费 “这里写我跑路的消息实在太夸张了。” 王葱葱哼笑一下,把消息分享给群里。 阿杰也看了消息,笑了笑。在座几位也都笑了。 王葱葱是个有名的人物,21岁那年以全额奖学金进入 KMU 攻读人工智能博士,累计发表论文 40 余篇,个人技术博客更是成为深度学习领域内风向标。 ...
2020年,冯唐49岁:我给20、30岁IT职场年轻人的建议
点击“技术领导力”关注∆每天早上8:30推送 作者|Mr.K 编辑| Emma 来源|技术领导力(ID:jishulingdaoli) 前天的推文《冯唐:职场人35岁以后,方法论比经验重要》,收到了不少读者的反馈,觉得挺受启发。其实,冯唐写了不少关于职场方面的文章,都挺不错的。可惜大家只记住了“春风十里不如你”、“如何避免成为油腻腻的中年人”等不那么正经的文章。 本文整理了冯...
推荐一些有趣的在线编程游戏
1.Robocode 让坦克们互相博弈的游戏,你可以看到它们飞奔,碾碎一切挡道的东西。机器人配有雷达与火炮,选手在躲避对手进攻的同时攻击对手,以此来较量得分的多少。这个游戏很有意思,曾经令我沉迷… 你可以用Java、Scala、C#等编程语言,编写人工智能程序,驱动机器人。 2.Code Combat Code Combat是一款学习编程的角色扮演游戏。每一关都用任务的形式设立目标,用实时的反馈...
工作十年的数据分析师被炒,没有方向,你根本躲不过中年危机
2020年刚刚开始,就意味着离职潮高峰的到来,我身边就有不少人拿着年终奖离职了,而最让我感到意外的,是一位工作十年的数据分析师也离职了,不同于别人的主动辞职,他是被公司炒掉的。 很多人都说数据分析是个好饭碗,工作不累薪资高、入门简单又好学。然而今年34的他,却真正尝到了中年危机的滋味,平时也有不少人都会私信问我: 数据分析师也有中年危机吗?跟程序员一样是吃青春饭的吗?该怎么保证自己不被公司淘汰...
作为一名大学生,如何在B站上快乐的学习?
B站是个宝,谁用谁知道???? 作为一名大学生,你必须掌握的一项能力就是自学能力,很多看起来很牛X的人,你可以了解下,人家私底下一定是花大量的时间自学的,你可能会说,我也想学习啊,可是嘞,该学习啥嘞,不怕告诉你,互联网时代,最不缺的就是学习资源,最宝贵的是啥? 你可能会说是时间,不,不是时间,而是你的注意力,懂了吧! 那么,你说学习资源多,我咋不知道,那今天我就告诉你一个你必须知道的学习的地方,人称...
那些年,我们信了课本里的那些鬼话
教材永远都是有错误的,从小学到大学,我们不断的学习了很多错误知识。 斑羚飞渡 在我们学习的很多小学课文里,有很多是错误文章,或者说是假课文。像《斑羚飞渡》: 随着镰刀头羊的那声吼叫,整个斑羚群迅速分成两拨,老年斑羚为一拨,年轻斑羚为一拨。 就在这时,我看见,从那拨老斑羚里走出一只公斑羚来。公斑羚朝那拨年轻斑羚示意性地咩了一声,一只半大的斑羚应声走了出来。一老一少走到伤心崖,后退了几步,突...
张朝阳回应迟到 1 分钟罚 500:资本家就得剥削员工
loonggg读完需要2分钟速读仅需 1 分钟大家我,我是你们的校长。前几天,搜狐的董事局主席兼 CEO 张朝阳和搜狐都上热搜了。原因很简单,就是搜狐出了“考勤新规”。一封搜狐对员工发布...
一个程序在计算机中是如何运行的?超级干货!!!
强烈声明:本文很干,请自备茶水!???? 开门见山,咱不说废话! 你有没有想过,你写的程序,是如何在计算机中运行的吗?比如我们搞Java的,肯定写过这段代码 public class HelloWorld { public static void main(String[] args) { System.out.println("Hello World!"); } ...
【蘑菇街技术部年会】程序员与女神共舞,鼻血再次没止住。(文末内推)
蘑菇街技术部的年会,别开生面,一样全是美女。
那个在阿里养猪的工程师,5年了……
简介: 在阿里,走过1825天,没有趴下,依旧斗志满满,被称为“五年陈”。他们会被授予一枚戒指,过程就叫做“授戒仪式”。今天,咱们听听阿里的那些“五年陈”们的故事。 下一个五年,猪圈见! 我就是那个在养猪场里敲代码的工程师,一年多前我和20位工程师去了四川的猪场,出发前总架构师慷慨激昂的说:同学们,中国的养猪产业将因为我们而改变。但到了猪场,发现根本不是那么回事:要个WIFI,没有;...
为什么程序猿都不愿意去外包?
分享外包的组织架构,盈利模式,亲身经历,以及根据一些外包朋友的反馈,写了这篇文章 ,希望对正在找工作的老铁有所帮助
Java校招入职华为,半年后我跑路了
何来 我,一个双非本科弟弟,有幸在 19 届的秋招中得到前东家华为(以下简称 hw)的赏识,当时秋招签订就业协议,说是入了某 java bg,之后一系列组织架构调整原因等等让人无法理解的神操作,最终毕业前夕,被通知调往其他 bg 做嵌入式开发(纯 C 语言)。 由于已至于校招末尾,之前拿到的其他 offer 又无法再收回,一时感到无力回天,只得默默接受。 毕业后,直接入职开始了嵌入式苦旅,由于从未...
立即提问