opencv3.1+cuda7.5+cmake3.5 编译错误

运行环境:win7 64位旗舰版。
重新编译opencv,该添加的库都添加了。但是还是出现了linn error!
编译的时候出现了:
frame_source.cpp.obj : error LNK2001: 无法解析的外部符号 "public: static class cv::cuda::GpuMat::Allocator * __cdecl cv::cuda::GpuMat::defaultAllocator(void)" (?defaultAllocator@GpuMat@cuda@cv@@SAPEAVAllocator@123@XZ)

1>optical_flow.cpp.obj : error LNK2001: 无法解析的外部符号 "public: static class cv::cuda::GpuMat::Allocator * __cdecl cv::cuda::GpuMat::defaultAllocator(void)" (?defaultAllocator@GpuMat@cuda@cv@@SAPEAVAllocator@123@XZ)

1>optical_flow.cpp.obj : error LNK2001: 无法解析的外部符号 "public: static class cv::cuda::GpuMat::Allocator * __cdecl cv::cuda::GpuMat::defaultAllocator(void)" (?defaultAllocator@GpuMat@cuda@cv@@SAPEAVAllocator@123@XZ)

类似这些总共2000度个错误。
求大神帮忙!搞了两天也没找出错误。
小弟在此先谢过了!

1个回答

旗舰版。
重新编译opencv,该添加的库都添加了。但是还是出现了linn error!
编译的时候出现了:
frame_source.cpp.obj : error LNK2001: 无法解析的外部符号 "public: static class cv::cuda::GpuMat::Allocator * __cdecl cv::cuda::GpuMat::defaultAllocator(void)" (?defaultAllocator@GpuMat@cuda@cv@@SAPEAVAllocator@123@XZ)
1>optical_flow.cpp.obj : error LNK2001: 无法解析的外部符号 "public: static class cv::cuda::GpuMat::Allocator * __cdecl cv::cuda::GpuMat::defaultAllocator(void)" (?defaultAllocator@GpuMat@cuda@cv@@SAPEAVAllocator@123@XZ)
1>optical_flow.cpp.obj : error LNK2001: 无法解析的外部符号 "public: static class cv::cuda::GpuMat::Allocator * __cdecl cv::cuda::GpuMat::defaultAllocator(void)" (?defaultAllocator@GpuMat@cuda@cv@@SAPEAVAllocator@123@XZ)

Csdn user default icon
上传中...
上传图片
插入图片
抄袭、复制答案,以达到刷声望分或其他目的的行为,在CSDN问答是严格禁止的,一经发现立刻封号。是时候展现真正的技术了!
其他相关推荐
opencv3.1+cuda7.5+cmake3.5 编译错误
运行环境:win7 64位旗舰版。 重新编译opencv,该添加的库都添加了。但是还是出现了linn error! 编译的时候出现了: frame_source.cpp.obj : error LNK2001: 无法解析的外部符号 "public: static class cv::cuda::GpuMat::Allocator * __cdecl cv::cuda::GpuMat::defaultAllocator(void)" (?defaultAllocator@GpuMat@cuda@cv@@SAPEAVAllocator@123@XZ) 1>optical_flow.cpp.obj : error LNK2001: 无法解析的外部符号 "public: static class cv::cuda::GpuMat::Allocator * __cdecl cv::cuda::GpuMat::defaultAllocator(void)" (?defaultAllocator@GpuMat@cuda@cv@@SAPEAVAllocator@123@XZ) 1>optical_flow.cpp.obj : error LNK2001: 无法解析的外部符号 "public: static class cv::cuda::GpuMat::Allocator * __cdecl cv::cuda::GpuMat::defaultAllocator(void)" (?defaultAllocator@GpuMat@cuda@cv@@SAPEAVAllocator@123@XZ) 类似这些总共2000度个错误。 求大神帮忙!搞了两天也没找出错误。 小弟在此先谢过了!
opencv3.1.0中没有opencv2\legacy\compat.hpp
opencv3.1.0中没有opencv2\legacy\compat.hpp 该如何解决 想用cvQueryHistValue_1D(,)该怎么办
vs2015 cmake编译opencv3.1+opencv_contrib报错
在OPENCV_EXTRA_MODULES_PATH,添加opencv_contrib目录后报错,求问是什么问题啊? CMake Error at /Users/Documents/opencv/source/opencv-3.2.0/cmake/OpenCVUtils.cmake:1045 (file): file DOWNLOAD cannot open file for write. Call Stack (most recent call first): /Users/Documents/opencv/source/opencv_contrib-master/modules/dnn/cmake/OpenCVFindLibProtobuf.cmake:32 (ocv_download) /Users/Documents/opencv/source/opencv_contrib-master/modules/dnn/CMakeLists.txt:5 (include) CMake Error at /Users/Documents/opencv/source/opencv-3.2.0/cmake/OpenCVUtils.cmake:1049 (message): Failed to download . Status= Call Stack (most recent call first): /Users/Documents/opencv/source/opencv_contrib-master/modules/dnn/cmake/OpenCVFindLibProtobuf.cmake:32 (ocv_download) /Users/Documents/opencv/source/opencv_contrib-master/modules/dnn/CMakeLists.txt:5 (include)
cuda加速的問題,opencv3.1.0+cuda8.0
使用的是opencv3.1.0+cuda8.0,但是make可以,run出錯。 nvidia@tegra-ubuntu:~$ cd project_wly nvidia@tegra-ubuntu:~/project_wly$ cmake . -- The C compiler identification is GNU 5.4.0 -- The CXX compiler identification is GNU 5.4.0 -- Check for working C compiler: /usr/bin/cc -- Check for working C compiler: /usr/bin/cc -- works -- Detecting C compiler ABI info -- Detecting C compiler ABI info - done -- Detecting C compile features -- Detecting C compile features - done -- Check for working CXX compiler: /usr/bin/c++ -- Check for working CXX compiler: /usr/bin/c++ -- works -- Detecting CXX compiler ABI info -- Detecting CXX compiler ABI info - done -- Detecting CXX compile features -- Detecting CXX compile features - done -- Configuring done -- Generating done -- Build files have been written to: /home/nvidia/project_wly nvidia@tegra-ubuntu:~/project_wly$ make Scanning dependencies of target project_wly [ 50%] Building CXX object CMakeFiles/project_wly.dir/project_wly.cpp.o [100%] Linking CXX executable project_wly [100%] Built target project_wly nvidia@tegra-ubuntu:~/project_wly$ ./project_wly **OpenCV Error: Gpu API call (invalid device symbol) in loadUMax, file /home/nvidia/opencv_3.1/opencv-3.1.0/modules/cudafeatures2d/src/cuda/orb.cu, line 148 terminate called after throwing an instance of 'cv::Exception' what(): /home/nvidia/opencv_3.1/opencv-3.1.0/modules/cudafeatures2d/src/cuda/orb.cu:148: error: (-217) invalid device symbol in function loadUMax** Aborted (core dumped) nvidia@tegra-ubuntu:~/project_wly$ 求教各位大神,怎麼解決這個問題?
cmake编译的opencv3.0.0生成的工程无法通过编译
我在windows下用cmake-gui编译opencv3.0(联合opencv contrib master), 生成的工程Opencv.sln在build的时候出现了许多下列类似的错误: ![图片说明](https://img-ask.csdn.net/upload/201602/17/1455675347_444915.png) 请问这是什么原因呢? 系统是windows10,vs2013
用cmake编译opencv3.0 时候出现的问题
CMake Error at CMakeLists.txt:88 (project): No CMAKE_C_COMPILER could be found. 这是什么问题啊! 求大神解决 我是win764位 刚下的opencv3.0 用cmake进行configure就出错 安装的是vs2010
opencv3.2与opencv 2.8 切换的问题
我的ubuntu系统原来安装了opencv2.8,现在由于实际需要,安装了opencv3.2。但是,opencv2.8还得继续保留。利用pkg-config --modversion opencv 查看opencv的版本,显示是3.2.0。原来(opencv2.8下),CMakeList文件是这样写的。 project(test) find_package(OpenCV REQUIRED) add_executable(test src/test.cpp) target_link_libraries(test ${OpenCV_LIBS}) cmake_minimum_required(VERSION 2.8) 我使用opencv3.2编译的时候,按照要求,我把路径给加上了。 project(test) find_package(OpenCV REQUIRED) set(OpenCV_DIR "/usr/local/opencv320/share/OpenCV") INCLUDE_DIRECTORIES(${OpenCV_INCLUDE_DIRS}) add_executable(test src/test.cpp) target_link_libraries(test ${OpenCV_LIBS}) cmake_minimum_required(VERSION 3.2) 但是显示错误:要求的opencv版本太高,当前运行版本为2.8。但是我用 pkg-config --modversion opencv 查看版本,显示的是3.2.0
关于opencv3.1的《xfeature2d》问题
在opencv3.1与vs2015配置下调用库<xfeature2d>的函数,发现opencv3.1没有这个库,请问怎么办?
opencv3.1.0交叉编译出错
我在给mini2440移植opencv3.1.0的时候,make编译opencv过程中出错了。log如下: CMakeFiles/opencv_perf_core.dir/perf/perf_math.cpp.obj: In function `cv::Mat::~Mat()': perf_math.cpp.text._ZN2cv3MatD1Ev[cv::Mat::~Mat()]+0x1c): undefined reference to `__sync_fetch_and_add_4' CMakeFiles/opencv_perf_core.dir/perf/perf_compare.cpp.obj: In function `Size_MatType_CmpType_compare:erfTestBody()': perf_compare.cpp.text._ZN28Size_MatType_CmpType_compare12PerfTestBodyEv+0x30c): undefined reference to `__sync_fetch_and_add_4' perf_compare.cpp.text._ZN28Size_MatType_CmpType_compare12PerfTestBodyEv+0x378): undefined reference to `__sync_fetch_and_add_4' perf_compare.cpp.text._ZN28Size_MatType_CmpType_compare12PerfTestBodyEv+0x3ec): undefined reference to `__sync_fetch_and_add_4' CMakeFiles/opencv_perf_core.dir/perf/perf_compare.cpp.obj: In function `Size_MatType_CmpType_compareScalar:erfTestBody()': perf_compare.cpp.text._ZN34Size_MatType_CmpType_compareScalar12PerfTestBodyEv+0x32c): undefined reference to `__sync_fetch_and_add_4' CMakeFiles/opencv_perf_core.dir/perf/perf_compare.cpp.obj:perf_compare.cpp.text._ZN34Size_MatType_CmpType_compareScalar12PerfTestBodyEv+0x3a0): more undefined references to `__sync_fetch_and_add_4' follow collect2: ld returned 1 exit status make[2]: *** [bin/opencv_perf_core] Error 1 make[1]: *** [modules/core/CMakeFiles/opencv_perf_core.dir/all] Error 2 make: *** [all] Error 2 我用的是Ubuntu14.04,32位虚拟机。 查网上说是CMAKE_C_FLAGS要设为-march=armv4t 可是我安装提示设置了CMAKE_C_FLAGS 和 CMAKE_CXX_FLAGS的值,错误还是没有消失。 我试过了opencv3.1。0和opencv3.2.0了,都会出现这个问题。因为项目需求要用到opencv3 所以只能自己编译最新版,,泪奔 有大神遇到过这个问题吗?
Ubuntu 16.04安装opencv 3.4.1出错
Ubuntu16.04安装opencv 3.4.1出错,请求大佬帮忙看下是啥问题,百度也找不出问题。log记录如下: Determining if the include file sys/videoio.h exists failed with the following output: Change Dir: /home/whitejiang/opencv-3.4.1/my_build_dir/CMakeFiles/CMakeTmp Run Build Command:"/usr/bin/make" "cmTC_f508d/fast" /usr/bin/make -f CMakeFiles/cmTC_f508d.dir/build.make CMakeFiles/cmTC_f508d.dir/build make[1]: Entering directory '/home/whitejiang/opencv-3.4.1/my_build_dir/CMakeFiles/CMakeTmp' Building C object CMakeFiles/cmTC_f508d.dir/CheckIncludeFile.c.o /usr/bin/cc -fsigned-char -W -Wall -Werror=return-type -Werror=non-virtual-dtor -Werror=address -Werror=sequence-point -Wformat -Werror=format-security -Wmissing-declarations -Wmissing-prototypes -Wstrict-prototypes -Wundef -Winit-self -Wpointer-arith -Wshadow -Wuninitialized -Winit-self -Wno-narrowing -Wno-comment -fdiagnostics-show-option -Wno-long-long -pthread -fomit-frame-pointer -ffunction-sections -fdata-sections -msse -msse2 -msse3 -fvisibility=hidden -O3 -DNDEBUG -fPIE -o CMakeFiles/cmTC_f508d.dir/CheckIncludeFile.c.o -c /home/whitejiang/opencv-3.4.1/my_build_dir/CMakeFiles/CMakeTmp/CheckIncludeFile.c /home/whitejiang/opencv-3.4.1/my_build_dir/CMakeFiles/CMakeTmp/CheckIncludeFile.c:1:25: fatal error: sys/videoio.h: 没有那个文件或目录 compilation terminated. CMakeFiles/cmTC_f508d.dir/build.make:65: recipe for target 'CMakeFiles/cmTC_f508d.dir/CheckIncludeFile.c.o' failed make[1]: *** [CMakeFiles/cmTC_f508d.dir/CheckIncludeFile.c.o] Error 1 make[1]: Leaving directory '/home/whitejiang/opencv-3.4.1/my_build_dir/CMakeFiles/CMakeTmp' Makefile:126: recipe for target 'cmTC_f508d/fast' failed make: *** [cmTC_f508d/fast] Error 2
cmake编译opencv3.2+opencv_contrib一直报错。。
一直会提示这个错,有大神知道原因吗,我把一些依赖包下载下来放固定目录里了。还是该提醒还提醒错。我用的是opencv3.2+vs2015。 CMake Error at H:/OpenCV/opencv/sources/cmake/OpenCVUtils.cmake:1005 (file): file MD5 failed to read file "H:/OpenCV/Library/3rdparty/protobuf/": Permission denied Call Stack (most recent call first): H:/OpenCV/opencv_contrib-master/modules/dnn/cmake/OpenCVFindLibProtobuf.cmake:32 (ocv_download) H:/OpenCV/opencv_contrib-master/modules/dnn/CMakeLists.txt:5 (include)![图片说明](http://forum.csdn.net/PointForum/ui/scripts/csdn/Plugin/003/monkey/11.gif)![图片说明](http://forum.csdn.net/PointForum/ui/scripts/csdn/Plugin/003/monkey/5.gif)
windows下cmake编译opencv3.1+opencv_contrib一直报错
错误如下,是在配置“OPENCV_EXTRA_MODULES_PATH” 这个时候报错的 CMake Error at C:/Users/wyq/Downloads/opencv/sources/cmake/OpenCVUtils.cmake:857 (file): file MD5 failed to read file "C:/Users/wyq/Downloads/opencv/opencv_contrib-master/3rdparty/tinydnn/": Permission denied Call Stack (most recent call first): C:/Users/wyq/Downloads/opencv/opencv_contrib-master/modules/dnn_modern/CMakeLists.txt:18 (ocv_download) Downloading ... CMake Error at C:/Users/wyq/Downloads/opencv/sources/cmake/OpenCVUtils.cmake:895 (file): file DOWNLOAD cannot open file for write. Call Stack (most recent call first): C:/Users/wyq/Downloads/opencv/opencv_contrib-master/modules/dnn_modern/CMakeLists.txt:18 (ocv_download) CMake Error at C:/Users/wyq/Downloads/opencv/sources/cmake/OpenCVUtils.cmake:899 (message): Failed to download . Status= Call Stack (most recent call first): C:/Users/wyq/Downloads/opencv/opencv_contrib-master/modules/dnn_modern/CMakeLists.txt:18 (ocv_download) Configuring incomplete, errors occurred! See also "C:/Users/wyq/Downloads/opencv/opencv_contrib-master/CMakeFiles/CMakeOutput.log". See also "C:/Users/wyq/Downloads/opencv/opencv_contrib-master/CMakeFiles/CMakeError.log".
配置QtCreator5.5.1与opencv3.3.1,执行mingw32-make出错。
windows7配置QtCreator5.5.1与opencv3.3.1,执行mingw32-make出错。 求大神解答!!!
windows环境下codeblocks17.12 用cmake配置opencv3.4.7出现如下错误
试了好多次了,参考了不少博主的文章编译,还是有错 ``` F:/mingw64/bin/../lib/gcc/x86_64-w64-mingw32/7.3.0/../../../../x86_64-w64-mingw32/bin/ld.exe: i386 architecture of input file `CMakeFiles\opencv_core.dir/objects.a(vs_version.rc.obj)' is incompatible with i386:x86-64 output collect2.exe: error: ld returned 1 exit status modules\core\CMakeFiles\opencv_core.dir\build.make:1843: recipe for target 'bin/libopencv_core340.dll' failed mingw32-make[2]: *** [bin/libopencv_core340.dll] Error 1 CMakeFiles\Makefile2:1686: recipe for target 'modules/core/CMakeFiles/opencv_core.dir/all' failed mingw32-make[1]: *** [modules/core/CMakeFiles/opencv_core.dir/all] Error 2 Makefile:161: recipe for target 'all' failed mingw32-make: *** [all] Error 2 ```
opencv3.1.0交叉编译 使用摄像头 编译出错
opencv3.1.0交叉编译: 宿主机:ubuntu 14.04 交叉编译工具:gcc-4.6.2-glibc-2.13-linaro 在使用Cmake-gui配置时,因为要使用摄像头(OV3640)取图像,进行图像处理,所以将Operating System填为Linux, 并将WITH_V4L勾选上,之后执行make命令,总是编译错误,提示许多的库找不到,如下图中所示; 如果将Operating System填为arm-linux,没有勾选WITH_V4L,则可以make编译通过,但在arm开发板上用OpenCV打不开摄像头,isOpened ()返回值是false。请帮忙分析问题原因,希望给提供些正确的解决办法,非常感激! ![勾选WITH_V4L 编译错误信息](https://img-ask.csdn.net/upload/201605/29/1464522128_617542.png)![勾选WITH_V4L 编译错误信息](https://img-ask.csdn.net/upload/201605/29/1464522146_811706.jpg) ![cmake-gui 配置为Linux](https://img-ask.csdn.net/upload/201605/30/1464565387_398821.png) ![cmake-gui 配置为arm-linux](https://img-ask.csdn.net/upload/201605/30/1464565406_575197.png)
VS2015+openCV3.2.0运行openCV3.2.0的samples运行不出来
为什么我运行openCV3.2.0的samples大部分都运行不出来,运行情况有以下几种,1、把CommandLineParser类注释掉了,直接读取路径,运行出来了,不过能运行出来的很少;2、大部分把CommandLineParser类注释掉了,直接读取路径,不显示错误,运行不出来;3、大部分直接运行,不显示错误,运行不出来。我是在VS2015+openCV3.2.0做的。谢谢大家告知!
Cmake 配置 Opencv3.0 出现问题
试了多次,用Cmake 配置Opencv 出现如下提示: CMake Error at CMakeLists.txt:98 (project): No CMAKE_CXX_COMPILER could be found. vs 为64位的vs 15;opencv3.2 求大神指导,捣鼓了几个小时不知道怎么解决!!!!
Ubuntu18.04配置OPENCV3.3.1时make报错
在给Ubuntu18.04下载编译openCV3.3.1时, 参照https://blog.csdn.net/zhaoxr233/article/details/90036824 在做到make那一步时,报了以下error,在网上查询无果,不知如何解决,烦请各位大佬指点 ``` Linking CXX executable ../../bin/opencv_visualisation ../../lib/libopencv_core.a(hal_internal.cpp.o):在函数‘lapack_gemm32f(float const*, unsigned long, float const*, unsigned long, float, float const*, unsigned long, float, float*, unsigned long, int, int, int, int)’中: hal_internal.cpp:(.text._Z14lapack_gemm32fPKfmS0_mfS0_mfPfmiiii+0x3d2):对‘cblas_sgemm(CBLAS_ORDER, CBLAS_TRANSPOSE, CBLAS_TRANSPOSE, int, int, int, float, float const*, int, float const*, int, float, float*, int)’未定义的引用 ............ ../../lib/libopencv_core.a(hal_internal.cpp.o):在函数‘lapack_gemm64fc(double const*, unsigned long, double const*, unsigned long, double, double const*, unsigned long, double, double*, unsigned long, int, int, int, int)’中: hal_internal.cpp:(.text._Z15lapack_gemm64fcPKdmS0_mdS0_mdPdmiiii+0x29e):对‘cblas_zgemm(CBLAS_ORDER, CBLAS_TRANSPOSE, CBLAS_TRANSPOSE, int, int, int, void const*, void const*, int, void const*, int, void const*, void*, int)’未定义的引用 hal_internal.cpp:(.text._Z15lapack_gemm64fcPKdmS0_mdS0_mdPdmiiii+0x2f5):对‘cblas_cgemm(CBLAS_ORDER, CBLAS_TRANSPOSE, CBLAS_TRANSPOSE, int, int, int, void const*, void const*, int, void const*, int, void const*, void*, int)’未定义的引用 collect2: error: ld returned 1 exit status apps/annotation/CMakeFiles/opencv_annotation.dir/build.make:119: recipe for target 'bin/opencv_annotation' failed make[2]: *** [bin/opencv_annotation] Error 1 CMakeFiles/Makefile2:4522: recipe for target 'apps/annotation/CMakeFiles/opencv_annotation.dir/all' failed make[1]: *** [apps/annotation/CMakeFiles/opencv_annotation.dir/all] Error 2 ```
终于明白阿里百度这样的大公司,为什么面试经常拿ThreadLocal考验求职者了
点击上面↑「爱开发」关注我们每晚10点,捕获技术思考和创业资源洞察什么是ThreadLocalThreadLocal是一个本地线程副本变量工具类,各个线程都拥有一份线程私...
《奇巧淫技》系列-python!!每天早上八点自动发送天气预报邮件到QQ邮箱
将代码部署服务器,每日早上定时获取到天气数据,并发送到邮箱。 也可以说是一个小人工智障。 思路可以运用在不同地方,主要介绍的是思路。
加快推动区块链技术和产业创新发展,2019可信区块链峰会在京召开
11月8日,由中国信息通信研究院、中国通信标准化协会、中国互联网协会、可信区块链推进计划联合主办,科技行者协办的2019可信区块链峰会将在北京悠唐皇冠假日酒店开幕。   区块链技术被认为是继蒸汽机、电力、互联网之后,下一代颠覆性的核心技术。如果说蒸汽机释放了人类的生产力,电力解决了人类基本的生活需求,互联网彻底改变了信息传递的方式,区块链作为构造信任的技术有重要的价值。   1...
阿里面试官问我:如何设计秒杀系统?我的回答让他比起大拇指
你知道的越多,你不知道的越多 点赞再看,养成习惯 GitHub上已经开源 https://github.com/JavaFamily 有一线大厂面试点脑图和个人联系方式,欢迎Star和指教 前言 Redis在互联网技术存储方面使用如此广泛,几乎所有的后端技术面试官都要在Redis的使用和原理方面对小伙伴们进行360°的刁难。 作为一个在互联网公司面一次拿一次Offer的面霸,打败了...
C语言魔塔游戏
很早就很想写这个,今天终于写完了。 游戏截图: 编译环境: VS2017 游戏需要一些图片,如果有想要的或者对游戏有什么看法的可以加我的QQ 2985486630 讨论,如果暂时没有回应,可以在博客下方留言,到时候我会看到。 下面我来介绍一下游戏的主要功能和实现方式 首先是玩家的定义,使用结构体,这个名字是可以自己改变的 struct gamerole { char n...
面试官问我:什么是消息队列?什么场景需要他?用了会出现什么问题?
你知道的越多,你不知道的越多 点赞再看,养成习惯 GitHub上已经开源 https://github.com/JavaFamily 有一线大厂面试点脑图、个人联系方式和人才交流群,欢迎Star和完善 前言 消息队列在互联网技术存储方面使用如此广泛,几乎所有的后端技术面试官都要在消息队列的使用和原理方面对小伙伴们进行360°的刁难。 作为一个在互联网公司面一次拿一次Offer的面霸...
Android性能优化(4):UI渲染机制以及优化
文章目录1. 渲染机制分析1.1 渲染机制1.2 卡顿现象1.3 内存抖动2. 渲染优化方式2.1 过度绘制优化2.1.1 Show GPU overdraw2.1.2 Profile GPU Rendering2.2 卡顿优化2.2.1 SysTrace2.2.2 TraceView 在从Android 6.0源码的角度剖析View的绘制原理一文中,我们了解到View的绘制流程有三个步骤,即m...
微服务中的Kafka与Micronaut
今天,我们将通过Apache Kafka主题构建一些彼此异步通信的微服务。我们使用Micronaut框架,它为与Kafka集成提供专门的库。让我们简要介绍一下示例系统的体系结构。我们有四个微型服务:订单服务,行程服务,司机服务和乘客服务。这些应用程序的实现非常简单。它们都有内存存储,并连接到同一个Kafka实例。 我们系统的主要目标是为客户安排行程。订单服务应用程序还充当网关。它接收来自客户的请求...
致 Python 初学者们!
作者| 许向武 责编 | 屠敏 出品 | CSDN 博客 前言 在 Python 进阶的过程中,相信很多同学应该大致上学习了很多 Python 的基础知识,也正在努力成长。在此期间,一定遇到了很多的困惑,对未来的学习方向感到迷茫。我非常理解你们所面临的处境。我从2007年开始接触 Python 这门编程语言,从2009年开始单一使用 Python 应对所有的开发工作,直至今...
究竟你适不适合买Mac?
我清晰的记得,刚买的macbook pro回到家,开机后第一件事情,就是上了淘宝网,花了500元钱,找了一个上门维修电脑的师傅,上门给我装了一个windows系统。。。。。。 表砍我。。。 当时买mac的初衷,只是想要个固态硬盘的笔记本,用来运行一些复杂的扑克软件。而看了当时所有的SSD笔记本后,最终决定,还是买个好(xiong)看(da)的。 已经有好几个朋友问我mba怎么样了,所以今天尽量客观...
程序员一般通过什么途径接私活?
二哥,你好,我想知道一般程序猿都如何接私活,我也想接,能告诉我一些方法吗? 上面是一个读者“烦不烦”问我的一个问题。其实不止是“烦不烦”,还有很多读者问过我类似这样的问题。 我接的私活不算多,挣到的钱也没有多少,加起来不到 20W。说实话,这个数目说出来我是有点心虚的,毕竟太少了,大家轻喷。但我想,恰好配得上“一般程序员”这个称号啊。毕竟苍蝇再小也是肉,我也算是有经验的人了。 唾弃接私活、做外...
字节跳动面试官这样问消息队列:分布式事务、重复消费、顺序消费,我整理了一下
你知道的越多,你不知道的越多 点赞再看,养成习惯 GitHub上已经开源 https://github.com/JavaFamily 有一线大厂面试点脑图、个人联系方式和人才交流群,欢迎Star和完善 前言 消息队列在互联网技术存储方面使用如此广泛,几乎所有的后端技术面试官都要在消息队列的使用和原理方面对小伙伴们进行360°的刁难。 作为一个在互联网公司面一次拿一次Offer的面霸...
Python爬虫爬取淘宝,京东商品信息
小编是一个理科生,不善长说一些废话。简单介绍下原理然后直接上代码。 使用的工具(Python+pycharm2019.3+selenium+xpath+chromedriver)其中要使用pycharm也可以私聊我selenium是一个框架可以通过pip下载 pip installselenium -ihttps://pypi.tuna.tsinghua.edu.cn/simple/ ...
阿里程序员写了一个新手都写不出的低级bug,被骂惨了。
这种新手都不会范的错,居然被一个工作好几年的小伙子写出来,差点被当场开除了。
Java工作4年来应聘要16K最后没要,细节如下。。。
前奏: 今天2B哥和大家分享一位前几天面试的一位应聘者,工作4年26岁,统招本科。 以下就是他的简历和面试情况。 基本情况: 专业技能: 1、&nbsp;熟悉Sping了解SpringMVC、SpringBoot、Mybatis等框架、了解SpringCloud微服务 2、&nbsp;熟悉常用项目管理工具:SVN、GIT、MAVEN、Jenkins 3、&nbsp;熟悉Nginx、tomca...
SpringBoot2.x系列教程(三十六)SpringBoot之Tomcat配置
Spring Boot默认内嵌的Tomcat为Servlet容器,关于Tomcat的所有属性都在ServerProperties配置类中。同时,也可以实现一些接口来自定义内嵌Servlet容器和内嵌Tomcat等的配置。 关于此配置,网络上有大量的资料,但都是基于SpringBoot1.5.x版本,并不适合当前最新版本。本文将带大家了解一下最新版本的使用。 ServerProperties的部分源...
Python绘图,圣诞树,花,爱心 | Turtle篇
每周每日,分享Python实战代码,入门资料,进阶资料,基础语法,爬虫,数据分析,web网站,机器学习,深度学习等等。 公众号回复【进群】沟通交流吧,QQ扫码进群学习吧 微信群 QQ群 1.画圣诞树 import turtle screen = turtle.Screen() screen.setup(800,600) circle = turtle.Turtle()...
作为一个程序员,CPU的这些硬核知识你必须会!
CPU对每个程序员来说,是个既熟悉又陌生的东西? 如果你只知道CPU是中央处理器的话,那可能对你并没有什么用,那么作为程序员的我们,必须要搞懂的就是CPU这家伙是如何运行的,尤其要搞懂它里面的寄存器是怎么一回事,因为这将让你从底层明白程序的运行机制。 随我一起,来好好认识下CPU这货吧 把CPU掰开来看 对于CPU来说,我们首先就要搞明白它是怎么回事,也就是它的内部构造,当然,CPU那么牛的一个东...
破14亿,Python分析我国存在哪些人口危机!
一、背景 二、爬取数据 三、数据分析 1、总人口 2、男女人口比例 3、人口城镇化 4、人口增长率 5、人口老化(抚养比) 6、各省人口 7、世界人口 四、遇到的问题 遇到的问题 1、数据分页,需要获取从1949-2018年数据,观察到有近20年参数:LAST20,由此推测获取近70年的参数可设置为:LAST70 2、2019年数据没有放上去,可以手动添加上去 3、将数据进行 行列转换 4、列名...
听说想当黑客的都玩过这个Monyer游戏(1~14攻略)
第零关 进入传送门开始第0关(游戏链接) 请点击链接进入第1关: 连接在左边→ ←连接在右边 看不到啊。。。。(只能看到一堆大佬做完的留名,也能看到菜鸡的我,在后面~~) 直接fn+f12吧 &lt;span&gt;连接在左边→&lt;/span&gt; &lt;a href="first.php"&gt;&lt;/a&gt; &lt;span&gt;←连接在右边&lt;/span&gt; o...
在家远程办公效率低?那你一定要收好这个「在家办公」神器!
相信大家都已经收到国务院延长春节假期的消息,接下来,在家远程办公可能将会持续一段时间。 但是问题来了。远程办公不是人在电脑前就当坐班了,相反,对于沟通效率,文件协作,以及信息安全都有着极高的要求。有着非常多的挑战,比如: 1在异地互相不见面的会议上,如何提高沟通效率? 2文件之间的来往反馈如何做到及时性?如何保证信息安全? 3如何规划安排每天工作,以及如何进行成果验收? ...... ...
作为一个程序员,内存和磁盘的这些事情,你不得不知道啊!!!
截止目前,我已经分享了如下几篇文章: 一个程序在计算机中是如何运行的?超级干货!!! 作为一个程序员,CPU的这些硬核知识你必须会! 作为一个程序员,内存的这些硬核知识你必须懂! 这些知识可以说是我们之前都不太重视的基础知识,可能大家在上大学的时候都学习过了,但是嘞,当时由于老师讲解的没那么有趣,又加上这些知识本身就比较枯燥,所以嘞,大家当初几乎等于没学。 再说啦,学习这些,也看不出来有什么用啊!...
这个世界上人真的分三六九等,你信吗?
偶然间,在知乎上看到一个问题 一时间,勾起了我深深的回忆。 以前在厂里打过两次工,做过家教,干过辅导班,做过中介。零下几度的晚上,贴过广告,满脸、满手地长冻疮。 再回首那段岁月,虽然苦,但让我学会了坚持和忍耐。让我明白了,在这个世界上,无论环境多么的恶劣,只要心存希望,星星之火,亦可燎原。 下文是原回答,希望能对你能有所启发。 如果我说,这个世界上人真的分三六九等,...
2020年全新Java学习路线图,含配套视频,学完即为中级Java程序员!!
新的一年来临,突如其来的疫情打破了平静的生活! 在家的你是否很无聊,如果无聊就来学习吧! 世上只有一种投资只赚不赔,那就是学习!!! 传智播客于2020年升级了Java学习线路图,硬核升级,免费放送! 学完你就是中级程序员,能更快一步找到工作! 一、Java基础 JavaSE基础是Java中级程序员的起点,是帮助你从小白到懂得编程的必经之路。 在Java基础板块中有6个子模块的学...
B 站上有哪些很好的学习资源?
哇说起B站,在小九眼里就是宝藏般的存在,放年假宅在家时一天刷6、7个小时不在话下,更别提今年的跨年晚会,我简直是跪着看完的!! 最早大家聚在在B站是为了追番,再后来我在上面刷欧美新歌和漂亮小姐姐的舞蹈视频,最近两年我和周围的朋友们已经把B站当作学习教室了,而且学习成本还免费,真是个励志的好平台ヽ(.◕ฺˇд ˇ◕ฺ;)ノ 下面我们就来盘点一下B站上优质的学习资源: 综合类 Oeasy: 综合...
爬取薅羊毛网站百度云资源
这是疫情期间无聊做的爬虫, 去获取暂时用不上的教程 import threading import time import pandas as pd import requests import re from threading import Thread, Lock # import urllib.request as request # req=urllib.request.Requ...
如何优雅地打印一个Java对象?
你好呀,我是沉默王二,一个和黄家驹一样身高,和刘德华一样颜值的程序员。虽然已经写了十多年的 Java 代码,但仍然觉得自己是个菜鸟(请允许我惭愧一下)。 在一个月黑风高的夜晚,我思前想后,觉得再也不能这么蹉跎下去了。于是痛下决心,准备通过输出的方式倒逼输入,以此来修炼自己的内功,从而进阶成为一名真正意义上的大神。与此同时,希望这些文章能够帮助到更多的读者,让大家在学习的路上不再寂寞、空虚和冷。 ...
雷火神山直播超两亿,Web播放器事件监听是怎么实现的?
Web播放器解决了在手机浏览器和PC浏览器上播放音视频数据的问题,让视音频内容可以不依赖用户安装App,就能进行播放以及在社交平台进行传播。在视频业务大数据平台中,播放数据的统计分析非常重要,所以Web播放器在使用过程中,需要对其内部的数据进行收集并上报至服务端,此时,就需要对发生在其内部的一些播放行为进行事件监听。 那么Web播放器事件监听是怎么实现的呢? 01 监听事件明细表 名...
3万字总结,Mysql优化之精髓
本文知识点较多,篇幅较长,请耐心学习 MySQL已经成为时下关系型数据库产品的中坚力量,备受互联网大厂的青睐,出门面试想进BAT,想拿高工资,不会点MySQL优化知识,拿offer的成功率会大大下降。 为什么要优化 系统的吞吐量瓶颈往往出现在数据库的访问速度上 随着应用程序的运行,数据库的中的数据会越来越多,处理时间会相应变慢 数据是存放在磁盘上的,读写速度无法和内存相比 如何优化 设计...
HTML5适合的情人节礼物有纪念日期功能
前言 利用HTML5,css,js实现爱心树 以及 纪念日期的功能 网页有播放音乐功能 以及打字倾诉感情的画面,非常适合情人节送给女朋友 具体的HTML代码 具体只要修改代码里面的男某某和女某某 文字段也可自行修改,还有代码下半部分的JS代码需要修改一下起始日期 注意月份为0~11月 也就是月份需要减一。 当然只有一部分HTML和JS代码不够运行的,文章最下面还附加了完整代码的下载地址 &lt;!...
Python新型冠状病毒疫情数据自动爬取+统计+发送报告+数据屏幕(三)发送篇
今天介绍的项目是使用 Itchat 发送统计报告 项目功能设计: 定时爬取疫情数据存入Mysql 进行数据分析制作疫情报告 使用itchat给亲人朋友发送分析报告 基于Django做数据屏幕 使用Tableau做数据分析 来看看最终效果 目前已经完成,预计2月12日前更新 使用 itchat 发送数据统计报告 itchat 是一个基于 web微信的一个框架,但微信官方并不允许使用这...
python沙箱逃逸
沙箱逃逸是CTF和实际场景中经常遇到的一种情况。需要利用python的特性来实现逃逸。本文详细介绍了关于python逃逸的基础以及一些构造payload方法,并且附加习题提供练习。
相关热词 c#导入fbx c#中屏蔽键盘某个键 c#正态概率密度 c#和数据库登陆界面设计 c# 高斯消去法 c# codedom c#读取cad文件文本 c# 控制全局鼠标移动 c# temp 目录 bytes初始化 c#
立即提问