mvn打包报错:Failed to load ApplicationContext

图片说明
ApplicationContext中扫描的包:


/context:component-scan

            springmvc.xml中扫描的包:
            <context:component-scan base-package="com.aa.controller" />

2个回答

图片说明
问题已解决,pom配置文件中没有配置加载resources,所以加载不到resources目录下面的配置文件!加上配置就好了!

错误比较愚蠢,还是新手对maven的理解不够深刻,仔细仔细再仔细一些就好了!

Csdn user default icon
上传中...
上传图片
插入图片
抄袭、复制答案,以达到刷声望分或其他目的的行为,在CSDN问答是严格禁止的,一经发现立刻封号。是时候展现真正的技术了!
其他相关推荐
maven打包测试不通过Failed to load ApplicationContext

Test set: mcode.MainTest ------------------------------------------------------------------------------- Tests run: 1, Failures: 0, Errors: 1, Skipped: 0, Time elapsed: 23.46 sec <<< FAILURE! test1(mcode.MainTest) Time elapsed: 23.101 sec <<< ERROR! java.lang.IllegalStateException: Failed to load ApplicationContext at org.springframework.test.context.CacheAwareContextLoaderDelegate.loadContext(CacheAwareContextLoaderDelegate.java:99) at org.springframework.test.context.DefaultTestContext.getApplicationContext(DefaultTestContext.java:101) at org.springframework.test.context.support.DependencyInjectionTestExecutionListener.injectDependencies(DependencyInjectionTestExecutionListener.java:109) at org.springframework.test.context.support.DependencyInjectionTestExecutionListener.prepareTestInstance(DependencyInjectionTestExecutionListener.java:75) at org.springframework.test.context.TestContextManager.prepareTestInstance(TestContextManager.java:319) at org.springframework.test.context.junit4.SpringJUnit4ClassRunner.createTest(SpringJUnit4ClassRunner.java:212) at org.springframework.test.context.junit4.SpringJUnit4ClassRunner$1.runReflectiveCall(SpringJUnit4ClassRunner.java:289) at org.junit.internal.runners.model.ReflectiveCallable.run(ReflectiveCallable.java:12) at org.springframework.test.context.junit4.SpringJUnit4ClassRunner.methodBlock(SpringJUnit4ClassRunner.java:291) at org.springframework.test.context.junit4.SpringJUnit4ClassRunner.runChild(SpringJUnit4ClassRunner.java:232) at org.springframework.test.context.junit4.SpringJUnit4ClassRunner.runChild(SpringJUnit4ClassRunner.java:89) at org.junit.runners.ParentRunner$3.run(ParentRunner.java:290) at org.junit.runners.ParentRunner$1.schedule(ParentRunner.java:71) at org.junit.runners.ParentRunner.runChildren(ParentRunner.java:288) at org.junit.runners.ParentRunner.access$000(ParentRunner.java:58) at org.junit.runners.ParentRunner$2.evaluate(ParentRunner.java:268) at org.springframework.test.context.junit4.statements.RunBeforeTestClassCallbacks.evaluate(RunBeforeTestClassCallbacks.java:61) at org.springframework.test.context.junit4.statements.RunAfterTestClassCallbacks.evaluate(RunAfterTestClassCallbacks.java:71) at org.junit.runners.ParentRunner.run(ParentRunner.java:363) at org.springframework.test.context.junit4.SpringJUnit4ClassRunner.run(SpringJUnit4ClassRunner.java:175) at org.apache.maven.surefire.junit4.JUnit4Provider.execute(JUnit4Provider.java:252) at org.apache.maven.surefire.junit4.JUnit4Provider.executeTestSet(JUnit4Provider.java:141) at org.apache.maven.surefire.junit4.JUnit4Provider.invoke(JUnit4Provider.java:112) at sun.reflect.NativeMethodAccessorImpl.invoke0(Native Method) at sun.reflect.NativeMethodAccessorImpl.invoke(NativeMethodAccessorImpl.java:62) at sun.reflect.DelegatingMethodAccessorImpl.invoke(DelegatingMethodAccessorImpl.java:43) at java.lang.reflect.Method.invoke(Method.java:498) at org.apache.maven.surefire.util.ReflectionUtils.invokeMethodWithArray(ReflectionUtils.java:189) at org.apache.maven.surefire.booter.ProviderFactory$ProviderProxy.invoke(ProviderFactory.java:165) at org.apache.maven.surefire.booter.ProviderFactory.invokeProvider(ProviderFactory.java:85) at org.apache.maven.surefire.booter.ForkedBooter.runSuitesInProcess(ForkedBooter.java:115) at org.apache.maven.surefire.booter.ForkedBooter.main(ForkedBooter.java:75) Caused by: org.springframework.beans.factory.BeanCreationException: Error creating bean with name 'operatorLog': Injection of resource dependencies failed; nested exception is org.springframework.beans.factory.BeanCreationException: Error creating bean with name 'sysLogService': Injection of resource dependencies failed; nested exception is org.springframework.beans.factory.BeanCreationException: Error creating bean with name 'sqlSessionFactory' defined in class path resource [spring-mybatis.xml]: Cannot resolve reference to bean 'dataSource' while setting bean property 'dataSource'; nested exception is org.springframework.beans.factory.BeanCreationException: Error creating bean with name 'dataSource' defined in class path resource [spring-mybatis.xml]: Invocation of init method failed; nested exception is com.mysql.jdbc.exceptions.jdbc4.CommunicationsException: Communications link failure

单元测试报 Failed to load ApplicationContext

java.lang.IllegalStateException: Failed to load ApplicationContext at org.springframework.test.context.cache.DefaultCacheAwareContextLoaderDelegate.loadContext(DefaultCacheAwareContextLoaderDelegate.java:124) at org.springframework.test.context.support.DefaultTestContext.getApplicationContext(DefaultTestContext.java:83) at org.springframework.test.context.web.ServletTestExecutionListener.setUpRequestContextIfNecessary(ServletTestExecutionListener.java:189) at org.springframework.test.context.web.ServletTestExecutionListener.prepareTestInstance(ServletTestExecutionListener.java:131) at org.springframework.test.context.TestContextManager.prepareTestInstance(TestContextManager.java:230) at org.springframework.test.context.junit4.SpringJUnit4ClassRunner.createTest(SpringJUnit4ClassRunner.java:228) at org.springframework.test.context.junit4.SpringJUnit4ClassRunner$1.runReflectiveCall(SpringJUnit4ClassRunner.java:287) at org.junit.internal.runners.model.ReflectiveCallable.run(ReflectiveCallable.java:12) at org.springframework.test.context.junit4.SpringJUnit4ClassRunner.methodBlock(SpringJUnit4ClassRunner.java:289) at org.springframework.test.context.junit4.SpringJUnit4ClassRunner.runChild(SpringJUnit4ClassRunner.java:247) at org.springframework.test.context.junit4.SpringJUnit4ClassRunner.runChild(SpringJUnit4ClassRunner.java:94) at org.junit.runners.ParentRunner$3.run(ParentRunner.java:290) at org.junit.runners.ParentRunner$1.schedule(ParentRunner.java:71) at org.junit.runners.ParentRunner.runChildren(ParentRunner.java:288) at org.junit.runners.ParentRunner.access$000(ParentRunner.java:58) at org.junit.runners.ParentRunner$2.evaluate(ParentRunner.java:268) at org.springframework.test.context.junit4.statements.RunBeforeTestClassCallbacks.evaluate(RunBeforeTestClassCallbacks.java:61) at org.springframework.test.context.junit4.statements.RunAfterTestClassCallbacks.evaluate(RunAfterTestClassCallbacks.java:70) at org.junit.runners.ParentRunner.run(ParentRunner.java:363) at org.springframework.test.context.junit4.SpringJUnit4ClassRunner.run(SpringJUnit4ClassRunner.java:191) at org.junit.runner.JUnitCore.run(JUnitCore.java:137) at com.intellij.rt.execution.junit.JUnitStarter.main(JUnitStarter.java:70) at sun.reflect.NativeMethodAccessorImpl.invoke0(Native Method) at sun.reflect.NativeMethodAccessorImpl.invoke(Unknown Source) at sun.reflect.DelegatingMethodAccessorImpl.invoke(Unknown Source) at java.lang.reflect.Method.invoke(Unknown Source) at com.intellij.rt.execution.application.AppMain.main(AppMain.java:147) Caused by: org.springframework.beans.factory.UnsatisfiedDependencyException: Error creating bean with name 'userDAO' defined in file [D:\wenda\target\classes\com\company\wenda\dao\UserDAO.class]: Unsatisfied dependency expressed through bean property 'sqlSessionFactory'; nested exception is org.springframework.beans.factory.BeanCreationException: Error creating bean with name 'sqlSessionFactory' defined in class path resource [org/mybatis/spring/boot/autoconfigure/MybatisAutoConfiguration.class]: Bean instantiation via factory method failed; nested exception is org.springframework.beans.BeanInstantiationException: Failed to instantiate [org.apache.ibatis.session.SqlSessionFactory]: Factory method 'sqlSessionFactory' threw exception; nested exception is org.apache.ibatis.builder.BuilderException: Error creating document instance. Cause: java.io.FileNotFoundException: http://www.mybatis.org/dtd/mybatis-is3-config.dtd at org.springframework.beans.factory.support.AbstractAutowireCapableBeanFactory.autowireByType(AbstractAutowireCapableBeanFactory.java:1357) at org.springframework.beans.factory.support.AbstractAutowireCapableBeanFactory.populateBean(AbstractAutowireCapableBeanFactory.java:1249) at org.springframework.context.support.AbstractApplicationContext.refresh(AbstractApplicationContext.java:543) at org.springframework.boot.SpringApplication.refresh(SpringApplication.java:762) at org.springframework.boot.SpringApplication.refreshContext(SpringApplication.java:372) at org.springframework.boot.SpringApplication.run(SpringApplication.java:316) at org.springframework.boot.test.context.SpringBootContextLoader.loadContext(SpringBootContextLoader.java:111) at org.springframework.test.context.cache.DefaultCacheAwareContextLoaderDelegate.loadContextInternal(DefaultCacheAwareContextLoaderDelegate.java:98) at org.springframework.test.context.cache.DefaultCacheAwareContextLoaderDelegate.loadContext(DefaultCacheAwareContextLoaderDelegate.java:116) ... 29 more Caused by: org.springframework.beans.factory.BeanCreationException: Error creating bean with name 'sqlSessionFactory' defined in class path resource [org/mybatis/spring/boot/autoconfigure/MybatisAutoConfiguration.class]: Bean instantiation via factory method failed; nested exception is org.springframework.beans.BeanInstantiationException: Failed to instantiate [org.apache.ibatis.session.SqlSessionFactory]: Factory method 'sqlSessionFactory' threw exception; nested exception is org.apache.ibatis.builder.BuilderException: Error creating document instance. Cause: java.io.FileNotFoundException: http://www.mybatis.org/dtd/mybatis-is3-config.dtd at org.springframework.beans.factory.support.ConstructorResolver.instantiateUsingFactoryMethod(ConstructorResolver.java:599) at org.springframework.beans.factory.support.AbstractAutowireCapableBeanFactory.instantiateUsingFactoryMethod(AbstractAutowireCapableBeanFactory.java:1173) at org.springframework.beans.factory.support.AbstractAutowireCapableBeanFactory.createBeanInstance(AbstractAutowireCapableBeanFactory.java:1067) at org.springframework.beans.factory.support.AbstractAutowireCapableBeanFactory.doCreateBean(AbstractAutowireCapableBeanFactory.java:513) at org.springframework.beans.factory.support.AbstractBeanFactory.doGetBean(AbstractBeanFactory.java:302) at org.springframework.beans.factory.support.AbstractBeanFactory.getBean(AbstractBeanFactory.java:202) at org.springframework.beans.factory.config.DependencyDescriptor.resolveCandidate(DependencyDescriptor.java:208) at org.springframework.beans.factory.support.DefaultListableBeanFactory.doResolveDependency(DefaultListableBeanFactory.java:1138) ... 45 more Caused by: org.springframework.beans.BeanInstantiationException: Failed to instantiate [org.apache.ibatis.session.SqlSessionFactory]: Factory method 'sqlSessionFactory' threw exception; nested exception is org.apache.ibatis.builder.BuilderException: Error creating document instance. Cause: java.io.FileNotFoundException: http://www.mybatis.org/dtd/mybatis-is3-config.dtd at org.springframework.beans.factory.support.SimpleInstantiationStrategy.instantiate(SimpleInstantiationStrategy.java:189) at org.springframework.beans.factory.support.ConstructorResolver.instantiateUsingFactoryMethod(ConstructorResolver.java:588) ... 57 more Caused by: org.apache.ibatis.builder.BuilderException: Error creating document instance. Cause: java.io.FileNotFoundException: http://www.mybatis.org/dtd/mybatis-is3-config.dtd at org.apache.ibatis.parsing.XPathParser.createDocument(XPathParser.java:259) at org.apache.ibatis.parsing.XPathParser.<init>(XPathParser.java:125) at org.apache.ibatis.builder.xml.XMLConfigBuilder.<init>(XMLConfigBuilder.java:78) at org.mybatis.spring.SqlSessionFactoryBean.buildSqlSessionFactory(SqlSessionFactoryBean.java:407) at org.mybatis.spring.SqlSessionFactoryBean.afterPropertiesSet(SqlSessionFactoryBean.java:381) at org.mybatis.spring.SqlSessionFactoryBean.getObject(SqlSessionFactoryBean.java:546) at org.mybatis.spring.boot.autoconfigure.MybatisAutoConfiguration.sqlSessionFactory(MybatisAutoConfiguration.java:130) at org.mybatis.spring.boot.autoconfigure.MybatisAutoConfiguration$$EnhancerBySpringCGLIB$$7d9dd6a.CGLIB$sqlSessionFactory$2(<generated>) at org.mybatis.spring.boot.autoconfigure.MybatisAutoConfiguration$$EnhancerBySpringCGLIB$$7d9dd6a$$FastClassBySpringCGLIB$$d84bd449.invoke(<generated>) at org.springframework.cglib.proxy.MethodProxy.invokeSuper(MethodProxy.java:228) at org.springframework.context.annotation.ConfigurationClassEnhancer$BeanMethodInterceptor.intercept(ConfigurationClassEnhancer.java:358) at org.mybatis.spring.boot.autoconfigure.MybatisAutoConfiguration$$EnhancerBySpringCGLIB$$7d9dd6a.sqlSessionFactory(<generated>) at sun.reflect.NativeMethodAccessorImpl.invoke0(Native Method) at sun.reflect.NativeMethodAccessorImpl.invoke(Unknown Source) at sun.reflect.DelegatingMethodAccessorImpl.invoke(Unknown Source) at java.lang.reflect.Method.invoke(Unknown Source) at org.springframework.beans.factory.support.SimpleInstantiationStrategy.instantiate(SimpleInstantiationStrategy.java:162) ... 58 more Caused by: java.io.FileNotFoundException: http://www.mybatis.org/dtd/mybatis-is3-config.dtd at sun.net.www.protocol.http.HttpURLConnection.getInputStream0(Unknown Source) at sun.net.www.protocol.http.HttpURLConnection.getInputStream(Unknown Source) at com.sun.org.apache.xerces.internal.impl.XMLEntityManager.setupCurrentEntity(Unknown Source) at com.sun.org.apache.xerces.internal.impl.XMLEntityManager.startEntity(Unknown Source) at com.sun.org.apache.xerces.internal.impl.XMLEntityManager.startDTDEntity(Unknown Source) at com.sun.org.apache.xerces.internal.impl.XMLDTDScannerImpl.setInputSource(Unknown Source) at com.sun.org.apache.xerces.internal.impl.XMLDocumentFragmentScannerImpl.scanDocument(Unknown Source) at com.sun.org.apache.xerces.internal.parsers.XMLParser.parse(Unknown Source) at com.sun.org.apache.xerces.internal.parsers.DOMParser.parse(Unknown Source) at com.sun.org.apache.xerces.internal.jaxp.DocumentBuilderImpl.parse(Unknown Source) at org.apache.ibatis.parsing.XPathParser.createDocument(XPathParser.java:257) ... 74 more 请问下大家错在哪

通过spring + junit进行单元测试,报配置文件找不到Failed to load ApplicationContext

各位大侠,我通过spring + junit配置想进行单元测试,可以运行测试脚本时,系统报以下错误,可我配置文件路径这些明明都是对的啊,文件也确实存在,他为什么还报文件找不到呢,求解决? java.lang.IllegalStateException: Failed to load ApplicationContext at org.springframework.test.context.TestContext.getApplicationContext(TestContext.java:201) at org.springframework.test.context.support.DependencyInjectionTestExecutionListener.injectDependencies(DependencyInjectionTestExecutionListener.java:109) at org.springframework.test.context.support.DependencyInjectionTestExecutionListener.prepareTestInstance(DependencyInjectionTestExecutionListener.java:75) at org.springframework.test.context.TestContextManager.prepareTestInstance(TestContextManager.java:255) at org.springframework.test.context.junit4.SpringJUnit4ClassRunner.createTest(SpringJUnit4ClassRunner.java:111) at org.springframework.test.context.junit4.SpringJUnit4ClassRunner.invokeTestMethod(SpringJUnit4ClassRunner.java:148) at org.junit.internal.runners.JUnit4ClassRunner.runMethods(JUnit4ClassRunner.java:51) at org.junit.internal.runners.JUnit4ClassRunner$1.run(JUnit4ClassRunner.java:44) at org.junit.internal.runners.ClassRoadie.runUnprotected(ClassRoadie.java:27) at org.junit.internal.runners.ClassRoadie.runProtected(ClassRoadie.java:37) at org.junit.internal.runners.JUnit4ClassRunner.run(JUnit4ClassRunner.java:42) at org.springframework.test.context.junit4.SpringJUnit4ClassRunner.run(SpringJUnit4ClassRunner.java:97) at org.eclipse.jdt.internal.junit4.runner.JUnit4TestReference.run(JUnit4TestReference.java:38) at org.eclipse.jdt.internal.junit.runner.TestExecution.run(TestExecution.java:38) at org.eclipse.jdt.internal.junit.runner.RemoteTestRunner.runTests(RemoteTestRunner.java:460) at org.eclipse.jdt.internal.junit.runner.RemoteTestRunner.runTests(RemoteTestRunner.java:673) at org.eclipse.jdt.internal.junit.runner.RemoteTestRunner.run(RemoteTestRunner.java:386) at org.eclipse.jdt.internal.junit.runner.RemoteTestRunner.main(RemoteTestRunner.java:196) Caused by: org.springframework.beans.factory.parsing.BeanDefinitionParsingException: Configuration problem: Failed to import bean definitions from URL location [classpath:D:/My Java Proc/workspace_fd/jjxt/WebRoot/WEB-INF/applicationContext-commen.xml] Offending resource: class path resource [com/junitTestCase/ListCollentTest-context.xml]; nested exception is org.springframework.beans.factory.BeanDefinitionStoreException: IOException parsing XML document from class path resource [D:/My Java Proc/workspace_fd/jjxt/WebRoot/WEB-INF/applicationContext-commen.xml]; nested exception is java.io.FileNotFoundException: class path resource [D:/My Java Proc/workspace_fd/jjxt/WebRoot/WEB-INF/applicationContext-commen.xml] cannot be opened because it does not exist at org.springframework.beans.factory.parsing.FailFastProblemReporter.error(FailFastProblemReporter.java:68) at org.springframework.beans.factory.parsing.ReaderContext.error(ReaderContext.java:85) at org.springframework.beans.factory.parsing.ReaderContext.error(ReaderContext.java:76) at org.springframework.beans.factory.xml.DefaultBeanDefinitionDocumentReader.importBeanDefinitionResource(DefaultBeanDefinitionDocumentReader.java:182) at org.springframework.beans.factory.xml.DefaultBeanDefinitionDocumentReader.parseDefaultElement(DefaultBeanDefinitionDocumentReader.java:147) at org.springframework.beans.factory.xml.DefaultBeanDefinitionDocumentReader.parseBeanDefinitions(DefaultBeanDefinitionDocumentReader.java:132) at org.springframework.beans.factory.xml.DefaultBeanDefinitionDocumentReader.registerBeanDefinitions(DefaultBeanDefinitionDocumentReader.java:92) at org.springframework.beans.factory.xml.XmlBeanDefinitionReader.registerBeanDefinitions(XmlBeanDefinitionReader.java:507) at org.springframework.beans.factory.xml.XmlBeanDefinitionReader.doLoadBeanDefinitions(XmlBeanDefinitionReader.java:398) at org.springframework.beans.factory.xml.XmlBeanDefinitionReader.loadBeanDefinitions(XmlBeanDefinitionReader.java:342) at org.springframework.beans.factory.xml.XmlBeanDefinitionReader.loadBeanDefinitions(XmlBeanDefinitionReader.java:310) at org.springframework.beans.factory.support.AbstractBeanDefinitionReader.loadBeanDefinitions(AbstractBeanDefinitionReader.java:143) at org.springframework.beans.factory.support.AbstractBeanDefinitionReader.loadBeanDefinitions(AbstractBeanDefinitionReader.java:178) at org.springframework.beans.factory.support.AbstractBeanDefinitionReader.loadBeanDefinitions(AbstractBeanDefinitionReader.java:149) at org.springframework.beans.factory.support.AbstractBeanDefinitionReader.loadBeanDefinitions(AbstractBeanDefinitionReader.java:212) at org.springframework.test.context.support.AbstractGenericContextLoader.loadContext(AbstractGenericContextLoader.java:81) at org.springframework.test.context.support.AbstractGenericContextLoader.loadContext(AbstractGenericContextLoader.java:42) at org.springframework.test.context.TestContext.loadApplicationContext(TestContext.java:173) at org.springframework.test.context.TestContext.getApplicationContext(TestContext.java:197) ... 17 more Caused by: org.springframework.beans.factory.BeanDefinitionStoreException: IOException parsing XML document from class path resource [D:/My Java Proc/workspace_fd/jjxt/WebRoot/WEB-INF/applicationContext-commen.xml]; nested exception is java.io.FileNotFoundException: class path resource [D:/My Java Proc/workspace_fd/jjxt/WebRoot/WEB-INF/applicationContext-commen.xml] cannot be opened because it does not exist at org.springframework.beans.factory.xml.XmlBeanDefinitionReader.loadBeanDefinitions(XmlBeanDefinitionReader.java:349) at org.springframework.beans.factory.xml.XmlBeanDefinitionReader.loadBeanDefinitions(XmlBeanDefinitionReader.java:310) at org.springframework.beans.factory.support.AbstractBeanDefinitionReader.loadBeanDefinitions(AbstractBeanDefinitionReader.java:143) at org.springframework.beans.factory.support.AbstractBeanDefinitionReader.loadBeanDefinitions(AbstractBeanDefinitionReader.java:178) at org.springframework.beans.factory.xml.DefaultBeanDefinitionDocumentReader.importBeanDefinitionResource(DefaultBeanDefinitionDocumentReader.java:174) ... 32 more Caused by: java.io.FileNotFoundException: class path resource [D:/My Java Proc/workspace_fd/jjxt/WebRoot/WEB-INF/applicationContext-commen.xml] cannot be opened because it does not exist at org.springframework.core.io.ClassPathResource.getInputStream(ClassPathResource.java:143) at org.springframework.beans.factory.xml.XmlBeanDefinitionReader.loadBeanDefinitions(XmlBeanDefinitionReader.java:336) ... 36 more <?xml version="1.0" encoding="UTF-8" ?> <beans xmlns="http://www.springframework.org/schema/beans" xmlns:xsi="http://www.w3.org/2001/XMLSchema-instance" xsi:schemaLocation="http://www.springframework.org/schema/beans http://www.springframework.org/schema/beans/spring-beans-2.5.xsd"> <!-- ① 引入清单1定义的Spring配置文件 --> <import resource="classpath:D:/My Java Proc/workspace_fd/jjxt/WebRoot/WEB-INF/applicationContext-dataSource.xml"/> <import resource="classpath:D:/My Java Proc/workspace_fd/jjxt/WebRoot/WEB-INF/applicationContext-commen.xml"/> <import resource="classpath:D:/My Java Proc/workspace_fd/jjxt/WebRoot/WEB-INF/applicationContext-model.xml"/> </beans>

maven项目报错:找不到applicationContext.xml

myeclipse2016 maven创建的ssm项目,老是报找不到applicationContext.xml。可是我根本没有这个配置文件啊,我用其他的命名的!关键是还影响使用! 严重: Exception sending context initialized event to listener instance of class org.springframework.web.context.ContextLoaderListener org.springframework.beans.factory.BeanDefinitionStoreException: IOException parsing XML document from ServletContext resource [/classpth:applicationContext.xml]; nested exception is java.io.FileNotFoundException: Could not open ServletContext resource [/classpth:applicationContext.xml] at org.springframework.beans.factory.xml.XmlBeanDefinitionReader.loadBeanDefinitions(XmlBeanDefinitionReader.java:341) at org.springframework.beans.factory.xml.XmlBeanDefinitionReader.loadBeanDefinitions(XmlBeanDefinitionReader.java:302) at org.springframework.beans.factory.support.AbstractBeanDefinitionReader.loadBeanDefinitions(AbstractBeanDefinitionReader.java:174) at org.springframework.beans.factory.support.AbstractBeanDefinitionReader.loadBeanDefinitions(AbstractBeanDefinitionReader.java:209) at org.springframework.beans.factory.support.AbstractBeanDefinitionReader.loadBeanDefinitions(AbstractBeanDefinitionReader.java:180) at org.springframework.web.context.support.XmlWebApplicationContext.loadBeanDefinitions(XmlWebApplicationContext.java:125) at org.springframework.web.context.support.XmlWebApplicationContext.loadBeanDefinitions(XmlWebApplicationContext.java:94) at org.springframework.context.support.AbstractRefreshableApplicationContext.refreshBeanFactory(AbstractRefreshableApplicationContext.java:130) at org.springframework.context.support.AbstractApplicationContext.obtainFreshBeanFactory(AbstractApplicationContext.java:537) at org.springframework.context.support.AbstractApplicationContext.refresh(AbstractApplicationContext.java:451) at org.springframework.web.context.ContextLoader.configureAndRefreshWebApplicationContext(ContextLoader.java:410) at org.springframework.web.context.ContextLoader.initWebApplicationContext(ContextLoader.java:306) at org.springframework.web.context.ContextLoaderListener.contextInitialized(ContextLoaderListener.java:112) at org.apache.catalina.core.StandardContext.listenerStart(StandardContext.java:4994) at org.apache.catalina.core.StandardContext.startInternal(StandardContext.java:5492) at org.apache.catalina.util.LifecycleBase.start(LifecycleBase.java:150) at org.apache.catalina.core.ContainerBase.addChildInternal(ContainerBase.java:901) at org.apache.catalina.core.ContainerBase.addChild(ContainerBase.java:877) at org.apache.catalina.core.StandardHost.addChild(StandardHost.java:649) at org.apache.catalina.startup.HostConfig.deployDirectory(HostConfig.java:1245) at org.apache.catalina.startup.HostConfig$DeployDirectory.run(HostConfig.java:1895) at java.util.concurrent.Executors$RunnableAdapter.call(Executors.java:511) at java.util.concurrent.FutureTask.run(FutureTask.java:266) at java.util.concurrent.ThreadPoolExecutor.runWorker(ThreadPoolExecutor.java:1149) at java.util.concurrent.ThreadPoolExecutor$Worker.run(ThreadPoolExecutor.java:624) at java.lang.Thread.run(Thread.java:748) Caused by: java.io.FileNotFoundException: Could not open ServletContext resource [/classpth:applicationContext.xml] at org.springframework.web.context.support.ServletContextResource.getInputStream(ServletContextResource.java:140) at org.springframework.beans.factory.xml.XmlBeanDefinitionReader.loadBeanDefinitions(XmlBeanDefinitionReader.java:328) ... 25 more 八月 18, 2017 11:43:45 下午 org.apache.catalina.core.StandardContext startInternal 严重: Error listenerStart 八月 18, 2017 11:43:45 下午 org.apache.catalina.core.StandardContext startInternal 严重: Context [/ssm] startup failed due to previous errors 八月 18, 2017 11:43:45 下午 org.apache.catalina.core.ApplicationContext log 信息: Closing Spring root WebApplicationContext 八月 18, 2017 11:43:45 下午 org.apache.catalina.core.StandardContext listenerStop 严重: Exception sending context destroyed event to listener instance of class org.springframework.web.context.ContextLoaderListener java.lang.IllegalStateException: BeanFactory not initialized or already closed - call 'refresh' before accessing beans via the ApplicationContext at org.springframework.context.support.AbstractRefreshableApplicationContext.getBeanFactory(AbstractRefreshableApplicationContext.java:171) at org.springframework.context.support.AbstractApplicationContext.destroyBeans(AbstractApplicationContext.java:1090) at org.springframework.context.support.AbstractApplicationContext.doClose(AbstractApplicationContext.java:1064) at org.springframework.context.support.AbstractApplicationContext.close(AbstractApplicationContext.java:1010) at org.springframework.web.context.ContextLoader.closeWebApplicationContext(ContextLoader.java:586) at org.springframework.web.context.ContextLoaderListener.contextDestroyed(ContextLoaderListener.java:143) at org.apache.catalina.core.StandardContext.listenerStop(StandardContext.java:5035) at org.apache.catalina.core.StandardContext.stopInternal(StandardContext.java:5687) at org.apache.catalina.util.LifecycleBase.stop(LifecycleBase.java:232) at org.apache.catalina.util.LifecycleBase.start(LifecycleBase.java:160) at org.apache.catalina.core.ContainerBase.addChildInternal(ContainerBase.java:901) at org.apache.catalina.core.ContainerBase.addChild(ContainerBase.java:877) at org.apache.catalina.core.StandardHost.addChild(StandardHost.java:649) at org.apache.catalina.startup.HostConfig.deployDirectory(HostConfig.java:1245) at org.apache.catalina.startup.HostConfig$DeployDirectory.run(HostConfig.java:1895) at java.util.concurrent.Executors$RunnableAdapter.call(Executors.java:511) at java.util.concurrent.FutureTask.run(FutureTask.java:266) at java.util.concurrent.ThreadPoolExecutor.runWorker(ThreadPoolExecutor.java:1149) at java.util.concurrent.ThreadPoolExecutor$Worker.run(ThreadPoolExecutor.java:624) at java.lang.Thread.run(Thread.java:748)

mvn help:system报错,求大神解决

[INFO] Scanning for projects... [WARNING] The POM for org.apache.maven.plugins:maven-deploy-plugin:jar:2.7 is missing, no dependency information available Downloading: http://acooly.wicp.net/nexus/content/groups/public/org/apache/maven/plugins/maven-site-plugin/3.3/maven-site-plugin-3.3.pom 还有一系列与这个类似的警告,最后build failuer

dubbo-admin源码用mvn打包报错,应该怎么解决?

![图片说明](https://img-ask.csdn.net/upload/201901/22/1548165439_692445.png)

执行mvn sonar:sonar报错

[ERROR] Failed to execute goal org.sonarsource.scanner.maven:sonar-maven-plugin:3.3.0.603:sonar (default-cli) on project edu-common: Unable to register extension org.sonar.plugins.checkstyle.CheckstyleExecutor: Lorg/sonar/plugins/java/api/JavaResourceLocator;: org.sonar.plugins.java.api.JavaResourceLocator -> [Help 1] org.apache.maven.lifecycle.LifecycleExecutionException: Failed to execute goal org.sonarsource.scanner.maven:sonar-maven-plugin:3.3.0.603:sonar (default-cli) on project edu-common: Unable to register extension org.sonar.plugins.checkstyle.CheckstyleExecutor at org.apache.maven.lifecycle.internal.MojoExecutor.execute(MojoExecutor.java:212) at org.apache.maven.lifecycle.internal.MojoExecutor.execute(MojoExecutor.java:153) at org.apache.maven.lifecycle.internal.MojoExecutor.execute(MojoExecutor.java:145) at org.apache.maven.lifecycle.internal.LifecycleModuleBuilder.buildProject(LifecycleModuleBuilder.java:116) at org.apache.maven.lifecycle.internal.LifecycleModuleBuilder.buildProject(LifecycleModuleBuilder.java:80) at org.apache.maven.lifecycle.internal.builder.singlethreaded.SingleThreadedBuilder.build(SingleThreadedBuilder.java:51) at org.apache.maven.lifecycle.internal.LifecycleStarter.execute(LifecycleStarter.java:128) at org.apache.maven.DefaultMaven.doExecute(DefaultMaven.java:307) at org.apache.maven.DefaultMaven.doExecute(DefaultMaven.java:193) at org.apache.maven.DefaultMaven.execute(DefaultMaven.java:106) at org.apache.maven.cli.MavenCli.execute(MavenCli.java:863) at org.apache.maven.cli.MavenCli.doMain(MavenCli.java:288) at org.apache.maven.cli.MavenCli.main(MavenCli.java:199) at sun.reflect.NativeMethodAccessorImpl.invoke0(Native Method) at sun.reflect.NativeMethodAccessorImpl.invoke(NativeMethodAccessorImpl.java:62) at sun.reflect.DelegatingMethodAccessorImpl.invoke(DelegatingMethodAccessorImpl.java:43) at java.lang.reflect.Method.invoke(Method.java:498) at org.codehaus.plexus.classworlds.launcher.Launcher.launchEnhanced(Launcher.java:289) at org.codehaus.plexus.classworlds.launcher.Launcher.launch(Launcher.java:229) at org.codehaus.plexus.classworlds.launcher.Launcher.mainWithExitCode(Launcher.java:415) at org.codehaus.plexus.classworlds.launcher.Launcher.main(Launcher.java:356) Caused by: org.apache.maven.plugin.MojoExecutionException: Unable to register extension org.sonar.plugins.checkstyle.CheckstyleExecutor at org.sonarsource.scanner.maven.bootstrap.ExceptionHandling.handle(ExceptionHandling.java:36) at org.sonarsource.scanner.maven.bootstrap.ScannerBootstrapper.execute(ScannerBootstrapper.java:80) at org.sonarsource.scanner.maven.SonarQubeMojo.execute(SonarQubeMojo.java:139) at org.apache.maven.plugin.DefaultBuildPluginManager.executeMojo(DefaultBuildPluginManager.java:134) at org.apache.maven.lifecycle.internal.MojoExecutor.execute(MojoExecutor.java:207) ... 20 more Caused by: java.lang.IllegalStateException: Unable to register extension org.sonar.plugins.checkstyle.CheckstyleExecutor at org.sonar.core.platform.ComponentContainer.addExtension(ComponentContainer.java:248) at org.sonar.batch.bootstrap.ExtensionInstaller.doInstall(ExtensionInstaller.java:76) at org.sonar.batch.bootstrap.ExtensionInstaller.install(ExtensionInstaller.java:57) at org.sonar.batch.scan.ModuleScanContainer.addExtensions(ModuleScanContainer.java:179) at org.sonar.batch.scan.ModuleScanContainer.doBeforeStart(ModuleScanContainer.java:95) at org.sonar.core.platform.ComponentContainer.startComponents(ComponentContainer.java:140) at org.sonar.core.platform.ComponentContainer.execute(ComponentContainer.java:127) at org.sonar.batch.scan.ProjectScanContainer.scan(ProjectScanContainer.java:241) at org.sonar.batch.scan.ProjectScanContainer.scanRecursively(ProjectScanContainer.java:236) at org.sonar.batch.scan.ProjectScanContainer.doAfterStart(ProjectScanContainer.java:226) at org.sonar.core.platform.ComponentContainer.startComponents(ComponentContainer.java:142) at org.sonar.core.platform.ComponentContainer.execute(ComponentContainer.java:127) at org.sonar.batch.task.ScanTask.execute(ScanTask.java:47) at org.sonar.batch.task.TaskContainer.doAfterStart(TaskContainer.java:86) at org.sonar.core.platform.ComponentContainer.startComponents(ComponentContainer.java:142) at org.sonar.core.platform.ComponentContainer.execute(ComponentContainer.java:127) at org.sonar.batch.bootstrap.GlobalContainer.executeTask(GlobalContainer.java:106) at org.sonar.batch.bootstrapper.Batch.executeTask(Batch.java:119) at org.sonarsource.scanner.api.internal.batch.BatchIsolatedLauncher.execute(BatchIsolatedLauncher.java:63) at sun.reflect.NativeMethodAccessorImpl.invoke0(Native Method) at sun.reflect.NativeMethodAccessorImpl.invoke(NativeMethodAccessorImpl.java:62) at sun.reflect.DelegatingMethodAccessorImpl.invoke(DelegatingMethodAccessorImpl.java:43) at java.lang.reflect.Method.invoke(Method.java:498) at org.sonarsource.scanner.api.internal.IsolatedLauncherProxy.invoke(IsolatedLauncherProxy.java:60) at com.sun.proxy.$Proxy23.execute(Unknown Source) at org.sonarsource.scanner.api.EmbeddedScanner.doExecute(EmbeddedScanner.java:233) at org.sonarsource.scanner.api.EmbeddedScanner.runAnalysis(EmbeddedScanner.java:151) at org.sonarsource.scanner.maven.bootstrap.ScannerBootstrapper.execute(ScannerBootstrapper.java:77) ... 23 more Caused by: java.lang.NoClassDefFoundError: Lorg/sonar/plugins/java/api/JavaResourceLocator; at java.lang.Class.getDeclaredFields0(Native Method) at java.lang.Class.privateGetDeclaredFields(Class.java:2583) at java.lang.Class.getDeclaredFields(Class.java:1916) at org.picocontainer.injectors.AdaptingInjection$2.run(AdaptingInjection.java:217) at java.security.AccessController.doPrivileged(Native Method) at org.picocontainer.injectors.AdaptingInjection.injectionFieldAnnotated(AdaptingInjection.java:209) at org.picocontainer.injectors.AdaptingInjection.fieldAnnotatedInjectionAdapter(AdaptingInjection.java:188) at org.picocontainer.injectors.AdaptingInjection.createComponentAdapter(AdaptingInjection.java:57) at org.picocontainer.behaviors.AbstractBehaviorFactory.createComponentAdapter(AbstractBehaviorFactory.java:44) at org.picocontainer.behaviors.OptInCaching.createComponentAdapter(OptInCaching.java:45) at org.picocontainer.DefaultPicoContainer.addComponent(DefaultPicoContainer.java:536) at org.picocontainer.DefaultPicoContainer.access$300(DefaultPicoContainer.java:84) at org.picocontainer.DefaultPicoContainer$AsPropertiesPicoContainer.addComponent(DefaultPicoContainer.java:1149) at org.sonar.core.platform.ComponentContainer.addExtension(ComponentContainer.java:246) ... 50 more Caused by: java.lang.ClassNotFoundException: org.sonar.plugins.java.api.JavaResourceLocator at org.sonar.classloader.ParentFirstStrategy.loadClass(ParentFirstStrategy.java:39) at org.sonar.classloader.ClassRealm.loadClass(ClassRealm.java:87) at org.sonar.classloader.ClassRealm.loadClass(ClassRealm.java:76) ... 64 more [ERROR] [ERROR] Re-run Maven using the -X switch to enable full debug logging. [ERROR] [ERROR] For more information about the errors and possible solutions, please read the following articles: [ERROR] [Help 1] http://cwiki.apache.org/confluence/display/MAVEN/MojoExecutionException

maven打包报错,用命令打包的mvn package 接着报这个错,急等

![图片说明](https://img-ask.csdn.net/upload/201802/02/1517553010_852643.png) ![图片说明](https://img-ask.csdn.net/upload/201802/02/1517553902_211162.png) jdk用的1.8 pom.xml配置maven之后 ``` <build> <plugins> <plugin> <groupId>org.apache.maven.plugins</groupId> <artifactId>maven-compiler-plugin</artifactId> <version>3.3</version> <configuration> <source>1.8</source> <target>1.8</target> </configuration> </plugin> </plugins> </build> ``` 又报错 ![图片说明](https://img-ask.csdn.net/upload/201802/02/1517557255_958482.png) 通过 ``` <build> <plugins> <plugin> <groupId>org.apache.maven.plugins</groupId> <artifactId>maven-compiler-plugin</artifactId> <version>3.3</version> <configuration> <source>1.8</source> <target>1.8</target> <encoding>UTF-8</encoding> <compilerArguments> <verbose /> <bootclasspath>${java.home}\lib\rt.jar;${java.home}\lib\jce.jar</bootclasspath> </compilerArguments> </configuration> </plugin> </plugins> </build> ``` 解决 现在发布又出现了新问题 ![图片说明](https://img-ask.csdn.net/upload/201802/02/1517560036_768869.png)

第一次运行maven项目,mvn compile命令报错

![图片说明](https://img-ask.csdn.net/upload/201710/22/1508647184_892267.png) 所有的mvn命令都会出现这个错误,百度找了几种原因和方法 1 网络问题,这个原因可以排除 2增加一个<dependency>,删除m2目录下的文件重试,还是出现错误 3 也有可能不能访问中央仓库,配置了镜像仓库,仍然出错 4手动下载了maven-resources-plugin-2.6的jar包放入配置好的<localRepository>G:\workspace\repo</localRepository>中,但还是出现一样的错误 还有其他解决的办法吗?或者问题不是因为无法下载相应的jar包,是配置文件有错?

Mvn-help:systemn命令,maven 配置没问题,百度也没出现过这种错误,无语了,,,,

大神求教,,,,,,,,,,,,,,,,,,,,,,,,,,![图片说明](https://img-ask.csdn.net/upload/201706/15/1497466666_405035.png)

mvn help:system报错 No plugin

[ERROR] No plugin found for prefix 'help' in the current project and in the plugin groups [org.apache.maven.plugins, org.codehaus.mojo] available from the repositories [local (C:\Users\admin\.m2\repository), centralMirror (http://localhost/nexus/content/groups/public/)] -> [Help 1] [ERROR] [ERROR] To see the full stack trace of the errors, re-run Maven with the -e switch. [ERROR] Re-run Maven using the -X switch to enable full debug logging. [ERROR]

idea已经导入maven,Terminal输入mvn却报错?

报错内容:'mvn' 不是内部或外部命令,也不是可运行的程序 或批处理文件。 项目目录已经显示在Maven Projects中; cmd输入mvn反馈正常,eclipse结果同idea; 新手求教!!

maven下载之后,在cmd输入命令,mvn报错

maven下载之后,在cmd输入命令,mvn报错。已经配置好本地仓库和镜像。 ![错误截图](https://img-ask.csdn.net/upload/201911/20/1574220070_29967.png) ``` C:\Users\Administrator>mvn [INFO] Scanning for projects... [INFO] ------------------------------------------------------------------------ [INFO] BUILD FAILURE [INFO] ------------------------------------------------------------------------ [INFO] Total time: 0.056 s [INFO] Finished at: 2019-11-20T11:13:44+08:00 [INFO] ------------------------------------------------------------------------ [ERROR] No goals have been specified for this build. You must specify a valid lifecycle phase or a goal in the format <plugin-prefix>:<goal> or <plugin-group-id>:<plugin-artifact-id>[:<plugin-version>]:<goal>. Available lifecycle phases are: validate, initialize, generate-sources, process-sources, generate-resources, process-resources, compile, process-classes, generate-test-sources, process-test-sources, generate-test-resources, process-test-resources, test-compile, process-test-classes, test, prepare-package, package, pre-integration-test, integration-test, post-integration-test, verify, install, deploy, pre-clean, clean, post-clean, pre-site, site, post-site, site-deploy. -> [Help 1] [ERROR] [ERROR] To see the full stack trace of the errors, re-run Maven with the -e switch. [ERROR] Re-run Maven using the -X switch to enable full debug logging. [ERROR] [ERROR] For more information about the errors and possible solutions, please read the following articles: [ERROR] [Help 1] http://cwiki.apache.org/confluence/display/MAVEN/NoGoalSpecifiedException C:\Users\Administrator>mvn -v Apache Maven 3.6.1 (d66c9c0b3152b2e69ee9bac180bb8fcc8e6af555; 2019-04-05T03:00:29+08:00) Maven home: D:\soft\maven\apache-maven-3.6.1\bin\.. Java version: 1.8.0_121, vendor: Oracle Corporation, runtime: D:\jdk\jre Default locale: zh_CN, platform encoding: GBK OS name: "windows 10", version: "10.0", arch: "amd64", family: "windows" ```

maven 下载失败 在cmd中输入mvn help:system

![图片说明](https://img-ask.csdn.net/upload/201512/10/1449725257_622731.jpg)

Docker 中java程序对外请求,报错:Root Cause exception : java.net.UnknownHostException

1、在虚拟机中centos7 系统中,安装了Docker环境,想实现在docker中运行 “java -jar test.jar”,其中test.jar的main函数中会对外发起http请求,url=“http://plm.xxx.com:9091/xxx”,初始启动运行镜像文件就报错: ``` java.net.UnknownHostException: PLM at java.net.Inet4AddressImpl.lookupAllHostAddr(Native Method) at java.net.InetAddress$1.lookupAllHostAddr(InetAddress.java:901 ``` 2、我配置的dockfile 文件为: ``` From centos MAINTAINER liubin ADD test.jar test.jar ADD jdk-7u80-linux-x64.tar.gz /home/jdk/ ENV JAVA_HOME /home/jdk/jdk1.7.0_80 ENV PATH $JAVA_HOME/bin:$PATH ENV CLASSPATH=.:$JAVA_HOME/lib/dt.jar:$JAVA_HOME/lib/tools.jar ENTRYPOINT ["java","-jar","test.jar"] ``` 3、直接尝试在centos环境中运行java -jar test.jar不会报异常,我的/etc/hosts文件中配置了PLM相关地址 ``` 127.0.0.1 node1 localhost ::1 node1 localhost 192.168.2.18 plm.xxx.com plmapp PLM #与请求地址相关的域名 192.168.2.113 ode1 192.168.2.128 AAASPLMIFS ``` 4、我的问题是docker 中运行java程序报这个UnknownHostException,是不是需要在Dockerfile中配置其它内容。 不好意思,最近没有积分呀、

maven不能install项目, mvn install报错

![图片说明](https://img-ask.csdn.net/upload/201511/11/1447208798_757246.png) 说找不到这个类,但是在我的仓库里头明明又有这个类 ![图片说明](https://img-ask.csdn.net/upload/201511/11/1447209183_497411.png) 新手上路,最基本的一个HelloWorld了,求大神解救

Maven打包错误!!!!

Failed to execute goal org.springframework.boot:spring-boot-maven-plugin:1.5.9.RELEASE:repackage (default) on project scf-core: Execution default of goal org.springframework.boot:spring-boot-maven-plugin:1.5.9.RELEASE:repackage failed: Plugin org.springframework.boot:spring-boot-maven-plugin:1.5.9.RELEASE or one of its dependencies could not be resolved: Failed to collect dependencies at org.springframework.boot:spring-boot-maven-plugin:jar:1.5.9.RELEASE -> org.apache.maven.plugins:maven-shade-plugin:jar:2.2 -> org.vafer:jdependency:jar:0.7 -> commons-io:commons-io:jar:1.3.2: Failed to read artifact descriptor for commons-io:commons-io:jar:1.3.2: Could not transfer artifact commons-io:commons-io:pom:1.3.2 from/to central (https://repo.maven.apache.org/maven2): Received fatal alert: protocol_version -> [Help 1]

关于maven的问题 mvn package时出现的错误

[root@localhost storm-starter-master]# mvn -f m2-pom.xml package [INFO] Scanning for projects... Downloading: http://repo.maven.apache.org/maven2/com/theoryinpractise/clojure-maven-plugin/1.3.8/clojure-maven-plugin-1.3.8.pom [ERROR] The build could not read 1 project -> [Help 1] [ERROR] [ERROR] The project storm.starter:storm-starter:0.0.1-SNAPSHOT (/home/lmy/storm-starter-master/m2-pom.xml) has 1 error [ERROR] Unresolveable build extension: Plugin com.theoryinpractise:clojure-maven-plugin:1.3.8 or one of its dependencies could not be resolved: Failed to collect dependencies for com.theoryinpractise:clojure-maven-plugin:jar:1.3.8 (): Failed to read artifact descriptor for com.theoryinpractise:clojure-maven-plugin:jar:1.3.8: Could not transfer artifact com.theoryinpractise:clojure-maven-plugin:pom:1.3.8 from/to central (http://repo.maven.apache.org/maven2): repo.maven.apache.org: Name or service not known: Unknown host repo.maven.apache.org: Name or service not known -> [Help 2] [ERROR] [ERROR] To see the full stack trace of the errors, re-run Maven with the -e switch. [ERROR] Re-run Maven using the -X switch to enable full debug logging. [ERROR] [ERROR] For more information about the errors and possible solutions, please read the following articles: [ERROR] [Help 1] http://cwiki.apache.org/confluence/display/MAVEN/ProjectBuildingException [ERROR] [Help 2] http://cwiki.apache.org/confluence/display/MAVEN/PluginResolutionException

maven 不能打包,然后报这个错误,什么原因

![图片说明](https://img-ask.csdn.net/upload/201509/21/1442807307_256487.png)

Python数据挖掘简易入门

&nbsp; &nbsp; &nbsp; &nbsp; 本课程为Python数据挖掘方向的入门课程,课程主要以真实数据为基础,详细介绍数据挖掘入门的流程和使用Python实现pandas与numpy在数据挖掘方向的运用,并深入学习如何运用scikit-learn调用常用的数据挖掘算法解决数据挖掘问题,为进一步深入学习数据挖掘打下扎实的基础。

HoloLens2开发入门教程

本课程为HoloLens2开发入门教程,讲解部署开发环境,安装VS2019,Unity版本,Windows SDK,创建Unity项目,讲解如何使用MRTK,编辑器模拟手势交互,打包VS工程并编译部署应用到HoloLens上等。

2019 Python开发者日-培训

本次活动将秉承“只讲技术,拒绝空谈”的理念,邀请十余位身处一线的Python技术专家,重点围绕Web开发、自动化运维、数据分析、人工智能等技术模块,分享真实生产环境中使用Python应对IT挑战的真知灼见。此外,针对不同层次的开发者,大会还安排了深度培训实操环节,为开发者们带来更多深度实战的机会。

Only老K说-爬取妹子图片(简单入门)

安装第三方请求库 requests 被网站禁止了访问 原因是我们是Python过来的 重新给一段 可能还是存在用不了,使用网页的 编写代码 上面注意看匹配内容 User-Agent:请求对象 AppleWebKit:请求内核 Chrome浏览器 //请求网页 import requests import re //正则表达式 就是去不规则的网页里面提取有规律的信息 headers = { 'User-Agent':'存放浏览器里面的' } response = requests.get

2020_五一数学建模_C题_整理后的数据.zip

该数据是我的程序读取的数据,仅供参考,问题的解决方案:https://blog.csdn.net/qq_41228463/article/details/105993051

R语言入门基础

本课程旨在帮助学习者快速入门R语言: 课程系统详细地介绍了使用R语言进行数据处理的基本思路和方法。 课程能够帮助初学者快速入门数据处理。 课程通过大量的案例详细地介绍了如何使用R语言进行数据分析和处理 课程操作实际案例教学,通过编写代码演示R语言的基本使用方法和技巧

人才招聘系统PHP+MySQL源码

PHP 5.0及以上 + MySQL 5.0及以上 开发的人才招聘系统完全可运行源码,按照操作说明简单配置即可运行。学习PHPWEB应用的完整系统程序源码。

Java基础知识面试题(2020最新版)

文章目录Java概述何为编程什么是Javajdk1.5之后的三大版本JVM、JRE和JDK的关系什么是跨平台性?原理是什么Java语言有哪些特点什么是字节码?采用字节码的最大好处是什么什么是Java程序的主类?应用程序和小程序的主类有何不同?Java应用程序与小程序之间有那些差别?Java和C++的区别Oracle JDK 和 OpenJDK 的对比基础语法数据类型Java有哪些数据类型switc...

python可视化分析(matplotlib、seaborn、ggplot2)

python可视化分析总结(matplotlib、seaborn、ggplot)一、matplotlib库1、基本绘图命令3、图形参数设置4、特殊统计图的绘制4.1 数学函数图4.2 气泡图4.1 三维曲面图二、seaborn库1、常用统计图1.1 箱线图1.2 小提琴图1.3 点图1.4 条图与计数图1.5 分组图1.6 概率分布图2、联合图3、配对图三、ggplot库1、图层画法+常用图形2、快速绘图 一、matplotlib库 1、基本绘图命令 import matplotlib.pyplot as

Vue.js 2.0之全家桶系列视频课程

基于新的Vue.js 2.3版本, 目前新全的Vue.js教学视频,让你少走弯路,直达技术前沿! 1. 包含Vue.js全家桶(vue.js、vue-router、axios、vuex、vue-cli、webpack、ElementUI等) 2. 采用笔记+代码案例的形式讲解,通俗易懂

初级玩转Linux+Ubuntu(嵌入式开发基础课程)

课程主要面向嵌入式Linux初学者、工程师、学生 主要从一下几方面进行讲解: 1.linux学习路线、基本命令、高级命令 2.shell、vi及vim入门讲解 3.软件安装下载、NFS、Samba、FTP等服务器配置及使用

人工智能-计算机视觉实战之路(必备算法+深度学习+项目实战)

系列课程主要分为3大阶段:(1)首先掌握计算机视觉必备算法原理,结合Opencv进行学习与练手,通过实际视项目进行案例应用展示。(2)进军当下最火的深度学习进行视觉任务实战,掌握深度学习中必备算法原理与网络模型架构。(3)结合经典深度学习框架与实战项目进行实战,基于真实数据集展开业务分析与建模实战。整体风格通俗易懂,项目驱动学习与就业面试。 建议同学们按照下列顺序来进行学习:1.Python入门视频课程 2.Opencv计算机视觉实战(Python版) 3.深度学习框架-PyTorch实战/人工智能框架实战精讲:Keras项目 4.Python-深度学习-物体检测实战 5.后续实战课程按照自己喜好选择就可以

【大总结2】大学两年,写了这篇几十万字的干货总结

本文十天后设置为粉丝可见,喜欢的提前关注 不要白嫖请点赞 不要白嫖请点赞 不要白嫖请点赞 文中提到的书我都有电子版,可以评论邮箱发给你。 文中提到的书我都有电子版,可以评论邮箱发给你。 文中提到的书我都有电子版,可以评论邮箱发给你。 本篇文章应该算是Java后端开发技术栈的,但是大部分是基础知识,所以我觉得对任何方向都是有用的。 1、数据结构 数据结构是计算机存储、...

lena全身原图(非256*256版本,而是全身原图)

lena全身原图(非256*256版本,而是全身原图) lena原图很有意思,我们通常所用的256*256图片是在lena原图上截取了头部部分的256*256正方形得到的. 原图是花花公子杂志上的一个

【项目实战】 图书信息管理系统(Maven,mybatis)(第一个自己独立完成的项目)

《程序设计综合训练实践报告》 此项目为图书信息管理系统,是一个采用了mysql+mybatis框架+java编写的maven项目

图书管理系统(Java + Mysql)我的第一个完全自己做的实训项目

图书管理系统 Java + MySQL 完整实训代码,MVC三层架构组织,包含所有用到的图片资源以及数据库文件,大三上学期实训,注释很详细,按照阿里巴巴Java编程规范编写

Python入门视频精讲

Python入门视频培训课程以通俗易懂的方式讲解Python核心技术,Python基础,Python入门。适合初学者的教程,让你少走弯路! 课程内容包括:1.Python简介和安装 、2.第一个Python程序、PyCharm的使用 、3.Python基础、4.函数、5.高级特性、6.面向对象、7.模块、8.异常处理和IO操作、9.访问数据库MySQL。教学全程采用笔记+代码案例的形式讲解,通俗易懂!!!

20行代码教你用python给证件照换底色

20行代码教你用python给证件照换底色

2018年全国大学生计算机技能应用大赛决赛 大题

2018年全国大学生计算机技能应用大赛决赛大题,程序填空和程序设计(侵删)

MySQL数据库从入门到实战应用

限时福利1:购课进答疑群专享柳峰(刘运强)老师答疑服务 限时福利2:购课后添加学习助手(微信号:csdn590),按消息提示即可领取编程大礼包! 为什么说每一个程序员都应该学习MySQL? 根据《2019-2020年中国开发者调查报告》显示,超83%的开发者都在使用MySQL数据库。 使用量大同时,掌握MySQL早已是运维、DBA的必备技能,甚至部分IT开发岗位也要求对数据库使用和原理有深入的了解和掌握。 学习编程,你可能会犹豫选择 C++ 还是 Java;入门数据科学,你可能会纠结于选择 Python 还是 R;但无论如何, MySQL 都是 IT 从业人员不可或缺的技能! 【课程设计】 在本课程中,刘运强老师会结合自己十多年来对MySQL的心得体会,通过课程给你分享一条高效的MySQL入门捷径,让学员少走弯路,彻底搞懂MySQL。 本课程包含3大模块:&nbsp; 一、基础篇: 主要以最新的MySQL8.0安装为例帮助学员解决安装与配置MySQL的问题,并对MySQL8.0的新特性做一定介绍,为后续的课程展开做好环境部署。 二、SQL语言篇: 本篇主要讲解SQL语言的四大部分数据查询语言DQL,数据操纵语言DML,数据定义语言DDL,数据控制语言DCL,学会熟练对库表进行增删改查等必备技能。 三、MySQL进阶篇: 本篇可以帮助学员更加高效的管理线上的MySQL数据库;具备MySQL的日常运维能力,语句调优、备份恢复等思路。 &nbsp;

C/C++学习指南全套教程

C/C++学习的全套教程,从基本语法,基本原理,到界面开发、网络开发、Linux开发、安全算法,应用尽用。由毕业于清华大学的业内人士执课,为C/C++编程爱好者的教程。

C/C++跨平台研发从基础到高阶实战系列套餐

一 专题从基础的C语言核心到c++ 和stl完成基础强化; 二 再到数据结构,设计模式完成专业计算机技能强化; 三 通过跨平台网络编程,linux编程,qt界面编程,mfc编程,windows编程,c++与lua联合编程来完成应用强化 四 最后通过基于ffmpeg的音视频播放器,直播推流,屏幕录像,

我以为我对Mysql事务很熟,直到我遇到了阿里面试官

太惨了,面试又被吊打

专为程序员设计的数学课

<p> 限时福利限时福利,<span>15000+程序员的选择!</span> </p> <p> 购课后添加学习助手(微信号:csdn590),按提示消息领取编程大礼包!并获取讲师答疑服务! </p> <p> <br> </p> <p> 套餐中一共包含5门程序员必学的数学课程(共47讲) </p> <p> 课程1:《零基础入门微积分》 </p> <p> 课程2:《数理统计与概率论》 </p> <p> 课程3:《代码学习线性代数》 </p> <p> 课程4:《数据处理的最优化》 </p> <p> 课程5:《马尔可夫随机过程》 </p> <p> <br> </p> <p> 哪些人适合学习这门课程? </p> <p> 1)大学生,平时只学习了数学理论,并未接触如何应用数学解决编程问题; </p> <p> 2)对算法、数据结构掌握程度薄弱的人,数学可以让你更好的理解算法、数据结构原理及应用; </p> <p> 3)看不懂大牛代码设计思想的人,因为所有的程序设计底层逻辑都是数学; </p> <p> 4)想学习新技术,如:人工智能、机器学习、深度学习等,这门课程是你的必修课程; </p> <p> 5)想修炼更好的编程内功,在遇到问题时可以灵活的应用数学思维解决问题。 </p> <p> <br> </p> <p> 在这门「专为程序员设计的数学课」系列课中,我们保证你能收获到这些:<br> <br> <span> </span> </p> <p class="ql-long-24357476"> <span class="ql-author-24357476">①价值300元编程课程大礼包</span> </p> <p class="ql-long-24357476"> <span class="ql-author-24357476">②应用数学优化代码的实操方法</span> </p> <p class="ql-long-24357476"> <span class="ql-author-24357476">③数学理论在编程实战中的应用</span> </p> <p class="ql-long-24357476"> <span class="ql-author-24357476">④程序员必学的5大数学知识</span> </p> <p class="ql-long-24357476"> <span class="ql-author-24357476">⑤人工智能领域必修数学课</span> </p> <p> <br> 备注:此课程只讲程序员所需要的数学,即使你数学基础薄弱,也能听懂,只需要初中的数学知识就足矣。<br> <br> 如何听课? </p> <p> 1、登录CSDN学院 APP 在我的课程中进行学习; </p> <p> 2、登录CSDN学院官网。 </p> <p> <br> </p> <p> 购课后如何领取免费赠送的编程大礼包和加入答疑群? </p> <p> 购课后,添加助教微信:<span> csdn590</span>,按提示领取编程大礼包,或观看付费视频的第一节内容扫码进群答疑交流! </p> <p> <img src="https://img-bss.csdn.net/201912251155398753.jpg" alt=""> </p>

Eclipse archetype-catalog.xml

Eclipse Maven 创建Web 项目报错 Could not resolve archetype org.apache.maven.archetypes:maven-archetype-web

使用TensorFlow+keras快速构建图像分类模型

课程分为两条主线: 1&nbsp;从Tensorflow的基础知识开始,全面介绍Tensorflow和Keras相关内容。通过大量实战,掌握Tensorflow和Keras经常用到的各种建模方式,参数优化方法,自定义参数和模型的手段,以及对训练结果评估与分析的技巧。 2&nbsp;从机器学习基础算法开始,然后进入到图像分类领域,使用MNIST手写数据集和CIFAR10图像数据集,从简单神经网络到深度神经网络,再到卷积神经网络,最终完成复杂模型:残差网络的搭建。完成这条主线,学员将可以自如地使用机器学习的手段来达到图像分类的目的。

Python代码实现飞机大战

文章目录经典飞机大战一.游戏设定二.我方飞机三.敌方飞机四.发射子弹五.发放补给包六.主模块 经典飞机大战 源代码以及素材资料(图片,音频)可从下面的github中下载: 飞机大战源代码以及素材资料github项目地址链接 ————————————————————————————————————————————————————————— 不知道大家有没有打过飞机,喜不喜欢打飞机。当我第一次接触这个东西的时候,我的内心是被震撼到的。第一次接触打飞机的时候作者本人是身心愉悦的,因为周边的朋友都在打飞机, 每

最近面试Java后端开发的感受:如果就以平时项目经验来面试,通过估计很难,不信你来看看

在上周,我密集面试了若干位Java后端的候选人,工作经验在3到5年间。我的标准其实不复杂:第一能干活,第二Java基础要好,第三最好熟悉些分布式框架,我相信其它公司招初级开发时,应该也照着这个标准来面的。 我也知道,不少候选人能力其实不差,但面试时没准备或不会说,这样的人可能在进团队干活后确实能达到期望,但可能就无法通过面试,但面试官总是只根据面试情况来判断。 但现实情况是,大多数人可能面试前没准备,或准备方法不得当。要知道,我们平时干活更偏重于业务,不可能大量接触到算法,数据结构,底层代码这类面试必问

三个项目玩转深度学习(附1G源码)

从事大数据与人工智能开发与实践约十年,钱老师亲自见证了大数据行业的发展与人工智能的从冷到热。事实证明,计算机技术的发展,算力突破,海量数据,机器人技术等,开启了第四次工业革命的序章。深度学习图像分类一直是人工智能的经典任务,是智慧零售、安防、无人驾驶等机器视觉应用领域的核心技术之一,掌握图像分类技术是机器视觉学习的重中之重。针对现有线上学习的特点与实际需求,我们开发了人工智能案例实战系列课程。打造:以项目案例实践为驱动的课程学习方式,覆盖了智能零售,智慧交通等常见领域,通过基础学习、项目案例实践、社群答疑,三维立体的方式,打造最好的学习效果。

微信小程序开发实战之番茄时钟开发

微信小程序番茄时钟视频教程,本课程将带着各位学员开发一个小程序初级实战类项目,针对只看过官方文档而又无从下手的开发者来说,可以作为一个较好的练手项目,对于有小程序开发经验的开发者而言,可以更好加深对小程序各类组件和API 的理解,为更深层次高难度的项目做铺垫。

相关热词 c#分级显示数据 c# 不区分大小写替换 c#中调用就java c#正则表达式 验证小数 c# vscode 配置 c#三维数组能存多少数据 c# 新建excel c#多个文本框 c#怎么创建tcp通讯 c# mvc 电子病例
立即提问