Ubuntu上node和nodejs-legacy有什么区别?

在Ubuntu 14.04上使用apt-get安装node,有两个相关的包:node和nodejs-legacy。这两个包分别是什么?有啥区别?

1个回答

Csdn user default icon
上传中...
上传图片
插入图片
抄袭、复制答案,以达到刷声望分或其他目的的行为,在CSDN问答是严格禁止的,一经发现立刻封号。是时候展现真正的技术了!
其他相关推荐
webstrom 调试 nodejs
"C:\Program Files (x86)\JetBrains\WebStorm 10.0.3\bin\runnerw.exe" "D:\Program Files\nodejs\node.exe" --debug-brk=15688 --nolazy server.js (node:9264) [DEP0062] DeprecationWarning: `node --debug` and `node --debug-brk` are invalid. Please use `node --inspect` or `node --inspect-brk` instead. Process finished with exit code 9 正常运行可以,但是debug运行就不行了。他写着让使用inspect但是从哪里改成这个呢???
linux上使用node的困惑
通过apt-get安装了node,敲命令行`node`和`nodejs`似乎效果是一样的?linux上node和nodejs是一个东西么。。。
nodejs中async和promise使用上有什么区别?
nodejs中async和promise使用上有什么区别?????????
npm install python报错
node-pre-gyp ERR! Tried to download(403): https://node-zopfli.s3.amazonaws.com/Release/zopfli-v2.0.2-node-v57-win32-x64.tar.gz node-pre-gyp ERR! Pre-built binaries not found for node-zopfli@2.0.2 and node@8.12.0 (node-v57 ABI, unknown) (falling back to source compile with node-gyp) gyp ERR! configure error gyp ERR! stack Error: Can't find Python executable "python2.7", you can set the PYTHON env variable. gyp ERR! stack at PythonFinder.failNoPython (C:\Program Files\nodejs\node_modules\npm\node_modules\node-gyp\lib\configure.js:484:19) gyp ERR! stack at PythonFinder.<anonymous> (C:\Program Files\nodejs\node_modules\npm\node_modules\node-gyp\lib\configure.js:509:16) gyp ERR! stack at C:\Program Files\nodejs\node_modules\npm\node_modules\graceful-fs\polyfills.js:284:29 gyp ERR! stack at FSReqWrap.oncomplete (fs.js:152:21) gyp ERR! System Windows_NT 10.0.17134 gyp ERR! command "C:\\Program Files\\nodejs\\node.exe" "C:\\Program Files\\nodejs\\node_modules\\npm\\node_modules\\node-gyp\\bin\\node-gyp.js" "configure" "--fallback-to-build" "--module=C:\\Users\\78472\\Desktop\\vue-multi-page\\node_modules\\node-zopfli\\lib\\binding\\node-v57-win32-x64\\zopfli.node" "--module_name=zopfli" "--module_path=C:\\Users\\78472\\Desktop\\vue-multi-page\\node_modules\\node-zopfli\\lib\\binding\\node-v57-win32-x64" "--python=python2.7" "--msvs_version=2015" gyp ERR! cwd C:\Users\78472\Desktop\vue-multi-page\node_modules\node-zopfli gyp ERR! node -v v8.12.0 gyp ERR! node-gyp -v v3.8.0 gyp ERR! not ok node-pre-gyp ERR! build error node-pre-gyp ERR! stack Error: Failed to execute 'C:\Program Files\nodejs\node.exe C:\Program Files\nodejs\node_modules\npm\node_modules\node-gyp\bin\node-gyp.js configure --fallback-to-build --module=C:\Users\78472\Desktop\vue-multi-page\node_modules\node-zopfli\lib\binding\node-v57-win32-x64\zopfli.node --module_name=zopfli --module_path=C:\Users\78472\Desktop\vue-multi-page\node_modules\node-zopfli\lib\binding\node-v57-win32-x64 --python=python2.7 --msvs_version=2015' (1) node-pre-gyp ERR! stack at ChildProcess.<anonymous> (C:\Users\78472\Desktop\vue-multi-page\node_modules\node-pre-gyp\lib\util\compile.js:83:29) node-pre-gyp ERR! stack at emitTwo (events.js:126:13) node-pre-gyp ERR! stack at ChildProcess.emit (events.js:214:7) node-pre-gyp ERR! stack at maybeClose (internal/child_process.js:915:16) node-pre-gyp ERR! stack at Process.ChildProcess._handle.onexit (internal/child_process.js:209:5) node-pre-gyp ERR! System Windows_NT 10.0.17134 node-pre-gyp ERR! command "C:\\Program Files\\nodejs\\node.exe" "C:\\Users\\78472\\Desktop\\vue-multi-page\\node_modules\\node-pre-gyp\\bin\\node-pre-gyp" "install" "--fallback-to-build" node-pre-gyp ERR! cwd C:\Users\78472\Desktop\vue-multi-page\node_modules\node-zopfli node-pre-gyp ERR! node -v v8.12.0 node-pre-gyp ERR! node-pre-gyp -v v0.6.39 node-pre-gyp ERR! not ok 以上是错误内容
node 安装http-server报错,这是啥情况
C:\Users\DELL\Desktop\member\member> npm install http-server -g npm ERR! path C:\Program Files\nodejs\node_modules\.staging npm ERR! code EPERM npm ERR! errno -4048 npm ERR! syscall mkdir npm ERR! Error: EPERM: operation not permitted, mkdir 'C:\Program Files\nodejs\node_modules\.staging' npm ERR! { Error: EPERM: operation not permitted, mkdir 'C:\Program Files\nodejs\node_modules\.staging' npm ERR! cause: npm ERR! { Error: EPERM: operation not permitted, mkdir 'C:\Program Files\nodejs\node_modules\.staging' npm ERR! errno: -4048, npm ERR! code: 'EPERM', npm ERR! syscall: 'mkdir', npm ERR! path: 'C:\\Program Files\\nodejs\\node_modules\\.staging' }, npm ERR! stack: 'Error: EPERM: operation not permitted, mkdir \'C:\\Program Files\\nodejs\\node_modules\\.staging\'', npm ERR! errno: -4048, npm ERR! code: 'EPERM', npm ERR! syscall: 'mkdir', npm ERR! path: 'C:\\Program Files\\nodejs\\node_modules\\.staging', npm ERR! parent: 'http-server' } npm ERR! npm ERR! The operation was rejected by your operating system. npm ERR! It's possible that the file was already in use (by a text editor or antivirus), npm ERR! or that you lack permissions to access it. npm ERR! npm ERR! If you believe this might be a permissions issue, please double-check the npm ERR! permissions of the file and its containing directories, or try running npm ERR! the command again as root/Administrator (though this is not recommended). npm ERR! A complete log of this run can be found in: npm ERR! C:\Users\DELL\AppData\Roaming\npm-cache\_logs\2018-10-16T07_10_25_840Z-debug.log PS C:\Users\DELL\Desktop\member\member>
windows上nodejs连接mongodb
公司在Windows上用nodejs开发web应用,要连接mongodb数据库,在mongodb.org下了node-mongodb-native的zip包,不知道怎么配置,那位高人给指点一下,拜谢!!!
有什么工具可以找出一个nodejs项目中的所有全局变量么
如题 有什么工具可以找出一个nodejs项目中的所有全局变量么 有什么工具可以找出一个nodejs项目中的所有全局变量么 有什么工具可以找出一个nodejs项目中的所有全局变量么
nodejs创建kraken项目报错,使用vs2013
创建一个KRAKEN项目,npm install -g generator-kraken,报错提示node版本过低,手动升级版本0.10.28至4.2.4,继续创建,报错: 在此解决方案中一次生成一个项目。若要启用并行生成,请添加“/m”开关。 C:\Program Files (x86)\MSBuild\Microsoft.Cpp\v4.0\V120\Microsoft.CppBuild.targets(399,5): error MSB3191: 无法创建目录“Release\obj\thread_sleep\thread_sleep.tlog\”。指定的路径或文件名太长,或者两者都太长。完全限定文件名必须少于 260 个字符,并且目录名必须少于 248 个字符。 [C:\Users\liuxiang\AppData\Roaming\npm\node_modules\generator-kraken\node_modules\yeoman-generator\node_modules\cross-spawn\node_modules\spawn-sync\node_modules\try-thread-sleep\node_modules\thread-sleep\build\thread_sleep.vcxproj] gyp ERR! build error gyp ERR! stack Error: `C:\Program Files (x86)\MSBuild\12.0\bin\msbuild.exe` fail ed with exit code: 1 gyp ERR! stack at ChildProcess.onExit (C:\Document\node.js\node_modules\npm\node_modules\node-gyp\lib\build.js:270:23) gyp ERR! stack at emitTwo (events.js:87:13) gyp ERR! stack at ChildProcess.emit (events.js:172:7) gyp ERR! stack at Process.ChildProcess._handle.onexit (internal/child_proces s.js:200:12) gyp ERR! System Windows_NT 6.1.7601 gyp ERR! command "C:\\Document\\node.js\\node.exe" "C:\\Document\\node.js\\node_ modules\\npm\\node_modules\\node-gyp\\bin\\node-gyp.js" "build" "--fallback-to-b uild" "--module=C:\\Users\\liuxiang\\AppData\\Roaming\\npm\\node_modules\\genera tor-kraken\\node_modules\\yeoman-generator\\node_modules\\cross-spawn\\node_modu les\\spawn-sync\\node_modules\\try-thread-sleep\\node_modules\\thread-sleep\\lib \\binding\\Release\\node-v46-win32-x64\\thread_sleep.node" "--module_name=thread _sleep" "--module_path=C:\\Users\\liuxiang\\AppData\\Roaming\\npm\\node_modules\ \generator-kraken\\node_modules\\yeoman-generator\\node_modules\\cross-spawn\\no de_modules\\spawn-sync\\node_modules\\try-thread-sleep\\node_modules\\thread-sle ep\\lib\\binding\\Release\\node-v46-win32-x64" gyp ERR! cwd C:\Users\liuxiang\AppData\Roaming\npm\node_modules\generator-kraken \node_modules\yeoman-generator\node_modules\cross-spawn\node_modules\spawn-sync\ node_modules\try-thread-sleep\node_modules\thread-sleep gyp ERR! node -v v4.2.4 gyp ERR! node-gyp -v v3.0.3 gyp ERR! not ok node-pre-gyp ERR! build error node-pre-gyp ERR! stack Error: Failed to execute 'node-gyp.cmd build --fallback- to-build --module=C:\Users\liuxiang\AppData\Roaming\npm\node_modules\generator-k raken\node_modules\yeoman-generator\node_modules\cross-spawn\node_modules\spawn- sync\node_modules\try-thread-sleep\node_modules\thread-sleep\lib\binding\Release \node-v46-win32-x64\thread_sleep.node --module_name=thread_sleep --module_path=C :\Users\liuxiang\AppData\Roaming\npm\node_modules\generator-kraken\node_modules\ yeoman-generator\node_modules\cross-spawn\node_modules\spawn-sync\node_modules\t ry-thread-sleep\node_modules\thread-sleep\lib\binding\Release\node-v46-win32-x64 ' (1) node-pre-gyp ERR! stack at ChildProcess.<anonymous> (C:\Users\liuxiang\AppDa ta\Roaming\npm\node_modules\generator-kraken\node_modules\yeoman-generator\node_ modules\cross-spawn\node_modules\spawn-sync\node_modules\try-thread-sleep\node_m odules\thread-sleep\node_modules\node-pre-gyp\lib\util\compile.js:83:29) node-pre-gyp ERR! stack at emitTwo (events.js:87:13) node-pre-gyp ERR! stack at ChildProcess.emit (events.js:172:7) node-pre-gyp ERR! stack at maybeClose (internal/child_process.js:818:16) node-pre-gyp ERR! stack at Process.ChildProcess._handle.onexit (internal/chi ld_process.js:211:5) node-pre-gyp ERR! System Windows_NT 6.1.7601 node-pre-gyp ERR! command "C:\\Document\\node.js\\node.exe" "C:\\Users\\liuxiang \\AppData\\Roaming\\npm\\node_modules\\generator-kraken\\node_modules\\yeoman-ge nerator\\node_modules\\cross-spawn\\node_modules\\spawn-sync\\node_modules\\try- thread-sleep\\node_modules\\thread-sleep\\node_modules\\node-pre-gyp\\bin\\node- pre-gyp" "install" "--fallback-to-build" node-pre-gyp ERR! cwd C:\Users\liuxiang\AppData\Roaming\npm\node_modules\generat or-kraken\node_modules\yeoman-generator\node_modules\cross-spawn\node_modules\sp awn-sync\node_modules\try-thread-sleep\node_modules\thread-sleep node-pre-gyp ERR! node -v v4.2.4 node-pre-gyp ERR! node-pre-gyp -v v0.6.9 node-pre-gyp ERR! not ok Failed to execute 'node-gyp.cmd build --fallback-to-build --module=C:\Users\liux iang\AppData\Roaming\npm\node_modules\generator-kraken\node_modules\yeoman-gener ator\node_modules\cross-spawn\node_modules\spawn-sync\node_modules\try-thread-sl eep\node_modules\thread-sleep\lib\binding\Release\node-v46-win32-x64\thread_slee p.node --module_name=thread_sleep --module_path=C:\Users\liuxiang\AppData\Roamin g\npm\node_modules\generator-kraken\node_modules\yeoman-generator\node_modules\c ross-spawn\node_modules\spawn-sync\node_modules\try-thread-sleep\node_modules\th read-sleep\lib\binding\Release\node-v46-win32-x64' (1) npm WARN optional dep failed, continuing thread-sleep@1.0.4 > spawn-sync@1.0.15 postinstall C:\Users\liuxiang\AppData\Roaming\npm\node_modul es\generator-kraken\node_modules\yeoman-generator\node_modules\cross-spawn\node_ modules\spawn-sync > node postinstall generator-kraken@2.2.2 C:\Users\liuxiang\AppData\Roaming\npm\node_modules\genera tor-kraken ├── debuglog@1.0.1 ├── underscore.string@3.2.2 ├── mkdirp@0.5.1 (minimist@0.0.8) ├── chalk@1.1.1 (escape-string-regexp@1.0.4, ansi-styles@2.1.0, supports-colo r@2.0.0, has-ansi@2.0.0, strip-ansi@3.0.0) ├── update-notifier@0.3.2 (is-npm@1.0.0, string-length@1.0.1, semver-diff@2.1 .0, latest-version@1.0.1, configstore@0.3.2) └── yeoman-generator@0.20.3 (detect-conflict@1.0.0, read-chunk@1.0.1, yeoman- assert@2.1.1, path-exists@1.0.0, yeoman-welcome@1.0.1, path-is-absolute@1.0.0, a sync@1.5.2, mime@1.3.4, class-extend@0.1.2, text-table@0.2.0, diff@2.2.1, dargs@ 4.1.0, xdg-basedir@2.0.0, user-home@2.0.0, istextorbinary@1.0.2, shelljs@0.5.3, nopt@3.0.6, debug@2.2.0, run-async@0.1.0, cli-table@0.3.1, through2@2.0.0, glob@ 5.0.15, findup-sync@0.2.1, rimraf@2.5.0, mem-fs-editor@2.1.0, sinon@1.17.2, gith ub-username@2.1.0, dateformat@1.0.12, pretty-bytes@2.0.1, yeoman-environment@1.5 .2, gruntfile-editor@1.1.0, html-wiring@1.2.0, download@4.4.3, lodash@3.10.1, in quirer@0.8.5, cross-spawn@2.1.4)
为什么nuxt.js无法安装node-sass?
1.npm 不管怎么样都安装不了 淘宝镜像也没用 2.每次安装后都卡在Downloading binary from https://github.com/sass/node-sass/releases/download/v4.12.0/win32-x64-64这里然后就报错 3.T.T小白求教 ``` PS E:\Users\FuYuHao\Desktop\sb\a\aaa> npm i node-sass > node-sass@4.12.0 install E:\Users\FuYuHao\Desktop\sb\a\aaa\node_modules\node-sass > node scripts/install.js Downloading binary from https://github.com/sass/node-sass/releases/download/v4.12.0/win32-x64-64_binding.node Cannot download "https://github.com/sass/node-sass/releases/download/v4.12.0/win32-x64-64_binding.node": connect ETIMEDOUT 52.216.135.19:443 Timed out whilst downloading the prebuilt binary Hint: If github.com is not accessible in your location try setting a proxy via HTTP_PROXY, e.g. export HTTP_PROXY=http://example.com:1234 or configure npm proxy via npm config set proxy http://example.com:8080 > node-sass@4.12.0 postinstall E:\Users\FuYuHao\Desktop\sb\a\aaa\node_modules\node-sass > node scripts/build.js Building: C:\Program Files\nodejs\node.exe E:\Users\FuYuHao\Desktop\sb\a\aaa\node_modules\node-gyp\bin\node-gyp.js rebuild --verbose --libsass_ext= --libsass_cflags= --libsass_ldflags= --libsass_library= gyp info it worked if it ends with ok gyp verb cli [ 'C:\\Program Files\\nodejs\\node.exe', gyp verb cli 'E:\\Users\\FuYuHao\\Desktop\\sb\\a\\aaa\\node_modules\\node-gyp\\bin\\node-gyp.js', gyp verb cli 'rebuild', gyp verb cli '--verbose', gyp verb cli '--libsass_ext=', gyp verb cli '--libsass_cflags=', gyp verb cli '--libsass_ldflags=', gyp verb cli '--libsass_library=' ] gyp info using node-gyp@3.8.0 gyp info using node@10.14.1 | win32 | x64 gyp verb command rebuild [] gyp verb command clean [] gyp verb clean removing "build" directory gyp verb command configure [] gyp verb check python checking for Python executable "python2" in the PATH gyp verb `which` failed Error: not found: python2 gyp verb `which` failed at getNotFoundError (E:\Users\FuYuHao\Desktop\sb\a\aaa\node_modules\which\which.js:13:12) gyp verb `which` failed at F (E:\Users\FuYuHao\Desktop\sb\a\aaa\node_modules\which\which.js:68:19) gyp verb `which` failed at E (E:\Users\FuYuHao\Desktop\sb\a\aaa\node_modules\which\which.js:80:29) gyp verb `which` failed at E:\Users\FuYuHao\Desktop\sb\a\aaa\node_modules\which\which.js:89:16 gyp verb `which` failed at E:\Users\FuYuHao\Desktop\sb\a\aaa\node_modules\isexe\index.js:42:5 gyp verb `which` failed at E:\Users\FuYuHao\Desktop\sb\a\aaa\node_modules\isexe\windows.js:36:5 gyp verb `which` failed at FSReqWrap.oncomplete (fs.js:154:21) gyp verb `which` failed python2 { Error: not found: python2 gyp verb `which` failed at getNotFoundError (E:\Users\FuYuHao\Desktop\sb\a\aaa\node_modules\which\which.js:13:12) gyp verb `which` failed at F (E:\Users\FuYuHao\Desktop\sb\a\aaa\node_modules\which\which.js:68:19) gyp verb `which` failed at E (E:\Users\FuYuHao\Desktop\sb\a\aaa\node_modules\which\which.js:80:29) gyp verb `which` failed at E:\Users\FuYuHao\Desktop\sb\a\aaa\node_modules\which\which.js:89:16 gyp verb `which` failed at E:\Users\FuYuHao\Desktop\sb\a\aaa\node_modules\isexe\index.js:42:5 gyp verb `which` failed at E:\Users\FuYuHao\Desktop\sb\a\aaa\node_modules\isexe\windows.js:36:5 gyp verb `which` failed at FSReqWrap.oncomplete (fs.js:154:21) gyp verb `which` failed stack: gyp verb `which` failed 'Error: not found: python2\n at getNotFoundError (E:\\Users\\FuYuHao\\Desktop\\sb\\a\\aaa\\node_modules\\which\\which.js:13:12)\n at F (E:\\Users\\FuYuHao\\Desktop\\sb\\a\\aaa\\node_modules\\which\\which.js:68:19)\n at E (E:\\Users\\FuYuHao\\Desktop\\sb\\a\\aaa\\node_modules\\which\\which.js:80:29)\n at E:\\Users\\FuYuHao\\Desktop\\sb\\a\\aaa\\node_modules\\which\\which.js:89:16\n at E:\\Users\\FuYuHao\\Desktop\\sb\\a\\aaa\\node_modules\\isexe\\index.js:42:5\n at E:\\Users\\FuYuHao\\Desktop\\sb\\a\\aaa\\node_modules\\isexe\\windows.js:36:5\n at FSReqWrap.oncomplete (fs.js:154:21)', gyp verb `which` failed code: 'ENOENT' } gyp verb check python checking for Python executable "python" in the PATH gyp verb `which` succeeded python C:\Python27\python.EXE gyp verb check python version `C:\Python27\python.EXE -c "import sys; print "2.7.15 gyp verb check python version .%s.%s" % sys.version_info[:3];"` returned: %j gyp verb get node dir no --target version specified, falling back to host node version: 10.14.1 gyp verb command install [ '10.14.1' ] gyp verb install input version string "10.14.1" gyp verb install installing version: 10.14.1 gyp verb install --ensure was passed, so won't reinstall if already installed gyp verb install version is already installed, need to check "installVersion" gyp verb got "installVersion" 9 gyp verb needs "installVersion" 9 gyp verb install version is good gyp verb get node dir target node version installed: 10.14.1 gyp verb build dir attempting to create "build" dir: E:\Users\FuYuHao\Desktop\sb\a\aaa\node_modules\node-sass\build gyp verb build dir "build" dir needed to be created? E:\Users\FuYuHao\Desktop\sb\a\aaa\node_modules\node-sass\build gyp verb find vs2017 Found installation at: C:\Program Files (x86)\Microsoft Visual Studio\2017\BuildTools gyp verb find vs2017 - Found Microsoft.VisualStudio.Component.Windows10SDK.17763 gyp verb find vs2017 - Found Microsoft.VisualStudio.Component.VC.Tools.x86.x64 gyp verb find vs2017 - Found Microsoft.VisualStudio.VC.MSBuild.Base gyp verb find vs2017 - Using this installation with Windows 10 SDK gyp verb find vs2017 using installation: C:\Program Files (x86)\Microsoft Visual Studio\2017\BuildTools gyp verb build/config.gypi creating config file gyp verb build/config.gypi writing out config file: E:\Users\FuYuHao\Desktop\sb\a\aaa\node_modules\node-sass\build\config.gypi gyp verb config.gypi checking for gypi file: E:\Users\FuYuHao\Desktop\sb\a\aaa\node_modules\node-sass\config.gypi gyp verb common.gypi checking for gypi file: E:\Users\FuYuHao\Desktop\sb\a\aaa\node_modules\node-sass\common.gypi gyp verb gyp gyp format was not specified; forcing "msvs" gyp info spawn C:\Python27\python.EXE gyp info spawn args [ 'E:\\Users\\FuYuHao\\Desktop\\sb\\a\\aaa\\node_modules\\node-gyp\\gyp\\gyp_main.py', gyp info spawn args 'binding.gyp', gyp info spawn args '-f', gyp info spawn args 'msvs', gyp info spawn args '-G', gyp info spawn args 'msvs_version=2015', gyp info spawn args '-I', gyp info spawn args 'E:\\Users\\FuYuHao\\Desktop\\sb\\a\\aaa\\node_modules\\node-sass\\build\\config.gypi', gyp info spawn args '-I', gyp info spawn args 'E:\\Users\\FuYuHao\\Desktop\\sb\\a\\aaa\\node_modules\\node-gyp\\addon.gypi', gyp info spawn args '-I', gyp info spawn args 'C:\\Users\\FuYuHao\\.node-gyp\\10.14.1\\include\\node\\common.gypi', gyp info spawn args '-Dlibrary=shared_library', gyp info spawn args '-Dvisibility=default', gyp info spawn args '-Dnode_root_dir=C:\\Users\\FuYuHao\\.node-gyp\\10.14.1', gyp info spawn args '-Dnode_gyp_dir=E:\\Users\\FuYuHao\\Desktop\\sb\\a\\aaa\\node_modules\\node-gyp', gyp info spawn args '-Dnode_lib_file=C:\\Users\\FuYuHao\\.node-gyp\\10.14.1\\<(target_arch)\\node.lib', gyp info spawn args '-Dmodule_root_dir=E:\\Users\\FuYuHao\\Desktop\\sb\\a\\aaa\\node_modules\\node-sass', gyp info spawn args '-Dnode_engine=v8', gyp info spawn args '--depth=.', gyp info spawn args '--no-parallel', gyp info spawn args '--generator-output', gyp info spawn args 'E:\\Users\\FuYuHao\\Desktop\\sb\\a\\aaa\\node_modules\\node-sass\\build', gyp info spawn args '-Goutput_dir=.' ] gyp verb command build [] gyp verb build type Release gyp verb architecture x64 gyp verb node dev dir C:\Users\FuYuHao\.node-gyp\10.14.1 gyp verb found first Solution file build/binding.sln gyp verb using MSBuild: C:\Program Files (x86)\Microsoft Visual Studio\2017\BuildTools\MSBuild\15.0\Bin\MSBuild.exe gyp info spawn C:\Program Files (x86)\Microsoft Visual Studio\2017\BuildTools\MSBuild\15.0\Bin\MSBuild.exe gyp info spawn args [ 'build/binding.sln', gyp info spawn args '/nologo', gyp info spawn args '/p:Configuration=Release;Platform=x64' ] 在此解决方案中一次生成一个项目。若要启用并行生成,请添加“/m”开关。 生成启动时间为 2019/5/29 22:01:12。 节点 1 上的项目“E:\Users\FuYuHao\Desktop\sb\a\aaa\node_modules\node-sass\build\binding.sln”(默认目标)。 ValidateSolutionConfiguration: 正在生成解决方案配置“Release|x64”。 项目“E:\Users\FuYuHao\Desktop\sb\a\aaa\node_modules\node-sass\build\binding.sln”(1)正在节点 1 上生成“E:\Users\FuYuHao\Desktop\sb\a\aaa\node_modules\node-sass\build\binding.vcxproj.metaproj”(2) (默认目标)。 项目“E:\Users\FuYuHao\Desktop\sb\a\aaa\node_modules\node-sass\build\binding.vcxproj.metaproj”(2)正在节点 1 上生成“E:\Users\FuYuHao\Desktop\sb\a\aaa\node_modules\node-sass\build\src\libsass.vcxproj”(3) (默认目标)。 PrepareForBuild: 正在创建目录“Release\obj\libsass\”。 正在创建目录“E:\Users\FuYuHao\Desktop\sb\a\aaa\node_modules\node-sass\build\Release\”。 正在创建目录“Release\obj\libsass\libsass.tlog\”。 InitializeBuildStatus: 正在创建“Release\obj\libsass\libsass.tlog\unsuccessfulbuild”,因为已指定“AlwaysCreate”。 ClCompile: C:\Program Files (x86)\Microsoft Visual Studio\2017\BuildTools\VC\Tools\MSVC\14.16.27023\bin\HostX64\x64\CL.exe /c /I"C:\Users\FuYuHao\.node-gyp\10.14.1\include\node" /I"C:\Users\FuYuHao\.node-gyp\10.14.1\src" /I"C:\Use rs\FuYuHao\.node-gyp\10.14.1\deps\openssl\config" /I"C:\Users\FuYuHao\.node-gyp\10.14.1\deps\openssl\openssl\include" /I"C:\Users\FuYuHao\.node-gyp\10.14.1\deps\uv\include" /I"C:\Users\FuYuHao\.node-gyp\10.14.1\deps\zli b" /I"C:\Users\FuYuHao\.node-gyp\10.14.1\deps\v8\include" /I..\..\src\libsass\include /Z7 /nologo /W3 /WX- /diagnostics:classic /MP /Ox /Ob2 /Oi /Ot /Oy /GL /D NODE_GYP_MODULE_NAME=libsass /D USING_UV_SHARED=1 /D USING_ V8_SHARED=1 /D V8_DEPRECATION_WARNINGS=1 /D WIN32 /D _CRT_SECURE_NO_DEPRECATE /D _CRT_NONSTDC_NO_DEPRECATE /D _HAS_EXCEPTIONS=0 /D "LIBSASS_VERSION=\"3.5.4\"" /GF /Gm- /MT /GS /Gy /fp:precise /Zc:wchar_t /Zc:forScope /Z c:inline /GR- /Fo"Release\obj\libsass\\" /Fd"Release\obj\libsass\libsass.pdb" /Gd /TP /wd4351 /wd4355 /wd4800 /wd4251 /wd4275 /wd4244 /wd4267 /FC /errorReport:queue /GR /EHsc ..\..\src\libsass\src\ast.cpp ..\..\src\libs ass\src\ast_fwd_decl.cpp ..\..\src\libsass\src\backtrace.cpp ..\..\src\libsass\src\base64vlq.cpp ..\..\src\libsass\src\bind.cpp ..\..\src\libsass\src\check_nesting.cpp ..\..\src\libsass\src\color_maps.cpp ..\..\src\libs ass\src\constants.cpp ..\..\src\libsass\src\context.cpp ..\..\src\libsass\src\cssize.cpp ..\..\src\libsass\src\emitter.cpp ..\..\src\libsass\src\environment.cpp ..\..\src\libsass\src\error_handling.cpp ..\..\src\libsass \src\eval.cpp ..\..\src\libsass\src\expand.cpp ..\..\src\libsass\src\extend.cpp ..\..\src\libsass\src\file.cpp ..\..\src\libsass\src\functions.cpp ..\..\src\libsass\src\inspect.cpp ..\..\src\libsass\src\json.cpp ..\..\s rc\libsass\src\lexer.cpp ..\..\src\libsass\src\listize.cpp ..\..\src\libsass\src\memory\SharedPtr.cpp ..\..\src\libsass\src\node.cpp ..\..\src\libsass\src\operators.cpp ..\..\src\libsass\src\output.cpp ..\..\src\libsass \src\parser.cpp ..\..\src\libsass\src\plugins.cpp ..\..\src\libsass\src\position.cpp ..\..\src\libsass\src\prelexer.cpp ..\..\src\libsass\src\remove_placeholders.cpp ..\..\src\libsass\src\sass.cpp ..\..\src\libsass\src\ sass2scss.cpp ..\..\src\libsass\src\sass_context.cpp ..\..\src\libsass\src\sass_functions.cpp ..\..\src\libsass\src\sass_util.cpp ..\..\src\libsass\src\sass_values.cpp ..\..\src\libsass\src\source_map.cpp ..\..\src\libs ass\src\subset_map.cpp ..\..\src\libsass\src\to_c.cpp ..\..\src\libsass\src\to_value.cpp ..\..\src\libsass\src\units.cpp ..\..\src\libsass\src\utf8_string.cpp ..\..\src\libsass\src\util.cpp ..\..\src\libsass\src\values. cpp cl : 命令行 warning D9025: 正在重写“/GR-”(用“/GR”) [E:\Users\FuYuHao\Desktop\sb\a\aaa\node_modules\node-sass\build\src\libsass.vcxproj] cl : 命令行 warning D9025: 正在重写“/GR-”(用“/GR”) [E:\Users\FuYuHao\Desktop\sb\a\aaa\node_modules\node-sass\build\src\libsass.vcxproj] ast.cpp cl : 命令行 warning D9025: 正在重写“/GR-”(用“/GR”) [E:\Users\FuYuHao\Desktop\sb\a\aaa\node_modules\node-sass\build\src\libsass.vcxproj] ast_fwd_decl.cpp cl : 命令行 warning D9025: 正在重写“/GR-”(用“/GR”) [E:\Users\FuYuHao\Desktop\sb\a\aaa\node_modules\node-sass\build\src\libsass.vcxproj] backtrace.cpp cl : 命令行 warning D9025: 正在重写“/GR-”(用“/GR”) [E:\Users\FuYuHao\Desktop\sb\a\aaa\node_modules\node-sass\build\src\libsass.vcxproj] base64vlq.cpp bind.cpp check_nesting.cpp color_maps.cpp constants.cpp context.cpp cssize.cpp emitter.cpp environment.cpp error_handling.cpp eval.cpp expand.cpp extend.cpp file.cpp functions.cpp inspect.cpp json.cpp e:\users\fuyuhao\desktop\sb\a\aaa\node_modules\node-sass\src\libsass\src\json.cpp(26): warning C4005: “_CRT_NONSTDC_NO_DEPRECATE”: 宏重定义 [E:\Users\FuYuHao\Desktop\sb\a\aaa\node_modules\node-sass\build\src\libsass.vcxp roj] e:\users\fuyuhao\desktop\sb\a\aaa\node_modules\node-sass\src\libsass\src\json.cpp: note: 参见“_CRT_NONSTDC_NO_DEPRECATE”的前一个定义 lexer.cpp listize.cpp SharedPtr.cpp node.cpp operators.cpp output.cpp parser.cpp plugins.cpp position.cpp prelexer.cpp remove_placeholders.cpp sass.cpp sass2scss.cpp e:\users\fuyuhao\desktop\sb\a\aaa\node_modules\node-sass\src\libsass\src\sass2scss.cpp(9): warning C4005: “_CRT_NONSTDC_NO_DEPRECATE”: 宏重定义 [E:\Users\FuYuHao\Desktop\sb\a\aaa\node_modules\node-sass\build\src\libsass. vcxpr oj] e:\users\fuyuhao\desktop\sb\a\aaa\node_modules\node-sass\src\libsass\src\sass2scss.cpp: note: 参见“_CRT_NONSTDC_NO_DEPRECATE”的前一个定义 sass_context.cpp sass_functions.cpp sass_util.cpp sass_values.cpp source_map.cpp subset_map.cpp to_c.cpp to_value.cpp units.cpp utf8_string.cpp util.cpp values.cpp C:\Program Files (x86)\Microsoft Visual Studio\2017\BuildTools\VC\Tools\MSVC\14.16.27023\bin\HostX64\x64\CL.exe /c /I"C:\Users\FuYuHao\.node-gyp\10.14.1\include\node" /I"C:\Users\FuYuHao\.node-gyp\10.14.1\src" /I"C:\Use rs\FuYuHao\.node-gyp\10.14.1\deps\openssl\config" /I"C:\Users\FuYuHao\.node-gyp\10.14.1\deps\openssl\openssl\include" /I"C:\Users\FuYuHao\.node-gyp\10.14.1\deps\uv\include" /I"C:\Users\FuYuHao\.node-gyp\10.14.1\deps\zli b" /I"C:\Users\FuYuHao\.node-gyp\10.14.1\deps\v8\include" /I..\..\src\libsass\include /Z7 /nologo /W3 /WX- /diagnostics:classic /MP /Ox /Ob2 /Oi /Ot /Oy /GL /D NODE_GYP_MODULE_NAME=libsass /D USING_UV_SHARED=1 /D USING_ V8_SHARED=1 /D V8_DEPRECATION_WARNINGS=1 /D WIN32 /D _CRT_SECURE_NO_DEPRECATE /D _CRT_NONSTDC_NO_DEPRECATE /D _HAS_EXCEPTIONS=0 /D "LIBSASS_VERSION=\"3.5.4\"" /GF /Gm- /MT /GS /Gy /fp:precise /Zc:wchar_t /Zc:forScope /Z c:inline /GR- /Fo"Release\obj\libsass\\" /Fd"Release\obj\libsass\libsass.pdb" /Gd /TC /wd4351 /wd4355 /wd4800 /wd4251 /wd4275 /wd4244 /wd4267 /FC /errorReport:queue /GR /EHsc ..\..\src\libsass\src\cencode.c cl : 命令行 warning D9025: 正在重写“/GR-”(用“/GR”) [E:\Users\FuYuHao\Desktop\sb\a\aaa\node_modules\node-sass\build\src\libsass.vcxproj] cencode.c Lib: C:\Program Files (x86)\Microsoft Visual Studio\2017\BuildTools\VC\Tools\MSVC\14.16.27023\bin\HostX64\x64\Lib.exe /OUT:"E:\Users\FuYuHao\Desktop\sb\a\aaa\node_modules\node-sass\build\Release\libsass.lib" /NOLOGO /MACHINE :X64 /LTCG:INCREMENTAL Release\obj\libsass\ast.obj Release\obj\libsass\ast_fwd_decl.obj Release\obj\libsass\backtrace.obj Release\obj\libsass\base64vlq.obj Release\obj\libsass\bind.obj Release\obj\libsass\cencode.obj Release\obj\libsass\check_nesting.obj Release\obj\libsass\color_maps.obj Release\obj\libsass\constants.obj Release\obj\libsass\context.obj Release\obj\libsass\cssize.obj Release\obj\libsass\emitter.obj Release\obj\libsass\environment.obj Release\obj\libsass\error_handling.obj Release\obj\libsass\eval.obj Release\obj\libsass\expand.obj Release\obj\libsass\extend.obj Release\obj\libsass\file.obj Release\obj\libsass\functions.obj Release\obj\libsass\inspect.obj Release\obj\libsass\json.obj Release\obj\libsass\lexer.obj Release\obj\libsass\listize.obj Release\obj\libsass\SharedPtr.obj Release\obj\libsass\node.obj Release\obj\libsass\operators.obj Release\obj\libsass\output.obj Release\obj\libsass\parser.obj Release\obj\libsass\plugins.obj Release\obj\libsass\position.obj Release\obj\libsass\prelexer.obj Release\obj\libsass\remove_placeholders.obj Release\obj\libsass\sass.obj Release\obj\libsass\sass2scss.obj Release\obj\libsass\sass_context.obj Release\obj\libsass\sass_functions.obj Release\obj\libsass\sass_util.obj Release\obj\libsass\sass_values.obj Release\obj\libsass\source_map.obj Release\obj\libsass\subset_map.obj Release\obj\libsass\to_c.obj Release\obj\libsass\to_value.obj Release\obj\libsass\units.obj Release\obj\libsass\utf8_string.obj Release\obj\libsass\util.obj Release\obj\libsass\values.obj libsass.vcxproj -> E:\Users\FuYuHao\Desktop\sb\a\aaa\node_modules\node-sass\build\Release\\libsass.lib FinalizeBuildStatus: 正在删除文件“Release\obj\libsass\libsass.tlog\unsuccessfulbuild”。 正在对“Release\obj\libsass\libsass.tlog\libsass.lastbuildstate”执行 Touch 任务。 已完成生成项目“E:\Users\FuYuHao\Desktop\sb\a\aaa\node_modules\node-sass\build\src\libsass.vcxproj”(默认目标)的操作。 项目“E:\Users\FuYuHao\Desktop\sb\a\aaa\node_modules\node-sass\build\binding.vcxproj.metaproj”(2)正在节点 1 上生成“E:\Users\FuYuHao\Desktop\sb\a\aaa\node_modules\node-sass\build\binding.vcxproj”(4) (默认目标)。 PrepareForBuild: 正在创建目录“Release\obj\binding\”。 正在创建目录“Release\obj\binding\binding.tlog\”。 InitializeBuildStatus: 正在创建“Release\obj\binding\binding.tlog\unsuccessfulbuild”,因为已指定“AlwaysCreate”。 ClCompile: C:\Program Files (x86)\Microsoft Visual Studio\2017\BuildTools\VC\Tools\MSVC\14.16.27023\bin\HostX64\x64\CL.exe /c /I"C:\Users\FuYuHao\.node-gyp\10.14.1\include\node" /I"C:\Users\FuYuHao\.node-gyp\10.14.1\src" /I"C:\Use rs\FuYuHao\.node-gyp\10.14.1\deps\openssl\config" /I"C:\Users\FuYuHao\.node-gyp\10.14.1\deps\openssl\openssl\include" /I"C:\Users\FuYuHao\.node-gyp\10.14.1\deps\uv\include" /I"C:\Users\FuYuHao\.node-gyp\10.14.1\deps\zli b" /I"C:\Users\FuYuHao\.node-gyp\10.14.1\deps\v8\include" /I..\..\nan /I..\src\libsass\include /Z7 /nologo /W3 /WX- /diagnostics:classic /MP /Ox /Ob2 /Oi /Ot /Oy /GL /D NODE_GYP_MODULE_NAME=binding /D USING_UV_SHARED=1 /D USING_V8_SHARED=1 /D V8_DEPRECATION_WARNINGS=1 /D WIN32 /D _CRT_SECURE_NO_DEPRECATE /D _CRT_NONSTDC_NO_DEPRECATE /D _HAS_EXCEPTIONS=0 /D BUILDING_NODE_EXTENSION /D _WINDLL /GF /Gm- /MT /GS /Gy /fp:precise /Zc:wchar_t /Zc:forScope /Zc:inline /GR- /Fo"Release\obj\binding\\" /Fd"Release\obj\binding\vc141.pdb" /Gd /TP /wd4351 /wd4355 /wd4800 /wd4251 /wd4275 /wd4244 /wd4267 /FC /errorReport:queue /Zc:threadSafeInit- ..\src\binding.cpp . .\src\create_string.cpp ..\src\custom_function_bridge.cpp ..\src\custom_importer_bridge.cpp ..\src\sass_context_wrapper.cpp ..\src\sass_types\boolean.cpp ..\src\sass_types\color.cpp ..\src\sass_types\error.cpp ..\src\sa ss_types\factory.cpp ..\src\sass_types\list.cpp ..\src\sass_types\map.cpp ..\src\sass_types\null.cpp ..\src\sass_types\number.cpp ..\src\sass_types\string.cpp "E:\Users\FuYuHao\Desktop\sb\a\aaa\node_modules\node-gyp\src \win_delay_load_hook.cc" binding.cpp create_string.cpp custom_function_bridge.cpp custom_importer_bridge.cpp sass_context_wrapper.cpp boolean.cpp color.cpp error.cpp factory.cpp list.cpp map.cpp null.cpp number.cpp string.cpp win_delay_load_hook.cc Link: C:\Program Files (x86)\Microsoft Visual Studio\2017\BuildTools\VC\Tools\MSVC\14.16.27023\bin\HostX64\x64\link.exe /ERRORREPORT:QUEUE /OUT:"E:\Users\FuYuHao\Desktop\sb\a\aaa\node_modules\node-sass\build\Release\binding.n ode" /INCREMENTAL:NO /NOLOGO kernel32.lib user32.lib gdi32.lib winspool.lib comdlg32.lib advapi32.lib shell32.lib ole32.lib oleaut32.lib uuid.lib odbc32.lib DelayImp.lib "C:\Users\FuYuHao\.node-gyp\10.14.1\x64\node.lib" Delayimp.lib /DELAYLOAD:iojs.exe /DELAYLOAD:node.exe /MANIFEST /MANIFESTUAC:"level='asInvoker' uiAccess='false'" /manifest:embed /DEBUG /PDB:"E:\Users\FuYuHao\Desktop\sb\a\aaa\node_modules\node-sass\build\Release\bindi ng.pdb" /MAP /MAPINFO:EXPORTS /OPT:REF /OPT:ICF /TLBID:1 /RELEASE /DYNAMICBASE /NXCOMPAT /MACHINE:X64 /ignore:4199 /LTCG:INCREMENTAL /DLL Release\obj\binding\binding.obj Release\obj\binding\create_string.obj Release\obj\binding\custom_function_bridge.obj Release\obj\binding\custom_importer_bridge.obj Release\obj\binding\sass_context_wrapper.obj Release\obj\binding\boolean.obj Release\obj\binding\color.obj Release\obj\binding\error.obj Release\obj\binding\factory.obj Release\obj\binding\list.obj Release\obj\binding\map.obj Release\obj\binding\null.obj Release\obj\binding\number.obj Release\obj\binding\string.obj Release\obj\binding\win_delay_load_hook.obj "E:\Users\FuYuHao\Desktop\sb\a\aaa\node_modules\node-sass\build\Release\libsass.lib" C:\Users\FuYuHao\.node-gyp\10.14.1\x64\node.lib : fatal error LNK1107: 文件无效或损坏: 无法在 0x39F993 处读取 [E:\Users\FuYuHao\Desktop\sb\a\aaa\node_modules\node-sass\build\binding.vcxproj] 已完成生成项目“E:\Users\FuYuHao\Desktop\sb\a\aaa\node_modules\node-sass\build\binding.vcxproj”(默认目标)的操作 - 失败。 已完成生成项目“E:\Users\FuYuHao\Desktop\sb\a\aaa\node_modules\node-sass\build\binding.vcxproj.metaproj”(默认目标)的操作 - 失败。 已完成生成项目“E:\Users\FuYuHao\Desktop\sb\a\aaa\node_modules\node-sass\build\binding.sln”(默认目标)的操作 - 失败。 生成失败。 “E:\Users\FuYuHao\Desktop\sb\a\aaa\node_modules\node-sass\build\binding.sln”(默认目标) (1) -> “E:\Users\FuYuHao\Desktop\sb\a\aaa\node_modules\node-sass\build\binding.vcxproj.metaproj”(默认目标) (2) -> “E:\Users\FuYuHao\Desktop\sb\a\aaa\node_modules\node-sass\build\src\libsass.vcxproj”(默认目标) (3) -> (ClCompile 目标) -> cl : 命令行 warning D9025: 正在重写“/GR-”(用“/GR”) [E:\Users\FuYuHao\Desktop\sb\a\aaa\node_modules\node-sass\build\src\libsass.vcxproj] cl : 命令行 warning D9025: 正在重写“/GR-”(用“/GR”) [E:\Users\FuYuHao\Desktop\sb\a\aaa\node_modules\node-sass\build\src\libsass.vcxproj] cl : 命令行 warning D9025: 正在重写“/GR-”(用“/GR”) [E:\Users\FuYuHao\Desktop\sb\a\aaa\node_modules\node-sass\build\src\libsass.vcxproj] cl : 命令行 warning D9025: 正在重写“/GR-”(用“/GR”) [E:\Users\FuYuHao\Desktop\sb\a\aaa\node_modules\node-sass\build\src\libsass.vcxproj] cl : 命令行 warning D9025: 正在重写“/GR-”(用“/GR”) [E:\Users\FuYuHao\Desktop\sb\a\aaa\node_modules\node-sass\build\src\libsass.vcxproj] e:\users\fuyuhao\desktop\sb\a\aaa\node_modules\node-sass\src\libsass\src\json.cpp(26): warning C4005: “_CRT_NONSTDC_NO_DEPRECATE”: 宏重定义 [E:\Users\FuYuHao\Desktop\sb\a\aaa\node_modules\node-sass\build\src\libsass.vc xproj ] e:\users\fuyuhao\desktop\sb\a\aaa\node_modules\node-sass\src\libsass\src\sass2scss.cpp(9): warning C4005: “_CRT_NONSTDC_NO_DEPRECATE”: 宏重定义 [E:\Users\FuYuHao\Desktop\sb\a\aaa\node_modules\node-sass\build\src\libsas s.vcx proj] “E:\Users\FuYuHao\Desktop\sb\a\aaa\node_modules\node-sass\build\binding.sln”(默认目标) (1) -> “E:\Users\FuYuHao\Desktop\sb\a\aaa\node_modules\node-sass\build\binding.vcxproj.metaproj”(默认目标) (2) -> “E:\Users\FuYuHao\Desktop\sb\a\aaa\node_modules\node-sass\build\src\libsass.vcxproj”(默认目标) (3) -> cl : 命令行 warning D9025: 正在重写“/GR-”(用“/GR”) [E:\Users\FuYuHao\Desktop\sb\a\aaa\node_modules\node-sass\build\src\libsass.vcxproj] “E:\Users\FuYuHao\Desktop\sb\a\aaa\node_modules\node-sass\build\binding.sln”(默认目标) (1) -> “E:\Users\FuYuHao\Desktop\sb\a\aaa\node_modules\node-sass\build\binding.vcxproj.metaproj”(默认目标) (2) -> “E:\Users\FuYuHao\Desktop\sb\a\aaa\node_modules\node-sass\build\binding.vcxproj”(默认目标) (4) -> (Link 目标) -> C:\Users\FuYuHao\.node-gyp\10.14.1\x64\node.lib : fatal error LNK1107: 文件无效或损坏: 无法在 0x39F993 处读取 [E:\Users\FuYuHao\Desktop\sb\a\aaa\node_modules\node-sass\build\binding.vcxproj] 8 个警告 1 个错误 已用时间 00:00:24.13 gyp ERR! build error gyp ERR! stack Error: `C:\Program Files (x86)\Microsoft Visual Studio\2017\BuildTools\MSBuild\15.0\Bin\MSBuild.exe` failed with exit code: 1 gyp ERR! stack at ChildProcess.onExit (E:\Users\FuYuHao\Desktop\sb\a\aaa\node_modules\node-gyp\lib\build.js:262:23) gyp ERR! stack at ChildProcess.emit (events.js:182:13) gyp ERR! stack at Process.ChildProcess._handle.onexit (internal/child_process.js:240:12) gyp ERR! System Windows_NT 10.0.17763 gyp ERR! command "C:\\Program Files\\nodejs\\node.exe" "E:\\Users\\FuYuHao\\Desktop\\sb\\a\\aaa\\node_modules\\node-gyp\\bin\\node-gyp.js" "rebuild" "--verbose" "--libsass_ext=" "--libsass_cflags=" "--libsass_ldflags=" "--libsass_library=" gyp ERR! cwd E:\Users\FuYuHao\Desktop\sb\a\aaa\node_modules\node-sass gyp ERR! node -v v10.14.1 gyp ERR! node-gyp -v v3.8.0 gyp ERR! not ok Build failed with error code: 1 npm WARN optional SKIPPING OPTIONAL DEPENDENCY: fsevents@2.0.7 (node_modules\fsevents): npm WARN notsup SKIPPING OPTIONAL DEPENDENCY: Unsupported platform for fsevents@2.0.7: wanted {"os":"darwin","arch":"any"} (current: {"os":"win32","arch":"x64"}) npm WARN optional SKIPPING OPTIONAL DEPENDENCY: fsevents@1.2.9 (node_modules\watchpack\node_modules\fsevents): npm WARN notsup SKIPPING OPTIONAL DEPENDENCY: Unsupported platform for fsevents@1.2.9: wanted {"os":"darwin","arch":"any"} (current: {"os":"win32","arch":"x64"}) npm WARN optional SKIPPING OPTIONAL DEPENDENCY: fsevents@1.2.9 (node_modules\nodemon\node_modules\fsevents): npm WARN notsup SKIPPING OPTIONAL DEPENDENCY: Unsupported platform for fsevents@1.2.9: wanted {"os":"darwin","arch":"any"} (current: {"os":"win32","arch":"x64"}) npm ERR! code ELIFECYCLE npm ERR! errno 1 npm ERR! node-sass@4.12.0 postinstall: `node scripts/build.js` npm ERR! Exit status 1 npm ERR! npm ERR! Failed at the node-sass@4.12.0 postinstall script. npm ERR! This is probably not a problem with npm. There is likely additional logging output above. npm ERR! A complete log of this run can be found in: npm ERR! C:\Users\FuYuHao\AppData\Roaming\npm-cache\_logs\2019-05-29T14_01_39_903Z-debug.log PS E:\Users\FuYuHao\Desktop\sb\a\aaa> ```
【nodejs】express-session和connect-mongo模块使用问题
![图片说明](https://img-ask.csdn.net/upload/201605/22/1463884529_484358.png) ![图片说明](https://img-ask.csdn.net/upload/201605/22/1463884545_60118.png) 使用express-session和connect-mongo模块时报错,怎么破? express版本:4.13.1 mongodb版本:1.4.15 node版本:4.4.4
linux上面nodejs全局变量地址配置错误
linux上配置环境变量路径写错了,导致node -v和npm -v命令不能执行(-bash: npm: command not found) 确将路径写成 错误路径 ln -s /nodejs/bin/npm /usr/local/bin/ ln -s /nodejs/bin/node /usr/local/bin/ 请问如何将路径修改成: 正确路径是 sudo ln -s /root/nodejs/bin/node /usr/local/bin ln -s /root/nodejs/bin/npm /usr/local/bin
nodejs后台restful api上传图片的content-type问题
请问content-type=image/jpeg和multipart/form-data有什么关系? 我有一个nodejs的后台,是个restful api,我想开发个上传文件功能,请问合格content-type应该如何获取?
Ubuntu上Hexo安装问题
Ubuntu上安装了nodejs和各种依赖后,输入npm install -g hexo-cli遇到以下问题 懂得帮帮忙,悬赏! ``` npm WARN optional Skipping failed optional dependency /hexo-cli/chokidar/fsevents: npm WARN notsup Not compatible with your operating system or architecture: fsevents@1.1.2 npm ERR! Linux 4.8.0-36-generic npm ERR! argv "/usr/bin/nodejs" "/usr/bin/npm" "install" "-g" "hexo-cli" npm ERR! node v4.2.6 npm ERR! npm v3.5.2 npm ERR! path /usr/local/lib npm ERR! code EACCES npm ERR! errno -13 npm ERR! syscall access npm ERR! Error: EACCES: permission denied, access '/usr/local/lib' npm ERR! at Error (native) npm ERR! { [Error: EACCES: permission denied, access '/usr/local/lib'] npm ERR! errno: -13, npm ERR! code: 'EACCES', npm ERR! syscall: 'access', npm ERR! path: '/usr/local/lib' } npm ERR! npm ERR! Please try running this command again as root/Administrator. npm ERR! Please include the following file with any support request: npm ERR! /home/huixiong/npm-debug.log ```
nodejs异步请求和jquery中异步请求有什么不同
新人求教,nodejs中的异步请求和jquery中ajax的异步请求有什么区别?感觉都是一个请求,请求完成后执行回调函数。
ubuntu下安装 hexo失败
执行 sudo npm install hexo -g时 报错 贴上报错 ``` npm WARN This failure might be due to the use of legacy binary "node" npm WARN For further explanations, please read /usr/share/doc/nodejs/README.Debian > dtrace-provider@0.6.0 install /usr/local/lib/node_modules/hexo/node_modules/hexo-log/node_modules/bunyan/node_modules/dtrace-provider > node scripts/install.js sh: 1: node: not found npm WARN This failure might be due to the use of legacy binary "node" npm WARN For further explanations, please read /usr/share/doc/nodejs/README.Debian npm WARN optional dep failed, continuing dtrace-provider@0.6.0 npm ERR! error rolling back Error: ENOTEMPTY, rmdir '/usr/local/lib/node_modules/hexo/node_modules/cheerio/node_modules/jsdom/node_modules/cssstyle/lib/properties' npm ERR! error rolling back hexo@3.2.0 { [Error: ENOTEMPTY, rmdir '/usr/local/lib/node_modules/hexo/node_modules/cheerio/node_modules/jsdom/node_modules/cssstyle/lib/properties'] npm ERR! error rolling back errno: 53, npm ERR! error rolling back code: 'ENOTEMPTY', npm ERR! error rolling back path: '/usr/local/lib/node_modules/hexo/node_modules/cheerio/node_modules/jsdom/node_modules/cssstyle/lib/properties' } npm ERR! spawn-sync@1.0.15 postinstall: `node postinstall` npm ERR! Exit status 127 npm ERR! npm ERR! Failed at the spawn-sync@1.0.15 postinstall script. npm ERR! This is most likely a problem with the spawn-sync package, npm ERR! not with npm itself. npm ERR! Tell the author that this fails on your system: npm ERR! node postinstall npm ERR! You can get their info via: npm ERR! npm owner ls spawn-sync npm ERR! There is likely additional logging output above. npm ERR! System Linux 3.19.0-51-generic npm ERR! command "/usr/bin/nodejs" "/usr/bin/npm" "install" "hexo" "-g" npm ERR! cwd /home/sjd/code npm ERR! node -v v0.10.25 npm ERR! npm -v 1.4.21 npm ERR! code ELIFECYCLE npm ERR! Error: ENOENT, open '/usr/local/lib/node_modules/hexo/node_modules/cheerio/node_modules/jsdom/node_modules/request/node_modules/hawk/lib/server.js' npm ERR! If you need help, you may report this *entire* log, npm ERR! including the npm and node versions, at: npm ERR! <http://github.com/npm/npm/issues> npm ERR! System Linux 3.19.0-51-generic npm ERR! command "/usr/bin/nodejs" "/usr/bin/npm" "install" "hexo" "-g" npm ERR! cwd /home/sjd/code npm ERR! node -v v0.10.25 npm ERR! npm -v 1.4.21 npm ERR! path /usr/local/lib/node_modules/hexo/node_modules/cheerio/node_modules/jsdom/node_modules/request/node_modules/hawk/lib/server.js npm ERR! code ENOENT npm ERR! errno 34 npm ERR! EEXIST, mkdir '/usr/local/lib/node_modules/hexo/node_modules/warehouse/node_modules/cuid/node_modules/core-js/library/fn/symbol' File exists: /usr/local/lib/node_modules/hexo/node_modules/warehouse/node_modules/cuid/node_modules/core-js/library/fn/symbol Move it away, and try again. npm ERR! System Linux 3.19.0-51-generic npm ERR! command "/usr/bin/nodejs" "/usr/bin/npm" "install" "hexo" "-g" npm ERR! cwd /home/sjd/code npm ERR! node -v v0.10.25 npm ERR! npm -v 1.4.21 npm ERR! path /usr/local/lib/node_modules/hexo/node_modules/warehouse/node_modules/cuid/node_modules/core-js/library/fn/symbol npm ERR! fstream_path /usr/local/lib/node_modules/hexo/node_modules/warehouse/node_modules/cuid/node_modules/core-js/library/fn/symbol/iterator.js npm ERR! fstream_type File npm ERR! fstream_class FileWriter npm ERR! code EEXIST npm ERR! errno 47 npm ERR! fstream_stack /usr/lib/nodejs/fstream/lib/writer.js:171:23 npm ERR! fstream_stack /usr/lib/nodejs/mkdirp/index.js:46:53 npm ERR! fstream_stack Object.oncomplete (fs.js:107:15) npm ERR! Error: ENOENT, lstat '/usr/local/lib/node_modules/hexo/node_modules/cheerio/node_modules/jsdom/node_modules/request/node_modules/aws4/node_modules/lru-cache/node_modules/yallist/LICENSE' npm ERR! If you need help, you may report this *entire* log, npm ERR! including the npm and node versions, at: npm ERR! <http://github.com/npm/npm/issues> npm ERR! System Linux 3.19.0-51-generic npm ERR! command "/usr/bin/nodejs" "/usr/bin/npm" "install" "hexo" "-g" npm ERR! cwd /home/sjd/code npm ERR! node -v v0.10.25 npm ERR! npm -v 1.4.21 npm ERR! path /usr/local/lib/node_modules/hexo/node_modules/cheerio/node_modules/jsdom/node_modules/request/node_modules/aws4/node_modules/lru-cache/node_modules/yallist/LICENSE npm ERR! fstream_path /usr/local/lib/node_modules/hexo/node_modules/cheerio/node_modules/jsdom/node_modules/request/node_modules/aws4/node_modules/lru-cache/node_modules/yallist/LICENSE npm ERR! fstream_type File npm ERR! fstream_class FileWriter npm ERR! code ENOENT npm ERR! errno 34 npm ERR! fstream_stack /usr/lib/nodejs/fstream/lib/writer.js:284:26 npm ERR! fstream_stack Object.oncomplete (evalmachine.<anonymous>:107:15) npm ERR! Error: ENOENT, lstat '/usr/local/lib/node_modules/hexo/node_modules/cheerio/node_modules/jsdom/node_modules/request/node_modules/form-data/node_modules/async/lib/async.js' npm ERR! If you need help, you may report this *entire* log, npm ERR! including the npm and node versions, at: npm ERR! <http://github.com/npm/npm/issues> npm ERR! System Linux 3.19.0-51-generic npm ERR! command "/usr/bin/nodejs" "/usr/bin/npm" "install" "hexo" "-g" npm ERR! cwd /home/sjd/code npm ERR! node -v v0.10.25 npm ERR! npm -v 1.4.21 npm ERR! path /usr/local/lib/node_modules/hexo/node_modules/cheerio/node_modules/jsdom/node_modules/request/node_modules/form-data/node_modules/async/lib/async.js npm ERR! fstream_path /usr/local/lib/node_modules/hexo/node_modules/cheerio/node_modules/jsdom/node_modules/request/node_modules/form-data/node_modules/async/lib/async.js npm ERR! fstream_type File npm ERR! fstream_class FileWriter npm ERR! code ENOENT npm ERR! errno 34 npm ERR! fstream_stack /usr/lib/nodejs/fstream/lib/writer.js:284:26 npm ERR! fstream_stack Object.oncomplete (evalmachine.<anonymous>:107:15) npm ERR! Error: ENOENT, lstat '/usr/local/lib/node_modules/hexo/node_modules/cheerio/node_modules/jsdom/node_modules/request/node_modules/bl/node_modules/readable-stream/doc/stream.markdown' npm ERR! If you need help, you may report this *entire* log, npm ERR! including the npm and node versions, at: npm ERR! <http://github.com/npm/npm/issues> ```
nodeJS,web-server文件路径问题
小白求问,about文件中的图片无法显示 文件路径如下: src ---app.js public ---css ------style.css ---img ------robot.png templates ---about.hbs ---help.hbs ---index.hbs about.hbs文件代码: ``` <!DOCTYPE html> <html> <head> <link rel="stylesheet" href="/css/style.css"> </head> <body> <h1>{{title}}</h1> <img src="../public/img/robot.png"><!--- 注意文件路径名,否则图片无法显示----> <p>Created by {{name}}</p> </body> </html> ``` 在app.js中 ``` const path = require('path') const express = require('express') const hbs = require('hbs'); const app = express() const publicDirectoryPath = path.join(__dirname, '../public') const viewsPath = path.join(__dirname, '../templates') app.set('view engine', 'hbs') app.use(express.static(publicDirectoryPath)) //静态文件 //app.set('views', publicDirectoryPath)//动态文件 app.set('views', viewsPath) app.get('', (req, res) => { res.render('index', { title: 'Weather App', name: 'Andrew Mead' }) }) app.get('/about', (req, res) => { res.render('about', { title: 'About Me', name: 'Andrew Mead' }) }) app.get('/help', (req, res) => { res.render('help', { title: 'Help', helpText: 'Helpful Text here' }) }) app.listen(3000, () => { console.log('server is up on port 3000') }) ```
NodeJs启动项目出错,有大侠知道是什么原因吗?新手上路
"D:\Program Files\WebStorm 2017.1\bin\runnerw.exe" "D:\Program Files\nodejs\node.exe" D:\nodejs_svn\extnum_api\extnum_api_main.js D:\logs\ccs events.js:160 throw er; // Unhandled 'error' event ^ Error: write after end at writeAfterEnd (D:\nodejs_svn\extnum_api\node_modules\readable-stream\lib\_stream_writable.js:161:12) at DateRollingFileStream.Writable.write (D:\nodejs_svn\extnum_api\node_modules\readable-stream\lib\_stream_writable.js:208:5) at Logger.<anonymous> (D:\nodejs_svn\extnum_api\node_modules\log4js\lib\appenders\dateFile.js:35:13) at emitOne (events.js:96:13) at Logger.emit (events.js:188:7) at Logger._log (D:\nodejs_svn\extnum_api\node_modules\log4js\lib\logger.js:96:8) at Logger.(anonymous function) [as info] (D:\nodejs_svn\extnum_api\node_modules\log4js\lib\logger.js:89:12) at process.<anonymous> (D:\nodejs_svn\extnum_api\lib\extnum_api_client.js:50:13) at emitOne (events.js:101:20) at process.emit (events.js:188:7)
ubuntu 安装nodejs ./configure出错
![图片说明](https://img-ask.csdn.net/upload/201701/20/1484880678_243482.jpg) 怎么解决啊!!!
终于明白阿里百度这样的大公司,为什么面试经常拿ThreadLocal考验求职者了
点击上面↑「爱开发」关注我们每晚10点,捕获技术思考和创业资源洞察什么是ThreadLocalThreadLocal是一个本地线程副本变量工具类,各个线程都拥有一份线程私...
程序员必须掌握的核心算法有哪些?
由于我之前一直强调数据结构以及算法学习的重要性,所以就有一些读者经常问我,数据结构与算法应该要学习到哪个程度呢?,说实话,这个问题我不知道要怎么回答你,主要取决于你想学习到哪些程度,不过针对这个问题,我稍微总结一下我学过的算法知识点,以及我觉得值得学习的算法。这些算法与数据结构的学习大多数是零散的,并没有一本把他们全部覆盖的书籍。下面是我觉得值得学习的一些算法以及数据结构,当然,我也会整理一些看过...
Linux(服务器编程):15---两种高效的事件处理模式(reactor模式、proactor模式)
前言 同步I/O模型通常用于实现Reactor模式 异步I/O模型则用于实现Proactor模式 最后我们会使用同步I/O方式模拟出Proactor模式 一、Reactor模式 Reactor模式特点 它要求主线程(I/O处理单元)只负责监听文件描述符上是否有事件发生,有的话就立即将时间通知工作线程(逻辑单元)。除此之外,主线程不做任何其他实质性的工作 读写数据,接受新的连接,以及处...
阿里面试官问我:如何设计秒杀系统?我的回答让他比起大拇指
你知道的越多,你不知道的越多 点赞再看,养成习惯 GitHub上已经开源 https://github.com/JavaFamily 有一线大厂面试点脑图和个人联系方式,欢迎Star和指教 前言 Redis在互联网技术存储方面使用如此广泛,几乎所有的后端技术面试官都要在Redis的使用和原理方面对小伙伴们进行360°的刁难。 作为一个在互联网公司面一次拿一次Offer的面霸,打败了...
五年程序员记流水账式的自白。
不知觉已中码龄已突破五年,一路走来从起初铁憨憨到现在的十九线程序员,一路成长,虽然不能成为高工,但是也能挡下一面,从15年很火的android开始入坑,走过java、.Net、QT,目前仍处于android和.net交替开发中。 毕业到现在一共就职过两家公司,目前是第二家,公司算是半个创业公司,所以基本上都会身兼多职。比如不光要写代码,还要写软著、软著评测、线上线下客户对接需求收集...
C语言魔塔游戏
很早就很想写这个,今天终于写完了。 游戏截图: 编译环境: VS2017 游戏需要一些图片,如果有想要的或者对游戏有什么看法的可以加我的QQ 2985486630 讨论,如果暂时没有回应,可以在博客下方留言,到时候我会看到。 下面我来介绍一下游戏的主要功能和实现方式 首先是玩家的定义,使用结构体,这个名字是可以自己改变的 struct gamerole { char n...
一文详尽系列之模型评估指标
点击上方“Datawhale”,选择“星标”公众号第一时间获取价值内容在机器学习领域通常会根据实际的业务场景拟定相应的不同的业务指标,针对不同机器学习问题如回归、分类、排...
究竟你适不适合买Mac?
我清晰的记得,刚买的macbook pro回到家,开机后第一件事情,就是上了淘宝网,花了500元钱,找了一个上门维修电脑的师傅,上门给我装了一个windows系统。。。。。。 表砍我。。。 当时买mac的初衷,只是想要个固态硬盘的笔记本,用来运行一些复杂的扑克软件。而看了当时所有的SSD笔记本后,最终决定,还是买个好(xiong)看(da)的。 已经有好几个朋友问我mba怎么样了,所以今天尽量客观...
程序员一般通过什么途径接私活?
二哥,你好,我想知道一般程序猿都如何接私活,我也想接,能告诉我一些方法吗? 上面是一个读者“烦不烦”问我的一个问题。其实不止是“烦不烦”,还有很多读者问过我类似这样的问题。 我接的私活不算多,挣到的钱也没有多少,加起来不到 20W。说实话,这个数目说出来我是有点心虚的,毕竟太少了,大家轻喷。但我想,恰好配得上“一般程序员”这个称号啊。毕竟苍蝇再小也是肉,我也算是有经验的人了。 唾弃接私活、做外...
压测学习总结(1)——高并发性能指标:QPS、TPS、RT、吞吐量详解
一、QPS,每秒查询 QPS:Queries Per Second意思是“每秒查询率”,是一台服务器每秒能够相应的查询次数,是对一个特定的查询服务器在规定时间内所处理流量多少的衡量标准。互联网中,作为域名系统服务器的机器的性能经常用每秒查询率来衡量。 二、TPS,每秒事务 TPS:是TransactionsPerSecond的缩写,也就是事务数/秒。它是软件测试结果的测量单位。一个事务是指一...
Python爬虫爬取淘宝,京东商品信息
小编是一个理科生,不善长说一些废话。简单介绍下原理然后直接上代码。 使用的工具(Python+pycharm2019.3+selenium+xpath+chromedriver)其中要使用pycharm也可以私聊我selenium是一个框架可以通过pip下载 pip installselenium -ihttps://pypi.tuna.tsinghua.edu.cn/simple/ ...
阿里程序员写了一个新手都写不出的低级bug,被骂惨了。
这种新手都不会范的错,居然被一个工作好几年的小伙子写出来,差点被当场开除了。
Java工作4年来应聘要16K最后没要,细节如下。。。
前奏: 今天2B哥和大家分享一位前几天面试的一位应聘者,工作4年26岁,统招本科。 以下就是他的简历和面试情况。 基本情况: 专业技能: 1、&nbsp;熟悉Sping了解SpringMVC、SpringBoot、Mybatis等框架、了解SpringCloud微服务 2、&nbsp;熟悉常用项目管理工具:SVN、GIT、MAVEN、Jenkins 3、&nbsp;熟悉Nginx、tomca...
2020年,冯唐49岁:我给20、30岁IT职场年轻人的建议
点击“技术领导力”关注∆每天早上8:30推送 作者|Mr.K 编辑| Emma 来源|技术领导力(ID:jishulingdaoli) 前天的推文《冯唐:职场人35岁以后,方法论比经验重要》,收到了不少读者的反馈,觉得挺受启发。其实,冯唐写了不少关于职场方面的文章,都挺不错的。可惜大家只记住了“春风十里不如你”、“如何避免成为油腻腻的中年人”等不那么正经的文章。 本文整理了冯...
程序员该看的几部电影
1、骇客帝国(1999) 概念:在线/离线,递归,循环,矩阵等 剧情简介: 不久的将来,网络黑客尼奥对这个看似正常的现实世界产生了怀疑。 他结识了黑客崔妮蒂,并见到了黑客组织的首领墨菲斯。 墨菲斯告诉他,现实世界其实是由一个名叫“母体”的计算机人工智能系统控制,人们就像他们饲养的动物,没有自由和思想,而尼奥就是能够拯救人类的救世主。 可是,救赎之路从来都不会一帆风顺,到底哪里才是真实的世界?如何...
Python绘图,圣诞树,花,爱心 | Turtle篇
每周每日,分享Python实战代码,入门资料,进阶资料,基础语法,爬虫,数据分析,web网站,机器学习,深度学习等等。 公众号回复【进群】沟通交流吧,QQ扫码进群学习吧 微信群 QQ群 1.画圣诞树 import turtle screen = turtle.Screen() screen.setup(800,600) circle = turtle.Turtle()...
作为一个程序员,CPU的这些硬核知识你必须会!
CPU对每个程序员来说,是个既熟悉又陌生的东西? 如果你只知道CPU是中央处理器的话,那可能对你并没有什么用,那么作为程序员的我们,必须要搞懂的就是CPU这家伙是如何运行的,尤其要搞懂它里面的寄存器是怎么一回事,因为这将让你从底层明白程序的运行机制。 随我一起,来好好认识下CPU这货吧 把CPU掰开来看 对于CPU来说,我们首先就要搞明白它是怎么回事,也就是它的内部构造,当然,CPU那么牛的一个东...
还记得那个提速8倍的IDEA插件吗?VS Code版本也发布啦!!
去年,阿里云发布了本地 IDE 插件 Cloud Toolkit,仅 IntelliJ IDEA 一个平台,就有 15 万以上的开发者进行了下载,体验了一键部署带来的开发便利。时隔一年的今天,阿里云正式发布了 Visual Studio Code 版本,全面覆盖前端开发者,帮助前端实现一键打包部署,让开发提速 8 倍。 VSCode 版本的插件,目前能做到什么? 安装插件之后,开发者可以立即体验...
破14亿,Python分析我国存在哪些人口危机!
一、背景 二、爬取数据 三、数据分析 1、总人口 2、男女人口比例 3、人口城镇化 4、人口增长率 5、人口老化(抚养比) 6、各省人口 7、世界人口 四、遇到的问题 遇到的问题 1、数据分页,需要获取从1949-2018年数据,观察到有近20年参数:LAST20,由此推测获取近70年的参数可设置为:LAST70 2、2019年数据没有放上去,可以手动添加上去 3、将数据进行 行列转换 4、列名...
2019年除夕夜的有感而发
天气:小雨(加小雪) 温度:3摄氏度 空气:严重污染(399) 风向:北风 风力:微风 现在是除夕夜晚上十点钟,再有两个小时就要新的一年了; 首先要说的是我没患病,至少现在是没有患病;但是心情确像患了病一样沉重; 现在这个时刻应该大部分家庭都在看春晚吧,或许一家人团团圆圆的坐在一起,或许因为某些特殊原因而不能团圆;但不管是身在何处,身处什么境地,我都想对每一个人说一句:新年快乐! 不知道csdn这...
听说想当黑客的都玩过这个Monyer游戏(1~14攻略)
第零关 进入传送门开始第0关(游戏链接) 请点击链接进入第1关: 连接在左边→ ←连接在右边 看不到啊。。。。(只能看到一堆大佬做完的留名,也能看到菜鸡的我,在后面~~) 直接fn+f12吧 &lt;span&gt;连接在左边→&lt;/span&gt; &lt;a href="first.php"&gt;&lt;/a&gt; &lt;span&gt;←连接在右边&lt;/span&gt; o...
在家远程办公效率低?那你一定要收好这个「在家办公」神器!
相信大家都已经收到国务院延长春节假期的消息,接下来,在家远程办公可能将会持续一段时间。 但是问题来了。远程办公不是人在电脑前就当坐班了,相反,对于沟通效率,文件协作,以及信息安全都有着极高的要求。有着非常多的挑战,比如: 1在异地互相不见面的会议上,如何提高沟通效率? 2文件之间的来往反馈如何做到及时性?如何保证信息安全? 3如何规划安排每天工作,以及如何进行成果验收? ...... ...
作为一个程序员,内存和磁盘的这些事情,你不得不知道啊!!!
截止目前,我已经分享了如下几篇文章: 一个程序在计算机中是如何运行的?超级干货!!! 作为一个程序员,CPU的这些硬核知识你必须会! 作为一个程序员,内存的这些硬核知识你必须懂! 这些知识可以说是我们之前都不太重视的基础知识,可能大家在上大学的时候都学习过了,但是嘞,当时由于老师讲解的没那么有趣,又加上这些知识本身就比较枯燥,所以嘞,大家当初几乎等于没学。 再说啦,学习这些,也看不出来有什么用啊!...
2020年的1月,我辞掉了我的第一份工作
其实,这篇文章,我应该早点写的,毕竟现在已经2月份了。不过一些其它原因,或者是我的惰性、还有一些迷茫的念头,让自己迟迟没有试着写一点东西,记录下,或者说是总结下自己前3年的工作上的经历、学习的过程。 我自己知道的,在写自己的博客方面,我的文笔很一般,非技术类的文章不想去写;另外我又是一个还比较热衷于技术的人,而平常复杂一点的东西,如果想写文章写的清楚点,是需要足够...
别低估自己的直觉,也别高估自己的智商
所有群全部吵翻天,朋友圈全部沦陷,公众号疯狂转发。这两周没怎么发原创,只发新闻,可能有人注意到了。我不是懒,是文章写了却没发,因为大家的关注力始终在这次的疫情上面,发了也没人看。当然,我...
这个世界上人真的分三六九等,你信吗?
偶然间,在知乎上看到一个问题 一时间,勾起了我深深的回忆。 以前在厂里打过两次工,做过家教,干过辅导班,做过中介。零下几度的晚上,贴过广告,满脸、满手地长冻疮。 再回首那段岁月,虽然苦,但让我学会了坚持和忍耐。让我明白了,在这个世界上,无论环境多么的恶劣,只要心存希望,星星之火,亦可燎原。 下文是原回答,希望能对你能有所启发。 如果我说,这个世界上人真的分三六九等,...
节后首个工作日,企业们集体开晨会让钉钉挂了
By 超神经场景描述:昨天 2 月 3 日,是大部分城市号召远程工作的第一天,全国有接近 2 亿人在家开始远程办公,钉钉上也有超过 1000 万家企业活跃起来。关键词:十一出行 人脸...
Java基础知识点梳理
虽然已经在实际工作中经常与java打交道,但是一直没系统地对java这门语言进行梳理和总结,掌握的知识也比较零散。恰好利用这段时间重新认识下java,并对一些常见的语法和知识点做个总结与回顾,一方面为了加深印象,方便后面查阅,一方面为了掌握好Android打下基础。
2020年全新Java学习路线图,含配套视频,学完即为中级Java程序员!!
新的一年来临,突如其来的疫情打破了平静的生活! 在家的你是否很无聊,如果无聊就来学习吧! 世上只有一种投资只赚不赔,那就是学习!!! 传智播客于2020年升级了Java学习线路图,硬核升级,免费放送! 学完你就是中级程序员,能更快一步找到工作! 一、Java基础 JavaSE基础是Java中级程序员的起点,是帮助你从小白到懂得编程的必经之路。 在Java基础板块中有6个子模块的学...
B 站上有哪些很好的学习资源?
哇说起B站,在小九眼里就是宝藏般的存在,放年假宅在家时一天刷6、7个小时不在话下,更别提今年的跨年晚会,我简直是跪着看完的!! 最早大家聚在在B站是为了追番,再后来我在上面刷欧美新歌和漂亮小姐姐的舞蹈视频,最近两年我和周围的朋友们已经把B站当作学习教室了,而且学习成本还免费,真是个励志的好平台ヽ(.◕ฺˇд ˇ◕ฺ;)ノ 下面我们就来盘点一下B站上优质的学习资源: 综合类 Oeasy: 综合...
如何优雅地打印一个Java对象?
你好呀,我是沉默王二,一个和黄家驹一样身高,和刘德华一样颜值的程序员。虽然已经写了十多年的 Java 代码,但仍然觉得自己是个菜鸟(请允许我惭愧一下)。 在一个月黑风高的夜晚,我思前想后,觉得再也不能这么蹉跎下去了。于是痛下决心,准备通过输出的方式倒逼输入,以此来修炼自己的内功,从而进阶成为一名真正意义上的大神。与此同时,希望这些文章能够帮助到更多的读者,让大家在学习的路上不再寂寞、空虚和冷。 ...
相关热词 c#开发的dll注册 c#的反射 c# grid绑定数据源 c#多线程怎么循环 c# 鼠标左键 c# char占位符 c# 日期比较 c#16进制转换为int c#用递归求顺序表中最大 c#小型erp源代码
立即提问