ubuntu 14.04 装gtk2.0出错

我用sudo apt-get install libgtk2.0-dev想安装gtk,但出现以下错误:

Reading package lists... Done
Building dependency tree

Reading state information... Done
Some packages could not be installed. This may mean that you have
requested an impossible situation or if you are using the unstable
distribution that some required packages have not yet been created
or been moved out of Incoming.
The following information may help to resolve the situation:

The following packages have unmet dependencies:
libgtk2.0-dev : Depends: libglib2.0-dev (>= 2.27.3) but it is not going to be installed
Depends: libgdk-pixbuf2.0-dev (>= 2.21.0) but it is not going to be installed
Depends: libpango1.0-dev (>= 1.20) but it is not going to be installed
Depends: libatk1.0-dev (>= 1.29.2) but it is not going to be installed
Depends: libcairo2-dev (>= 1.6.4-6.1) but it is not going to be installed
E: Unable to correct problems, you have held broken packages.

查了网上,有1)sudo apt-get update。试过,没用

有人知道怎么解决吗?非常感谢!


2个回答

看了上面的链接,也是用同样的命令sudo apt-get install libgtk2.0-dev 。。。

试试

 sudo aptitude install libglib2.0-dev
QiaXi
Valtava 先直接试试libgtk2.0-dev 不行再从libglib开始试试
3 年多之前 回复
Csdn user default icon
上传中...
上传图片
插入图片
抄袭、复制答案,以达到刷声望分或其他目的的行为,在CSDN问答是严格禁止的,一经发现立刻封号。是时候展现真正的技术了!
其他相关推荐
ubuntu 14.04 安装eclipse后第一次就无法启动
我使用的系统是ubuntu 14.04 LTS。想搭建android开发环境。 JDK已配置成功: java version "1.7.0_71" Java(TM) SE Runtime Environment (build 1.7.0_71-b14) Java HotSpot(TM) 64-Bit Server VM (build 24.71-b01, mixed mode) 环境变量也没问题 export JAVA_HOME=/home/sr/java/jdk1.7.0_71 export JRE_HOME=$JAVA_HOME/jre export CLASSPATH=.:$JAVA_HOME/lib:$JRE_HOME/lib export PATH=$PATH:$JAVA_HOME/bin:$JRE_HOME/bin export SDK_HOME=/home/sr/java/adt-bundle-linux-x86_64-20140702/sdk export PATH=$PATH:$SDK_HOME/tools:$SDK_HOME/platform-tools export ANDROID_HOME=/home/sr/java/adt-bundle-linux-x86_64-20140702/sdk export PATH=$PATH:$ANDROID_HOME/tools:$ANDROID_HOME/platform-tools export NDK_HOME=/home/sr/java/android-ndk-r10c export PATH=$PATH:$NDK_HOME 下载的是官网里的eclipse-java-luna-SR1-linux-gtk-x86_64.tar.gz。但是不论打开哪种版本的eclipse,都会在进入的eclipse界面中卡住,无法进入主界面,没有任何提示,然后也没有任何操作反应。 当我用终端运行./eclipse时候,终端有如下反馈: org.eclipse.m2e.logback.configuration: The org.eclipse.m2e.logback.configuration bundle was activated before the state location was initialized. Will retry after the state location is initialized. 求问这是什么原因。谢谢大神们了!
Ubuntu 16.04 编译 Ncurses 6.0 报错
### Ubuntu 16.04 LTS 编译 Ncurses 6.0 报错: ``` In file included from ./curses.priv.h:325:0, from ../ncurses/lib_gen.c:19: _24273.c:843:15: error: expected ‘)’ before ‘int’ ../include/curses.h:1631:56: note: in definition of macro ‘mouse_trafo’ #define mouse_trafo(y,x,to_screen) wmouse_trafo(stdscr,y,x,to_screen) ^ Makefile:962: recipe for target '../objects/lib_gen.o' failed make[1]: *** [../objects/lib_gen.o] Error 1 make[1]: Leaving directory '/home/netsamir/Sofware/Tmux/ncurses-6.0/ncurses' Makefile:113: recipe for target 'all' failed make: *** [all] Error 2 ``` ### 系统配置 ``` $ lsb_release -a No LSB modules are available. Distributor ID: Ubuntu Description: Ubuntu 16.04 LTS Release: 16.04 Codename: xenial $ gcc -v Using built-in specs. COLLECT_GCC=gcc COLLECT_LTO_WRAPPER=/usr/lib/gcc/x86_64-linux-gnu/5/lto-wrapper Target: x86_64-linux-gnu Configured with: ../src/configure -v --with-pkgversion='Ubuntu 5.4.0-6ubuntu1~16.04.4' --with-bugurl=file:///usr/share/doc/gcc-5/README.Bugs --enable-languages=c,ada,c++,java,go,d,fortran,objc,obj-c++ --prefix=/usr --program-suffix=-5 --enable-shared --enable-linker-build-id --libexecdir=/usr/lib --without-included-gettext --enable-threads=posix --libdir=/usr/lib --enable-nls --with-sysroot=/ --enable-clocale=gnu --enable-libstdcxx-debug --enable-libstdcxx-time=yes --with-default-libstdcxx-abi=new --enable-gnu-unique-object --disable-vtable-verify --enable-libmpx --enable-plugin --with-system-zlib --disable-browser-plugin --enable-java-awt=gtk --enable-gtk-cairo --with-java-home=/usr/lib/jvm/java-1.5.0-gcj-5-amd64/jre --enable-java-home --with-jvm-root-dir=/usr/lib/jvm/java-1.5.0-gcj-5-amd64 --with-jvm-jar-dir=/usr/lib/jvm-exports/java-1.5.0-gcj-5-amd64 --with-arch-directory=amd64 --with-ecj-jar=/usr/share/java/eclipse-ecj.jar --enable-objc-gc --enable-multiarch --disable-werror --with-arch-32=i686 --with-abi=m64 --with-multilib-list=m32,m64,mx32 --enable-multilib --with-tune=generic --enable-checking=release --build=x86_64-linux-gnu --host=x86_64-linux-gnu --target=x86_64-linux-gnu Thread model: posix gcc version 5.4.0 20160609 (Ubuntu 5.4.0-6ubuntu1~16.04.4) $ g++ -v Using built-in specs. COLLECT_GCC=g++ COLLECT_LTO_WRAPPER=/usr/lib/gcc/x86_64-linux-gnu/5/lto-wrapper Target: x86_64-linux-gnu Configured with: ../src/configure -v --with-pkgversion='Ubuntu 5.4.0-6ubuntu1~16.04.4' --with-bugurl=file:///usr/share/doc/gcc-5/README.Bugs --enable-languages=c,ada,c++,java,go,d,fortran,objc,obj-c++ --prefix=/usr --program-suffix=-5 --enable-shared --enable-linker-build-id --libexecdir=/usr/lib --without-included-gettext --enable-threads=posix --libdir=/usr/lib --enable-nls --with-sysroot=/ --enable-clocale=gnu --enable-libstdcxx-debug --enable-libstdcxx-time=yes --with-default-libstdcxx-abi=new --enable-gnu-unique-object --disable-vtable-verify --enable-libmpx --enable-plugin --with-system-zlib --disable-browser-plugin --enable-java-awt=gtk --enable-gtk-cairo --with-java-home=/usr/lib/jvm/java-1.5.0-gcj-5-amd64/jre --enable-java-home --with-jvm-root-dir=/usr/lib/jvm/java-1.5.0-gcj-5-amd64 --with-jvm-jar-dir=/usr/lib/jvm-exports/java-1.5.0-gcj-5-amd64 --with-arch-directory=amd64 --with-ecj-jar=/usr/share/java/eclipse-ecj.jar --enable-objc-gc --enable-multiarch --disable-werror --with-arch-32=i686 --with-abi=m64 --with-multilib-list=m32,m64,mx32 --enable-multilib --with-tune=generic --enable-checking=release --build=x86_64-linux-gnu --host=x86_64-linux-gnu --target=x86_64-linux-gnu Thread model: posix gcc version 5.4.0 20160609 (Ubuntu 5.4.0-6ubuntu1~16.04.4) ```
ubuntu 14.04 glade 联编,什么情况?
2问题,为什么出现?怎么解决呢? 以su - root方式登陆的超级用户,运行glade: Error creating proxy: The connection is closed (g-io-error-quark, 18) Error creating proxy: The connection is closed (g-io-error-quark, 18) Error creating proxy: The connection is closed (g-io-error-quark, 18) Error creating proxy: The connection is closed (g-io-error-quark, 18) Error creating proxy: The connection is closed (g-io-error-quark, 18) GladeUI-Message: 1 missing displayable value for GtkCellRendererAccel::accel-mode GladeUI-Message: Glade needs artwork; a default icon will be used for the following classes: GtkApplicationWindow needs an icon named 'widget-gtk-applicationwindow' 其次在glade完成: GtkWindow GtkFixed GtkLabel GtkButton 运行 (PS: 19.1.c为源代码,不会错的) (19.1:2663): GLib-GObject-WARNING **: invalid (NULL) pointer instance (19.1:2663): GLib-GObject-CRITICAL **: g_signal_connect_data: assertion 'G_TYPE_CHECK_INSTANCE (instance)' failed (19.1:2663): Gtk-CRITICAL **: IA__gtk_widget_show_all: assertion 'GTK_IS_WIDGET (widget)' failed
ubuntu编译./configure错误
configure: error: Library requirements (libgnome-2.0 >= 2.0.0 libgnomeui-2.0 >= 2.0.0 gtk+-2.0 >= 2.4.0 gnome-vfs-2.0 >= 2.6.0 libglade-2.0 >= 2.3.6) not met; consider adjusting the PKG_CONFIG_PATH environment variable if your libraries are in a nonstandard prefix so pkg-config can find them.
ubuntu16.04 python2.7环境下使用matplotlib不能画图
刚安装了matplotlib,试了下下面几行代码,但不能画图,请问该怎么解决呢? ``` >>> import matplotlib.pyplot as plt >>> plt.bar(left = (0,1),height = (1,0.5)) <Container object of 2 artists> >>> plt.show() (.:14956): GLib-GIO-CRITICAL **: g_dbus_connection_register_object: assertion 'G_IS_DBUS_CONNECTION (connection)' failed (.:14956): GLib-GIO-CRITICAL **: g_dbus_connection_register_object: assertion 'G_IS_DBUS_CONNECTION (connection)' failed (.:14956): GLib-GIO-CRITICAL **: g_dbus_connection_get_unique_name: assertion 'G_IS_DBUS_CONNECTION (connection)' failed Traceback (most recent call last): File "/usr/local/lib/python2.7/dist-packages/matplotlib/backends/backend_gtk3.py", line 339, in idle_draw self.draw() File "/usr/local/lib/python2.7/dist-packages/matplotlib/backends/backend_gtk3.py", line 332, in draw self.get_property("window").process_updates (False) TypeError: Couldn't find foreign struct converter for 'cairo.Context' ```
ubuntu16.04安装opencv时,make不通过该怎么办?
cmake已经完成,情况如下: ``` cmake .. -- Detected version of GNU GCC: 54 (504) -- Found ZLIB: /usr/lib/x86_64-linux-gnu/libz.so (found suitable version "1.2.8", minimum required is "1.2.3") -- Found ZLIB: /usr/lib/x86_64-linux-gnu/libz.so (found version "1.2.8") -- Checking for module 'gstreamer-base-1.0' -- No package 'gstreamer-base-1.0' found -- Checking for module 'gstreamer-video-1.0' -- No package 'gstreamer-video-1.0' found -- Checking for module 'gstreamer-app-1.0' -- No package 'gstreamer-app-1.0' found -- Checking for module 'gstreamer-riff-1.0' -- No package 'gstreamer-riff-1.0' found -- Checking for module 'gstreamer-pbutils-1.0' -- No package 'gstreamer-pbutils-1.0' found -- Checking for module 'gstreamer-base-0.10' -- No package 'gstreamer-base-0.10' found -- Checking for module 'gstreamer-video-0.10' -- No package 'gstreamer-video-0.10' found -- Checking for module 'gstreamer-app-0.10' -- No package 'gstreamer-app-0.10' found -- Checking for module 'gstreamer-riff-0.10' -- No package 'gstreamer-riff-0.10' found -- Checking for module 'gstreamer-pbutils-0.10' -- No package 'gstreamer-pbutils-0.10' found -- Looking for linux/videodev.h -- Looking for linux/videodev.h - not found -- Looking for linux/videodev2.h -- Looking for linux/videodev2.h - found -- Looking for sys/videoio.h -- Looking for sys/videoio.h - not found -- Checking for module 'libavresample' -- No package 'libavresample' found -- Looking for libavformat/avformat.h -- Looking for libavformat/avformat.h - found -- Looking for ffmpeg/avformat.h -- Looking for ffmpeg/avformat.h - not found -- Checking for module 'libgphoto2' -- No package 'libgphoto2' found -- found IPP (ICV version): 9.0.1 [9.0.1] -- at: /home/quxutao/opencv-3.1.0/3rdparty/ippicv/unpack/ippicv_lnx -- CUDA detected: 7.5 -- CUDA NVCC target flags: -gencode;arch=compute_20,code=sm_20;-gencode;arch=compute_20,code=sm_21;-gencode;arch=compute_30,code=sm_30;-gencode;arch=compute_35,code=sm_35;-gencode;arch=compute_30,code=compute_30 -- Could NOT find Doxygen (missing: DOXYGEN_EXECUTABLE) -- To enable PlantUML support, set PLANTUML_JAR environment variable or pass -DPLANTUML_JAR=<filepath> option to cmake -- Could NOT find PythonInterp: Found unsuitable version "1.4", but required is at least "2.7" (found /home/quxutao/.virtualenvs/cv/bin/python) -- Could NOT find PythonInterp: Found unsuitable version "1.4", but required is at least "2.6" (found /home/quxutao/.virtualenvs/cv/bin/python) -- Could NOT find PythonInterp: Found unsuitable version "1.4", but required is at least "3.4" (found /home/quxutao/.virtualenvs/cv/bin/python) -- Could NOT find PythonInterp: Found unsuitable version "1.4", but required is at least "3.2" (found /home/quxutao/.virtualenvs/cv/bin/python) -- Could NOT find JNI (missing: JAVA_INCLUDE_PATH JAVA_INCLUDE_PATH2 JAVA_AWT_INCLUDE_PATH) -- Could NOT find Matlab (missing: MATLAB_MEX_SCRIPT MATLAB_INCLUDE_DIRS MATLAB_ROOT_DIR MATLAB_LIBRARIES MATLAB_LIBRARY_DIRS MATLAB_MEXEXT MATLAB_ARCH MATLAB_BIN) -- VTK is not found. Please set -DVTK_DIR in CMake to VTK build directory, or to VTK install subdirectory with VTKConfig.cmake file -- Caffe: NO -- Protobuf: YES -- Glog: NO -- HDF5: YES -- Module opencv_sfm disabled because the following dependencies are not found: Eigen Glog/Gflags -- Tesseract: NO -- HDF5: YES -- Build libprotobuf from sources: -- The protocol buffer compiler not found -- Tesseract: NO -- -- General configuration for OpenCV 3.1.0 ===================================== -- Version control: unknown -- -- Platform: -- Host: Linux 4.15.0-47-generic x86_64 -- CMake: 3.5.1 -- CMake generator: Unix Makefiles -- CMake build tool: /usr/bin/make -- Configuration: RELEASE -- -- C/C++: -- Built as dynamic libs?: YES -- C++ Compiler: /usr/bin/c++ (ver 5.4.0) -- C++ flags (Release): -fsigned-char -W -Wall -Werror=return-type -Werror=non-virtual-dtor -Werror=address -Werror=sequence-point -Wformat -Werror=format-security -Wmissing-declarations -Wundef -Winit-self -Wpointer-arith -Wshadow -Wsign-promo -Wno-narrowing -Wno-delete-non-virtual-dtor -fdiagnostics-show-option -Wno-long-long -pthread -fomit-frame-pointer -msse -msse2 -mno-avx -msse3 -mno-ssse3 -mno-sse4.1 -mno-sse4.2 -ffunction-sections -fvisibility=hidden -fvisibility-inlines-hidden -O3 -DNDEBUG -DNDEBUG -- C++ flags (Debug): -fsigned-char -W -Wall -Werror=return-type -Werror=non-virtual-dtor -Werror=address -Werror=sequence-point -Wformat -Werror=format-security -Wmissing-declarations -Wundef -Winit-self -Wpointer-arith -Wshadow -Wsign-promo -Wno-narrowing -Wno-delete-non-virtual-dtor -fdiagnostics-show-option -Wno-long-long -pthread -fomit-frame-pointer -msse -msse2 -mno-avx -msse3 -mno-ssse3 -mno-sse4.1 -mno-sse4.2 -ffunction-sections -fvisibility=hidden -fvisibility-inlines-hidden -g -O0 -DDEBUG -D_DEBUG -- C Compiler: /usr/bin/cc -- C flags (Release): -fsigned-char -W -Wall -Werror=return-type -Werror=non-virtual-dtor -Werror=address -Werror=sequence-point -Wformat -Werror=format-security -Wmissing-declarations -Wmissing-prototypes -Wstrict-prototypes -Wundef -Winit-self -Wpointer-arith -Wshadow -Wno-narrowing -fdiagnostics-show-option -Wno-long-long -pthread -fomit-frame-pointer -msse -msse2 -mno-avx -msse3 -mno-ssse3 -mno-sse4.1 -mno-sse4.2 -ffunction-sections -fvisibility=hidden -O3 -DNDEBUG -DNDEBUG -- C flags (Debug): -fsigned-char -W -Wall -Werror=return-type -Werror=non-virtual-dtor -Werror=address -Werror=sequence-point -Wformat -Werror=format-security -Wmissing-declarations -Wmissing-prototypes -Wstrict-prototypes -Wundef -Winit-self -Wpointer-arith -Wshadow -Wno-narrowing -fdiagnostics-show-option -Wno-long-long -pthread -fomit-frame-pointer -msse -msse2 -mno-avx -msse3 -mno-ssse3 -mno-sse4.1 -mno-sse4.2 -ffunction-sections -fvisibility=hidden -g -O0 -DDEBUG -D_DEBUG -- Linker flags (Release): -- Linker flags (Debug): -- Precompiled headers: YES -- Extra dependencies: /usr/lib/x86_64-linux-gnu/libpng.so /usr/lib/x86_64-linux-gnu/libtiff.so /usr/lib/x86_64-linux-gnu/libjasper.so /usr/lib/x86_64-linux-gnu/libjpeg.so gtk-3 gdk-3 pangocairo-1.0 pango-1.0 atk-1.0 cairo-gobject cairo gdk_pixbuf-2.0 gio-2.0 gobject-2.0 gthread-2.0 glib-2.0 dc1394 v4l1 v4l2 avcodec-ffmpeg avformat-ffmpeg avutil-ffmpeg swscale-ffmpeg /usr/lib/x86_64-linux-gnu/libbz2.so /usr/lib/x86_64-linux-gnu/hdf5/openmpi/lib/libhdf5.so /usr/lib/x86_64-linux-gnu/libsz.so /usr/lib/x86_64-linux-gnu/libz.so /usr/lib/x86_64-linux-gnu/libdl.so /usr/lib/x86_64-linux-gnu/libm.so dl m pthread rt cudart nppc nppi npps cufft -L/usr/lib/x86_64-linux-gnu -- 3rdparty dependencies: libwebp IlmImf libprotobuf -- -- OpenCV modules: -- To be built: cudev core cudaarithm flann hdf imgproc ml reg surface_matching video cudabgsegm cudafilters cudaimgproc cudawarping dnn fuzzy imgcodecs photo shape videoio cudacodec highgui objdetect plot ts xobjdetect xphoto bgsegm bioinspired dpm face features2d line_descriptor saliency text calib3d ccalib cudafeatures2d cudalegacy cudaobjdetect cudaoptflow cudastereo datasets rgbd stereo structured_light superres tracking videostab xfeatures2d ximgproc aruco optflow stitching -- Disabled: world contrib_world -- Disabled by dependency: - -- Unavailable: java python2 python3 viz cvv matlab sfm -- -- GUI: -- QT: NO -- GTK+ 3.x: YES (ver 3.18.9) -- GThread : YES (ver 2.48.2) -- GtkGlExt: NO -- OpenGL support: NO -- VTK support: NO -- -- Media I/O: -- ZLib: /usr/lib/x86_64-linux-gnu/libz.so (ver 1.2.8) -- JPEG: /usr/lib/x86_64-linux-gnu/libjpeg.so (ver ) -- WEBP: build (ver 0.3.1) -- PNG: /usr/lib/x86_64-linux-gnu/libpng.so (ver 1.2.54) -- TIFF: /usr/lib/x86_64-linux-gnu/libtiff.so (ver 42 - 4.0.6) -- JPEG 2000: /usr/lib/x86_64-linux-gnu/libjasper.so (ver 1.900.1) -- OpenEXR: build (ver 1.7.1) -- GDAL: NO -- -- Video I/O: -- DC1394 1.x: NO -- DC1394 2.x: YES (ver 2.2.4) -- FFMPEG: YES -- codec: YES (ver 56.60.100) -- format: YES (ver 56.40.101) -- util: YES (ver 54.31.100) -- swscale: YES (ver 3.1.101) -- resample: NO -- gentoo-style: YES -- GStreamer: NO -- OpenNI: NO -- OpenNI PrimeSensor Modules: NO -- OpenNI2: NO -- PvAPI: NO -- GigEVisionSDK: NO -- UniCap: NO -- UniCap ucil: NO -- V4L/V4L2: Using libv4l1 (ver 1.10.0) / libv4l2 (ver 1.10.0) -- XIMEA: NO -- Xine: NO -- gPhoto2: NO -- -- Parallel framework: pthreads -- -- Other third-party libraries: -- Use IPP: 9.0.1 [9.0.1] -- at: /home/quxutao/opencv-3.1.0/3rdparty/ippicv/unpack/ippicv_lnx -- Use IPP Async: NO -- Use VA: NO -- Use Intel VA-API/OpenCL: NO -- Use Eigen: NO -- Use Cuda: YES (ver 7.5) -- Use OpenCL: YES -- Use custom HAL: NO -- -- NVIDIA CUDA -- Use CUFFT: YES -- Use CUBLAS: NO -- USE NVCUVID: NO -- NVIDIA GPU arch: 20 21 30 35 -- NVIDIA PTX archs: 30 -- Use fast math: NO -- -- OpenCL: -- Version: dynamic -- Include path: /home/quxutao/opencv-3.1.0/3rdparty/include/opencl/1.2 -- Use AMDFFT: NO -- Use AMDBLAS: NO -- -- Python 2: -- Interpreter: NO -- -- Python 3: -- Interpreter: NO -- -- Python (for build): NO -- -- Java: -- ant: NO -- JNI: NO -- Java wrappers: NO -- Java tests: NO -- -- Matlab: Matlab not found or implicitly disabled -- -- Documentation: -- Doxygen: NO -- PlantUML: NO -- -- Tests and samples: -- Tests: YES -- Performance tests: YES -- C/C++ Examples: YES -- -- Install path: /usr/local -- -- cvconfig.h is in: /home/quxutao/opencv-3.1.0/build -- ----------------------------------------------------------------- -- -- Configuring done -- Generating done -- Build files have been written to: /home/quxutao/opencv-3.1.0/build ``` 但是make的时候,就报错: ``` make [ 4%] Built target libwebp [ 4%] Built target IlmImf [ 4%] Built target opencv_cudev [ 4%] Built target opencv_core_pch_dephelp [ 4%] Built target pch_Generate_opencv_core [ 4%] Building NVCC (Device) object modules/core/CMakeFiles/cuda_compile.dir/src/cuda/cuda_compile_generated_gpu_mat.cu.o /usr/include/string.h: In function ‘void* __mempcpy_inline(void*, const void*, size_t)’: /usr/include/string.h:652:42: error: ‘memcpy’ was not declared in this scope return (char *) memcpy (__dest, __src, __n) + __n; ^ CMake Error at cuda_compile_generated_gpu_mat.cu.o.cmake:266 (message): Error generating file /home/quxutao/opencv-3.1.0/build/modules/core/CMakeFiles/cuda_compile.dir/src/cuda/./cuda_compile_generated_gpu_mat.cu.o modules/core/CMakeFiles/opencv_core.dir/build.make:399: recipe for target 'modules/core/CMakeFiles/cuda_compile.dir/src/cuda/cuda_compile_generated_gpu_mat.cu.o' failed make[2]: *** [modules/core/CMakeFiles/cuda_compile.dir/src/cuda/cuda_compile_generated_gpu_mat.cu.o] Error 1 CMakeFiles/Makefile2:2307: recipe for target 'modules/core/CMakeFiles/opencv_core.dir/all' failed make[1]: *** [modules/core/CMakeFiles/opencv_core.dir/all] Error 2 Makefile:160: recipe for target 'all' failed make: *** [all] Error 2 ``` 弄了一下午了,没有找到相关的解决办法。我的cuda是7.5,其实不用GPU也可以的,我只是想用KAZE滤波。。。跪求大神帮忙。。。
在ubuntu下编译一个开源软件,./configure时出现错误,求指教
显示的错误: checking for libgnome-2.0 >= 2.0.0 libgnomeui-2.0 >= 2.0.0 gtk+-2.0 >= 2.4.0 gnome-vfs-2.0 >= 2.6.0 libglade-2.0 >= 2.3.6... Package libgnome-2.0 was not found in the pkg-config search path. Perhaps you should add the directory containing `libgnome-2.0.pc' to the PKG_CONFIG_PATH environment variable No package 'libgnome-2.0' found Package libgnomeui-2.0 was not found in the pkg-config search path. Perhaps you should add the directory containing `libgnomeui-2.0.pc' to the PKG_CONFIG_PATH environment variable No package 'libgnomeui-2.0' found Package gnome-vfs-2.0 was not found in the pkg-config search path. Perhaps you should add the directory containing `gnome-vfs-2.0.pc' to the PKG_CONFIG_PATH environment variable No package 'gnome-vfs-2.0' found configure: error: Library requirements (libgnome-2.0 >= 2.0.0 libgnomeui-2.0 >= 2.0.0 gtk+-2.0 >= 2.4.0 gnome-vfs-2.0 >= 2.6.0 libglade-2.0 >= 2.3.6) not met; consider adjusting the PKG_CONFIG_PATH environment variable if your libraries are in a nonstandard prefix so pkg-config can find them. 可是找不到这些.pc文件,把缺少的.pc文件安装上去,在安装时会缺少其他文件。 不知道该怎么办
Ubuntu启动 eclipse 失败 JVM terminated. Exit code=13
错误码: JVM terminated. Exit code=13 /usr/java/jdk1.8.0_20/bin/java -Dosgi.requiredJavaVersion=1.7 -XX:MaxPermSize=256m -Xms40m -Xmx512m -jar /opt/eclipse//plugins/org.eclipse.equinox.launcher_1.3.100.v20150511-1540.jar -os linux -ws gtk -arch x86_64 -showsplash /opt/eclipse//plugins/org.eclipse.platform_4.5.0.v20150603-2000/splash.bmp -launcher /opt/eclipse/eclipse -name Eclipse --launcher.library /opt/eclipse//plugins/org.eclipse.equinox.launcher.gtk.linux.x86_64_1.1.300.v20150602-1417/eclipse_1612.so -startup /opt/eclipse//plugins/org.eclipse.equinox.launcher_1.3.100.v20150511-1540.jar --launcher.appendVmargs -exitdata 33800f -product org.eclipse.epp.package.jee.product -vm /usr/java/jdk1.8.0_20/bin/java -vmargs -Dosgi.requiredJavaVersion=1.7 -XX:MaxPermSize=256m -Xms40m -Xmx512m -jar /opt/eclipse//plugins/org.eclipse.equinox.launcher_1.3.100.v20150511-1540.jar jdk和eclipse均为64位..系统为Ubuntu 15.04
装gtk+-3.0时出现的 No space left on device
gzip: stdout: No space left on device E: mkinitramfs failure cpio 141 gzip 1 update-initramfs: failed for /boot/initrd.img-4.8.0-41-generic with 1. run-parts: /etc/kernel/postinst.d/initramfs-tools exited with return code 1 Failed to process /etc/kernel/postinst.d at /var/lib/dpkg/info/linux-image-4.8.0-41-generic.postinst line 1052. dpkg: 处理软件包 linux-image-4.8.0-41-generic (--configure)时出错: 子进程 已安装 post-installation 脚本 返回错误状态 2 由于已经达到 MaxReports 限制,没有写入 apport 报告。 dpkg: 依赖关系问题使得 linux-image-extra-4.8.0-41-generic 的配置工作不能继续: linux-image-extra-4.8.0-41-generic 依赖于 linux-image-4.8.0-41-generic;然而: 软件包 linux-image-4.8.0-41-generic 尚未配置。 dpkg: 处理软件包 linux-image-extra-4.8.0-41-generic (--configure)时出错: 依赖关系问题 - 仍未被配置 由于已经达到 MaxReports 限制,没有写入 apport 报告。 dpkg: 依赖关系问题使得 linux-image-generic-hwe-16.04 的配置工作不能继续: linux-image-generic-hwe-16.04 依赖于 linux-image-4.8.0-41-generic;然而: 软件包 linux-image-4.8.0-41-generic 尚未配置。 linux-image-generic-hwe-16.04 依赖于 linux-image-extra-4.8.0-41-generic;然而: 软件包 linux-image-extra-4.8.0-41-generic 尚未配置。 dpkg: 处理软件包 linux-image-generic-hwe-16.04 (--configure)时出错: 依赖关系问题 - 仍未被配置 由于已经达到 MaxReports 限制,没有写入 apport 报告。 由于已经达到 MaxReports 限制,没有写入 apport 报告。 dpkg: 依赖关系问题使得 linux-generic-hwe-16.04 的配置工作不能继续: linux-generic-hwe-16.04 依赖于 linux-image-generic-hwe-16.04 (= 4.8.0.41.12);然而: 软件包 linux-image-generic-hwe-16.04 尚未配置。 dpkg: 处理软件包 linux-generic-hwe-16.04 (--configure)时出错: 依赖关系问题 - 仍未被配置 在处理时有错误发生: linux-image-4.4.0-66-generic linux-image-extra-4.4.0-66-generic linux-image-generic linux-generic linux-image-4.8.0-41-generic linux-image-extra-4.8.0-41-generic linux-image-generic-hwe-16.04 linux-generic-hwe-16.04 E: Sub-process /usr/bin/dpkg returned an error code (1) 本人就是个小白,求个大神给指导,网上的一些方法尝试啦,并没有什么用
求问ubuntu 13.10下ns3.8安装遇到python2.7-config意外停止
运行./build.py时,报错说“对不起,应用程序i386-linux-gnu-python2.7-config意外停止” 所以就build failed,遇见错误的地方如下: # Build NS-3 Entering directory `./ns-3.8' Note: configuring ns-3 without NSC => python waf configure --with-regression-traces ../ns-3.8-ref-traces --with-pybindgen ../pybindgen-0.14.1 Checking for program gcc or cc : /usr/bin/gcc Checking for program cpp : /usr/bin/cpp Checking for program ar : /usr/bin/ar Checking for program ranlib : /usr/bin/ranlib Checking for gcc : ok Checking for program g++ or c++ : /usr/bin/g++ Checking for program ar : /usr/bin/ar Checking for program ranlib : /usr/bin/ranlib Checking for g++ : ok Checking for program pkg-config : /usr/bin/pkg-config Checking for regression traces location : ok ../ns-3.8-ref-traces (given) Checking for -Wl,--soname=foo support : yes Checking for header stdlib.h : yes Checking for header signal.h : yes Checking for header pthread.h : yes Checking for high precision time implementation : 128-bit integer Checking for header stdint.h : yes Checking for header inttypes.h : yes Checking for header sys/inttypes.h : not found Checking for library rt : yes Checking for header netpacket/packet.h : yes Checking for header linux/if_tun.h : yes Checking for pkg-config flags for GTK_CONFIG_STORE : ok Checking for pkg-config flags for LIBXML2 : ok Checking for library sqlite3 : yes Checking for NSC location : not found Checking for header sys/socket.h : yes Checking for header netinet/in.h : yes Checking for program python : /usr/bin/python Checking for Python version >= 2.3 : ok 2.7.5 Checking for library python2.7 : yes Checking for program python2.7-config : /usr/bin/python2.7-config File "/usr/bin/python2.7-config", line 5 echo "Usage: $0 --prefix|--exec-prefix|--includes|--libs|--cflags|--ldflags|--extension-suffix|--help|--configdir" ^ SyntaxError: invalid syntax Traceback (most recent call last): File "waf", line 158, in <module> Scripting.prepare(t, cwd, VERSION, wafdir) File "/home/daisy/workspace/eclipseWorkspace/ns3.8/ns-3.8/.waf-1.5.16-e6d03192b5ddfa5ef2c8d65308e48e42/wafadmin/Scripting.py", line 105, in prepare prepare_impl(t,cwd,ver,wafdir)
如何交叉编译arm-linux版本的wxPython-2.8
宿主机是Ubuntu12.04lts,已经交叉编译了arm版本的python,wxWidgets,gtk+等,现在不清楚如何交叉编译wxPython,请指教
·Robotframework」运行ride.py 报错 麻烦大神们看一下!
环境:Ubuntu 16.04 折腾了好久pip install robotframework-ride 才成功 运行ride.py又又又报错了 心累 麻烦各位帮我看看 指点迷津 ``` pip install robotframework-ride 提示 Looking in indexes: https://pypi.tuna.tsinghua.edu.cn/simple Requirement already satisfied: robotframework-ride in /usr/local/lib/python2.7/dist-packages (1.7.4b1.dev1) Requirement already satisfied: wxPython in /usr/lib/python2.7/dist-packages/wx-2.8-gtk2-unicode (from robotframework-ride) (2.8.12.1) Requirement already satisfied: PyPubSub in /usr/local/lib/python2.7/dist-packages (from robotframework-ride) (3.3.0) Requirement already satisfied: Pygments in /usr/local/lib/python2.7/dist-packages (from robotframework-ride) (2.4.2 ``` ``` ride.py后 ``` ![图片说明](https://img-ask.csdn.net/upload/201907/18/1563447987_206124.png) 报错:Traceback (most recent call last): File "/usr/local/lib/python2.7/dist-packages/robotide/__init__.py", line 83, in main _run(inpath, not noupdatecheck, debug_console) File "/usr/local/lib/python2.7/dist-packages/robotide/__init__.py", line 112, in _run ride = RIDE(inpath, updatecheck) File "/usr/local/lib/python2.7/dist-packages/robotide/application/application.py", line 45, in __init__ wx.App.__init__(self, redirect=False) File "/usr/lib/python2.7/dist-packages/wx-2.8-gtk2-unicode/wx/_core.py", line 7981, in __init__ self._BootstrapApp() File "/usr/lib/python2.7/dist-packages/wx-2.8-gtk2-unicode/wx/_core.py", line 7555, in _BootstrapApp return _core_.PyApp__BootstrapApp(*args, **kwargs) File "/usr/local/lib/python2.7/dist-packages/robotide/application/application.py", line 55, in OnInit self.frame = RideFrame(self, self._controller) File "/usr/local/lib/python2.7/dist-packages/robotide/ui/mainframe.py", line 173, in __init__ self.Bind(wx.EVT_DIRCTRL_FILEACTIVATED, self.OnOpenFile) AttributeError: 'module' object has no attribute 'EVT_DIRCTRL_FILEACTIVATED' 麻烦各位了!!非常感谢!!
mac下编译GTK+3.0的“Hello,World”程序出错
我用homebrew下载安装好了gtk+3,然后试着编译了一个网上的示例代码: ``` #include <stdio.h> #include <stdlib.h> #include <gtk/gtk.h> static gboolean delete_event(GtkWidget * widget, GdkEvent * event, gpointer data) { gtk_main_quit(); return FALSE; } int main(int argc, char *argv[]) { GtkWidget *window; GtkWidget *label; gtk_init(&argc, &argv); window = gtk_window_new(GTK_WINDOW_TOPLEVEL); gtk_window_set_position(GTK_WINDOW(window), GTK_WIN_POS_CENTER); gtk_window_set_title(GTK_WINDOW(window), "RobberPhex"); gtk_window_set_default_size(GTK_WINDOW(window), 400, 300); g_signal_connect(window, "delete-event", G_CALLBACK(delete_event), NULL); gtk_container_set_border_width(GTK_CONTAINER(window), 10); label = gtk_label_new("Hello GTK!"); gtk_container_add(GTK_CONTAINER(window), label); gtk_widget_show(label); gtk_widget_show(window); gtk_main(); return 0; } ``` 用gcc编译: ``` gcc testGTK.c -o testGTK `pkg-config --cflags --libs gtk+-3.0` ``` 结果运行的时候出错了,错误信息是: ``` Dynamic session lookup supported but failed: launchd did not provide a socket path, verify that org.freedesktop.dbus-session.plist is loaded! (testGTK:62547): Gtk-WARNING **: cannot open display: ``` 结果在Google找了好久都没找到为什么会这样 T T
请问如何解决ubunt14.04配置opencv报错(虚拟机)(gedit:11818)
按配置教程是要: 安装完成后需要对系统相关环境变量进行配置: sudo gedit /etc/ld.so.conf.d/opencv.conf 将以下内容添加到最后: /usr/local/lib 报错如下,输入sudo gedit /etc/ld.so.conf.d/opencv.conf后打开了一个文件,在里面我输入了/usr/local/lib,出现报错: (gedit:11818): IBUS-WARNING **: The owner of /home/aa/.config/ibus/bus is not root!  (gedit:11818): Gtk-WARNING **: Calling Inhibit failed: GDBus.Error:org.freedesktop.DBus.Error.ServiceUnknown: The name org.gnome.SessionManager was not provided by any .service files 谢谢
各位朋友好,请教ubuntu系统python3.4环境下安装matplotlib报错的解决办法
具体的问题是这样的: 我的系统是Ubuntu14.04 的64位系统,python3.4版本下,想使用matplotlib来做图。 由于matplotlib依赖numpy和python的图像库PIL,因此我先安装numpy和PIL然后,再安装matplotlib, 这里附上我的安装matplotlib的shell命令 #安装科学计算库numpy sudo pip3 install numpy #安装图像处理库PIL sudo apt-get install python3.4-dev -y sudo apt-get install libjpeg8-dev zlib1g-dev libfreetype6-dev -y sudo ln -s /usr/lib/x86_64-linux-gnu/libjpeg.so /usr/lib sudo ln -s /usr/lib/x86_64-linux-gnu/libfreetype.so /usr/lib sudo ln -s /usr/lib/x86_64-linux-gnu/libz.so /usr/lib sudo apt-get install python3-pil #安装画图库matplotlib sudo pip3 install matplotlib 但是发现虽然安装成功(在python3的shell交互环境下, import matplotlib 是可以的),但是 执行如下语句 from matplotlib import pyplot as plt 报错: "/usr/local/lib/python3.4/dist-packages/matplotlib-1.5.1-py3.4-linux-x86_64.egg/matplotlib/backends/backend_gtk3.py", line 58, in <module> cursors.MOVE : Gdk.Cursor.new(Gdk.CursorType.FLEUR), TypeError: constructor returned NULL 希望各位朋友能指点一下,十分感谢
Ubuntu 安装 Ibus后,重启黑屏.
我按照官网上的步骤: http://wiki.ubuntu.org.cn/Ibus 1,在终端输入命令: sudo apt-get install ibus ibus-clutter ibus-gtk ibus-gtk3 ibus-qt4 [编辑] 启用IBus框架: 2,在终端输入: im-switch -s ibus 3,重新启动X(也可以重启电脑) 结果,重启后Ubuntu就黑屏了,求大神指点啊!配置了一天的环境了
运行基于qt的opencv程序时提示安装libgt2.0-dev
OpenCV Error: Unspecified error (The function is not implemented. Rebuild the library with Windows, GTK+ 2.x or Carbon support. If you are on Ubuntu or Debian, install libgtk2.0-dev and pkg-config, then re-run cmake or configure script) in cvNamedWindow, file /work/tools/OpenCV-2.3.1/modules/highgui/src/window.cpp, line 275 terminate called after throwing an instance of 'cv::Exception' what(): /work/tools/OpenCV-2.3.1/modules/highgui/src/window.cpp:275: error: (-2) The function is not implemented. Rebuild the library with Windows, GTK+ 2.x or Carbon support. If you are on Ubuntu or Debian, install libgtk2.0-dev and pkg-config, then re-run cmake or configure script in function cvNamedWindow 可是我这是用qmake编译出来的可执行文件啊,为什么还要安装gtk?另外我安装了pkg-config,qte的移植经测试也是正确的
终于明白阿里百度这样的大公司,为什么面试经常拿ThreadLocal考验求职者了
点击上面↑「爱开发」关注我们每晚10点,捕获技术思考和创业资源洞察什么是ThreadLocalThreadLocal是一个本地线程副本变量工具类,各个线程都拥有一份线程私...
《奇巧淫技》系列-python!!每天早上八点自动发送天气预报邮件到QQ邮箱
将代码部署服务器,每日早上定时获取到天气数据,并发送到邮箱。 也可以说是一个小人工智障。 思路可以运用在不同地方,主要介绍的是思路。
面试官问我:什么是消息队列?什么场景需要他?用了会出现什么问题?
你知道的越多,你不知道的越多 点赞再看,养成习惯 GitHub上已经开源 https://github.com/JavaFamily 有一线大厂面试点脑图、个人联系方式和人才交流群,欢迎Star和完善 前言 消息队列在互联网技术存储方面使用如此广泛,几乎所有的后端技术面试官都要在消息队列的使用和原理方面对小伙伴们进行360°的刁难。 作为一个在互联网公司面一次拿一次Offer的面霸...
8年经验面试官详解 Java 面试秘诀
作者 |胡书敏 责编 | 刘静 出品 | CSDN(ID:CSDNnews) 本人目前在一家知名外企担任架构师,而且最近八年来,在多家外企和互联网公司担任Java技术面试官,前后累计面试了有两三百位候选人。在本文里,就将结合本人的面试经验,针对Java初学者、Java初级开发和Java开发,给出若干准备简历和准备面试的建议。 Java程序员准备和投递简历的实...
究竟你适不适合买Mac?
我清晰的记得,刚买的macbook pro回到家,开机后第一件事情,就是上了淘宝网,花了500元钱,找了一个上门维修电脑的师傅,上门给我装了一个windows系统。。。。。。 表砍我。。。 当时买mac的初衷,只是想要个固态硬盘的笔记本,用来运行一些复杂的扑克软件。而看了当时所有的SSD笔记本后,最终决定,还是买个好(xiong)看(da)的。 已经有好几个朋友问我mba怎么样了,所以今天尽量客观...
MyBatis研习录(01)——MyBatis概述与入门
MyBatis 是一款优秀的持久层框架,它支持定制化 SQL、存储过程以及高级映射。MyBatis原本是apache的一个开源项目iBatis, 2010年该项目由apache software foundation 迁移到了google code并改名为MyBatis 。2013年11月MyBatis又迁移到Github。
程序员一般通过什么途径接私活?
二哥,你好,我想知道一般程序猿都如何接私活,我也想接,能告诉我一些方法吗? 上面是一个读者“烦不烦”问我的一个问题。其实不止是“烦不烦”,还有很多读者问过我类似这样的问题。 我接的私活不算多,挣到的钱也没有多少,加起来不到 20W。说实话,这个数目说出来我是有点心虚的,毕竟太少了,大家轻喷。但我想,恰好配得上“一般程序员”这个称号啊。毕竟苍蝇再小也是肉,我也算是有经验的人了。 唾弃接私活、做外...
Python爬虫爬取淘宝,京东商品信息
小编是一个理科生,不善长说一些废话。简单介绍下原理然后直接上代码。 使用的工具(Python+pycharm2019.3+selenium+xpath+chromedriver)其中要使用pycharm也可以私聊我selenium是一个框架可以通过pip下载 pip installselenium -ihttps://pypi.tuna.tsinghua.edu.cn/simple/ ...
阿里程序员写了一个新手都写不出的低级bug,被骂惨了。
这种新手都不会范的错,居然被一个工作好几年的小伙子写出来,差点被当场开除了。
Java工作4年来应聘要16K最后没要,细节如下。。。
前奏: 今天2B哥和大家分享一位前几天面试的一位应聘者,工作4年26岁,统招本科。 以下就是他的简历和面试情况。 基本情况: 专业技能: 1、&nbsp;熟悉Sping了解SpringMVC、SpringBoot、Mybatis等框架、了解SpringCloud微服务 2、&nbsp;熟悉常用项目管理工具:SVN、GIT、MAVEN、Jenkins 3、&nbsp;熟悉Nginx、tomca...
Python爬虫精简步骤1 获取数据
爬虫,从本质上来说,就是利用程序在网上拿到对我们有价值的数据。 爬虫能做很多事,能做商业分析,也能做生活助手,比如:分析北京近两年二手房成交均价是多少?广州的Python工程师平均薪资是多少?北京哪家餐厅粤菜最好吃?等等。 这是个人利用爬虫所做到的事情,而公司,同样可以利用爬虫来实现巨大的商业价值。比如你所熟悉的搜索引擎——百度和谷歌,它们的核心技术之一也是爬虫,而且是超级爬虫。 从搜索巨头到人工...
Python绘图,圣诞树,花,爱心 | Turtle篇
每周每日,分享Python实战代码,入门资料,进阶资料,基础语法,爬虫,数据分析,web网站,机器学习,深度学习等等。 公众号回复【进群】沟通交流吧,QQ扫码进群学习吧 微信群 QQ群 1.画圣诞树 import turtle screen = turtle.Screen() screen.setup(800,600) circle = turtle.Turtle()...
作为一个程序员,CPU的这些硬核知识你必须会!
CPU对每个程序员来说,是个既熟悉又陌生的东西? 如果你只知道CPU是中央处理器的话,那可能对你并没有什么用,那么作为程序员的我们,必须要搞懂的就是CPU这家伙是如何运行的,尤其要搞懂它里面的寄存器是怎么一回事,因为这将让你从底层明白程序的运行机制。 随我一起,来好好认识下CPU这货吧 把CPU掰开来看 对于CPU来说,我们首先就要搞明白它是怎么回事,也就是它的内部构造,当然,CPU那么牛的一个东...
破14亿,Python分析我国存在哪些人口危机!
一、背景 二、爬取数据 三、数据分析 1、总人口 2、男女人口比例 3、人口城镇化 4、人口增长率 5、人口老化(抚养比) 6、各省人口 7、世界人口 四、遇到的问题 遇到的问题 1、数据分页,需要获取从1949-2018年数据,观察到有近20年参数:LAST20,由此推测获取近70年的参数可设置为:LAST70 2、2019年数据没有放上去,可以手动添加上去 3、将数据进行 行列转换 4、列名...
web前端javascript+jquery知识点总结
1.Javascript 语法.用途 javascript 在前端网页中占有非常重要的地位,可以用于验证表单,制作特效等功能,它是一种描述语言,也是一种基于对象(Object)和事件驱动并具有安全性的脚本语言 ...
Python实战:抓肺炎疫情实时数据,画2019-nCoV疫情地图
今天,群里白垩老师问如何用python画武汉肺炎疫情地图。白垩老师是研究海洋生态与地球生物的学者,国家重点实验室成员,于不惑之年学习python,实为我等学习楷模。先前我并没有关注武汉肺炎的具体数据,也没有画过类似的数据分布图。于是就拿了两个小时,专门研究了一下,遂成此文。
听说想当黑客的都玩过这个Monyer游戏(1~14攻略)
第零关 进入传送门开始第0关(游戏链接) 请点击链接进入第1关: 连接在左边→ ←连接在右边 看不到啊。。。。(只能看到一堆大佬做完的留名,也能看到菜鸡的我,在后面~~) 直接fn+f12吧 &lt;span&gt;连接在左边→&lt;/span&gt; &lt;a href="first.php"&gt;&lt;/a&gt; &lt;span&gt;←连接在右边&lt;/span&gt; o...
在家远程办公效率低?那你一定要收好这个「在家办公」神器!
相信大家都已经收到国务院延长春节假期的消息,接下来,在家远程办公可能将会持续一段时间。 但是问题来了。远程办公不是人在电脑前就当坐班了,相反,对于沟通效率,文件协作,以及信息安全都有着极高的要求。有着非常多的挑战,比如: 1在异地互相不见面的会议上,如何提高沟通效率? 2文件之间的来往反馈如何做到及时性?如何保证信息安全? 3如何规划安排每天工作,以及如何进行成果验收? ...... ...
作为一个程序员,内存和磁盘的这些事情,你不得不知道啊!!!
截止目前,我已经分享了如下几篇文章: 一个程序在计算机中是如何运行的?超级干货!!! 作为一个程序员,CPU的这些硬核知识你必须会! 作为一个程序员,内存的这些硬核知识你必须懂! 这些知识可以说是我们之前都不太重视的基础知识,可能大家在上大学的时候都学习过了,但是嘞,当时由于老师讲解的没那么有趣,又加上这些知识本身就比较枯燥,所以嘞,大家当初几乎等于没学。 再说啦,学习这些,也看不出来有什么用啊!...
渗透测试-灰鸽子远控木马
木马概述 灰鸽子( Huigezi),原本该软件适用于公司和家庭管理,其功能十分强大,不但能监视摄像头、键盘记录、监控桌面、文件操作等。还提供了黑客专用功能,如:伪装系统图标、随意更换启动项名称和表述、随意更换端口、运行后自删除、毫无提示安装等,并采用反弹链接这种缺陷设计,使得使用者拥有最高权限,一经破解即无法控制。最终导致被黑客恶意使用。原作者的灰鸽子被定义为是一款集多种控制方式于一体的木马程序...
Python:爬取疫情每日数据
前言 目前每天各大平台,如腾讯、今日头条都会更新疫情每日数据,他们的数据源都是一样的,主要都是通过各地的卫健委官网通报。 以全国、湖北和上海为例,分别为以下三个网站: 国家卫健委官网:http://www.nhc.gov.cn/xcs/yqtb/list_gzbd.shtml 湖北卫健委官网:http://wjw.hubei.gov.cn/bmdt/ztzl/fkxxgzbdgrfyyq/xxfb...
这个世界上人真的分三六九等,你信吗?
偶然间,在知乎上看到一个问题 一时间,勾起了我深深的回忆。 以前在厂里打过两次工,做过家教,干过辅导班,做过中介。零下几度的晚上,贴过广告,满脸、满手地长冻疮。 再回首那段岁月,虽然苦,但让我学会了坚持和忍耐。让我明白了,在这个世界上,无论环境多么的恶劣,只要心存希望,星星之火,亦可燎原。 下文是原回答,希望能对你能有所启发。 如果我说,这个世界上人真的分三六九等,...
B 站上有哪些很好的学习资源?
哇说起B站,在小九眼里就是宝藏般的存在,放年假宅在家时一天刷6、7个小时不在话下,更别提今年的跨年晚会,我简直是跪着看完的!! 最早大家聚在在B站是为了追番,再后来我在上面刷欧美新歌和漂亮小姐姐的舞蹈视频,最近两年我和周围的朋友们已经把B站当作学习教室了,而且学习成本还免费,真是个励志的好平台ヽ(.◕ฺˇд ˇ◕ฺ;)ノ 下面我们就来盘点一下B站上优质的学习资源: 综合类 Oeasy: 综合...
雷火神山直播超两亿,Web播放器事件监听是怎么实现的?
Web播放器解决了在手机浏览器和PC浏览器上播放音视频数据的问题,让视音频内容可以不依赖用户安装App,就能进行播放以及在社交平台进行传播。在视频业务大数据平台中,播放数据的统计分析非常重要,所以Web播放器在使用过程中,需要对其内部的数据进行收集并上报至服务端,此时,就需要对发生在其内部的一些播放行为进行事件监听。 那么Web播放器事件监听是怎么实现的呢? 01 监听事件明细表 名...
3万字总结,Mysql优化之精髓
本文知识点较多,篇幅较长,请耐心学习 MySQL已经成为时下关系型数据库产品的中坚力量,备受互联网大厂的青睐,出门面试想进BAT,想拿高工资,不会点MySQL优化知识,拿offer的成功率会大大下降。 为什么要优化 系统的吞吐量瓶颈往往出现在数据库的访问速度上 随着应用程序的运行,数据库的中的数据会越来越多,处理时间会相应变慢 数据是存放在磁盘上的,读写速度无法和内存相比 如何优化 设计...
Python新型冠状病毒疫情数据自动爬取+统计+发送报告+数据屏幕(三)发送篇
今天介绍的项目是使用 Itchat 发送统计报告 项目功能设计: 定时爬取疫情数据存入Mysql 进行数据分析制作疫情报告 使用itchat给亲人朋友发送分析报告 基于Django做数据屏幕 使用Tableau做数据分析 来看看最终效果 目前已经完成,预计2月12日前更新 使用 itchat 发送数据统计报告 itchat 是一个基于 web微信的一个框架,但微信官方并不允许使用这...
作为程序员的我,大学四年一直自学,全靠这些实用工具和学习网站!
我本人因为高中沉迷于爱情,导致学业荒废,后来高考,毫无疑问进入了一所普普通通的大学,实在惭愧???? 我又是那么好强,现在学历不行,没办法改变的事情了,所以,进入大学开始,我就下定决心,一定要让自己掌握更多的技能,尤其选择了计算机这个行业,一定要多学习技术。 在进入大学学习不久后,我就认清了一个现实:我这个大学的整体教学质量和学习风气,真的一言难尽,懂的人自然知道怎么回事? 怎么办?我该如何更好的提升自...
粒子群算法求解物流配送路线问题(python)
1.Matlab实现粒子群算法的程序代码:https://www.cnblogs.com/kexinxin/p/9858664.html matlab代码求解函数最优值:https://blog.csdn.net/zyqblog/article/details/80829043 讲解通俗易懂,有数学实例的博文:https://blog.csdn.net/daaikuaichuan/article/...
教你如何编写第一个简单的爬虫
很多人知道爬虫,也很想利用爬虫去爬取自己想要的数据,那么爬虫到底怎么用呢?今天就教大家编写一个简单的爬虫。 下面以爬取笔者的个人博客网站为例获取第一篇文章的标题名称,教大家学会一个简单的爬虫。 第一步:获取页面 #!/usr/bin/python # coding: utf-8 import requests #引入包requests link = "http://www.santostang....
前端JS初级面试题二 (。•ˇ‸ˇ•。)老铁们!快来瞧瞧自己都会了么
1. 传统事件绑定和符合W3C标准的事件绑定有什么区别? 传统事件绑定 &lt;div onclick=""&gt;123&lt;/div&gt; div1.onclick = function(){}; &lt;button onmouseover=""&gt;&lt;/button&gt; 注意: 如果给同一个元素绑定了两次或多次相同类型的事件,那么后面的绑定会覆盖前面的绑定 (不支持DOM事...
情人节来了,教你个用 Python 表白的技巧
作者:@明哥 公众号:Python编程时光 2020年,这个看起来如此浪漫的年份,你还是一个人吗? 难不成我还能是一条狗? 18年的时候,写过一篇介绍如何使用 Python 来表白的文章。 虽然创意和使用效果都不错,但有一缺点,这是那个exe文件,女神需要打开电脑,才有可能参与进来,进而被你成功"调戏”。 由于是很早期的文章了,应该有很多人没有看过。 没有看过的,你可以点击这里查看:用Pyt...
用Python开发实用程序 – 计算器
作者:隋顺意 一段时间前,自己制作了一个库 “sui-math”。这其实是math的翻版。做完后,python既然可以轻易的完成任何的数学计算,何不用python开发一个小程序专门用以计算呢? 现在我们越来越依赖于计算器,很多复杂的计算都离不开它。我们使用过各式各样的计算器,无论是电脑自带的,还是网也上的计算器,却都没有自己动手编写属于自己计算器。今天就让我们走进计算器的世界,用python来编写...
相关热词 c# 识别回车 c#生成条形码ean13 c#子控制器调用父控制器 c# 写大文件 c# 浏览pdf c#获取桌面图标的句柄 c# list反射 c# 句柄 进程 c# 倒计时 线程 c# 窗体背景色
立即提问