Ubuntu 16 64位安装gcc4.4.0 make失败,求大神解救

../.././gcc/gimple.h:67:54: warning: ISO C does not support ‘__FUNCTION__’ predefined identifier [-Wpedantic]
gimple_check_failed (__gs, FILE, LINE, FUNCTION, \
^
../.././gcc/gimple.h:4280:3: note: in expansion of macro ‘GIMPLE_CHECK’
GIMPLE_CHECK (gs, GIMPLE_PREDICT);
^
../.././gcc/gimple.h:68:17: warning: enum conversion when passing argument 6 of ‘gimple_check_failed’ is invalid in C++ -Wc++-compat, 0); \
^
../.././gcc/gimple.h:4280:3: note: in expansion of macro ‘GIMPLE_CHECK’
GIMPLE_CHECK (gs, GIMPLE_PREDICT);
^
../.././gcc/gimple.h:59:13: note: expected ‘enum tree_code’ but argument is of type ‘int’
extern void gimple_check_failed (const_gimple, const char , int, \
^
../.././gcc/toplev.c: At top level:
../.././gcc/toplev.c:536:1: error: redefinition of ‘floor_log2’
floor_log2 (unsigned HOST_WIDE_INT x)
^
In file included from ../.././gcc/toplev.c:58:0:
../.././gcc/toplev.h:190:1: note: previous definition of ‘floor_log2’ was here
floor_log2 (unsigned HOST_WIDE_INT x)
^
../.././gcc/toplev.c:571:1: error: redefinition of ‘exact_log2’
exact_log2 (unsigned HOST_WIDE_INT x)
^
In file included from ../.././gcc/toplev.c:58:0:
../.././gcc/toplev.h:196:1: note: previous definition of ‘exact_log2’ was here
exact_log2 (unsigned HOST_WIDE_INT x)
^
../.././gcc/toplev.c: In function ‘print_to_asm_out_file’:
../.././gcc/toplev.c:1185:7: warning: format not a string literal and no format arguments [-Wformat-security]
fprintf (asm_out_file, text);
^
../.././gcc/toplev.c: In function ‘print_to_stderr’:
../.././gcc/toplev.c:1214:7: warning: format not a string literal and no format arguments [-Wformat-security]
fprintf (stderr, text);
^
Makefile:2470: recipe for target 'toplev.o' failed
make[3]: *
* [toplev.o] Error 1
make[3]: Leaving directory '/home/zsj/下载/related/gcc-4.4.0/host-x86_64-unknown-linux-gnu/gcc'
Makefile:5144: recipe for target 'all-stage1-gcc' failed
make[2]: *** [all-stage1-gcc] Error 2
make[2]: Leaving directory '/home/zsj/下载/related/gcc-4.4.0'
Makefile:19883: recipe for target 'stage1-bubble' failed
make[1]: *** [stage1-bubble] Error 2
make[1]: Leaving directory '/home/zsj/下载/related/gcc-4.4.0'
Makefile:741: recipe for target 'all' failed
make: *** [all] Error 2

3个回答

你Ubuntu16自带的GCC版本应该起码gcc5了吧,你再编译gcc4.4的源码可能有一些语法警告错误。

oyljerry
oyljerry 你可以安装Oracle新版本支持Ubuntu16的
3 年多之前 回复
woxishiermei
小事儿儿 是的,自带gcc版本是gcc version 5.3.1 20160413 (Ubuntu 5.3.1-14ubuntu2),因为我安装oracle数据库,好像因为gcc版本过高,导致监听程序起不来。所以要重新装低版本的GCC,然后就出现一系列的错误了,安装了相关的依赖包,还是不行~刚开始学习,很多不懂。
3 年多之前 回复

是的,自带gcc版本是gcc version 5.3.1 20160413 (Ubuntu 5.3.1-14ubuntu2),因为我安装oracle数据库,好像因为gcc版本过高,导致监听程序起不来。所以要重新装低版本的GCC,然后就出现一系列的错误了,安装了相关的依赖包,还是不行~刚开始学习,很多不懂。

重复定义网上只有一种解决办法#ifndef...但我试着改了代码后没有效果,真恼人

Csdn user default icon
上传中...
上传图片
插入图片
抄袭、复制答案,以达到刷声望分或其他目的的行为,在CSDN问答是严格禁止的,一经发现立刻封号。是时候展现真正的技术了!
其他相关推荐
安装gcc4.9.0之后找不到include目录
[root@ptb habi]# g++ -v ccc.cpp 使用内建 specs。 COLLECT_GCC=g++ 目标:i686-pc-linux-gnu 配置为:../configure --prefix=/usr/local/gcc-4.9.0 --mandir=/usr/share/man --infodir=/usr/share/info --enable-shared --enable-threads=posix --enable-checking=release --with-system-zlib --enable-__cxa_atexit --disable-libunwind-exceptions --enable-libgcj-multifile --enable-languages=c,c++ 线程模型:posix gcc 版本 4.9.0 (GCC) COLLECT_GCC_OPTIONS='-v' '-shared-libgcc' '-mtune=generic' '-march=pentiumpro' cc1plus -quiet -v -iprefix /usr/bin/../lib/gcc/i686-pc-linux-gnu/4.9.0/ -D_GNU_SOURCE ccc.cpp -quiet -dumpbase ccc.cpp -mtune=generic -march=pentiumpro -auxbase ccc -version -o /tmp/ccpjzXOC.s GNU C++ (GCC) 版本 4.9.0 (i686-pc-linux-gnu) 由 GNU C 版本 4.9.0 编译,GMP 版本 4.3.2,MPFR 版本 2.4.2,MPC 版本 0.8.1 GGC 准则:--param ggc-min-expand=100 --param ggc-min-heapsize=131072 忽略不存在的目录“/usr/bin/../lib/gcc/i686-pc-linux-gnu/4.9.0/../../../../include/c++/4.9.0” 忽略不存在的目录“/usr/bin/../lib/gcc/i686-pc-linux-gnu/4.9.0/../../../../include/c++/4.9.0/i686-pc-linux-gnu” 忽略不存在的目录“/usr/bin/../lib/gcc/i686-pc-linux-gnu/4.9.0/../../../../include/c++/4.9.0/backward” 忽略不存在的目录“/usr/bin/../lib/gcc/i686-pc-linux-gnu/4.9.0/include” 忽略不存在的目录“/usr/bin/../lib/gcc/i686-pc-linux-gnu/4.9.0/include-fixed” 忽略不存在的目录“/usr/bin/../lib/gcc/i686-pc-linux-gnu/4.9.0/../../../../i686-pc-linux-gnu/include” 忽略不存在的目录“/usr/bin/../lib/gcc/../../lib/gcc/i686-pc-linux-gnu/4.9.0/../../../../include/c++/4.9.0” 忽略不存在的目录“/usr/bin/../lib/gcc/../../lib/gcc/i686-pc-linux-gnu/4.9.0/../../../../include/c++/4.9.0/i686-pc-linux-gnu” 忽略不存在的目录“/usr/bin/../lib/gcc/../../lib/gcc/i686-pc-linux-gnu/4.9.0/../../../../include/c++/4.9.0/backward” 忽略不存在的目录“/usr/bin/../lib/gcc/../../lib/gcc/i686-pc-linux-gnu/4.9.0/include” 忽略不存在的目录“/usr/local/include” 忽略不存在的目录“/usr/bin/../lib/gcc/../../lib/gcc/i686-pc-linux-gnu/4.9.0/include-fixed” 忽略不存在的目录“/usr/bin/../lib/gcc/../../lib/gcc/i686-pc-linux-gnu/4.9.0/../../../../i686-pc-linux-gnu/include” 忽略重复的目录“/usr/include” #include "..." 搜索从这里开始: #include <...> 搜索从这里开始: /usr/bin/../lib/gcc/../../include 搜索列表结束。 GNU C++ (GCC) 版本 4.9.0 (i686-pc-linux-gnu) 由 GNU C 版本 4.9.0 编译,GMP 版本 4.3.2,MPFR 版本 2.4.2,MPC 版本 0.8.1 GGC 准则:--param ggc-min-expand=100 --param ggc-min-heapsize=131072 Compiler executable checksum: 3c13c9968389e205e0f7e12bfe79e4e8 ccc.cpp:1:20: 致命错误:iostream:没有那个文件或目录 #include <iostream> ^ 编译中断。
Ubuntu server 15.0.4安装Redis make命令不能执行
按照官方的下载安装指导:http://redis.io/download#installation Download, extract and compile Redis with: $ wget http://download.redis.io/releases/redis-3.0.3.tar.gz $ tar xzf redis-3.0.3.tar.gz $ cd redis-3.0.3 $ make The binaries that are now compiled are available in thesrcdirectory. Run Redis with: $ src/redis-server You can interact with Redis using the built-in client: $ src/redis-cli redis> set foo bar OK redis> get foo "bar" 我在执行make命令的时候执行不下去了,为嘛我不能使用make命令呢?我下载包解压后,使用make 提示The program 'make' can not be found in following packages.* make .... * make-gradle .......求解释,对Ubuntu不是很熟,请大仙指教! 操作截图: ![图片说明](https://img-ask.csdn.net/upload/201508/19/1439975912_162053.png) ![图片说明](https://img-ask.csdn.net/upload/201508/19/1439975995_329486.png) 在sudo高级权限下操作make还是不行: ![图片说明](https://img-ask.csdn.net/upload/201508/19/1439976271_745329.png) ## 原因:Ubuntu需要安装gcc工具; ## 最终问题解决方案: 安装gcc前执行$sudo apt-get update,若不成功再执行$sudo apt-get clean: $sudo apt-get clean $sudo apt-get update $sudo apt-get build-dep gcc 按照上面处理就可以使用make命令了。
在升级到gcc4.9.1时 make check出现的错误
make[1]: Entering directory `/home/he/gccbuild' make[2]: Entering directory `/home/he/gccbuild/fixincludes' autogen -T ../../gcc-4.9.1/fixincludes/check.tpl ../../gcc-4.9.1/fixincludes/inclhack.def /bin/bash: autogen: command not found make[2]: *** [check] Error 127 make[2]: Leaving directory `/home/he/gccbuild/fixincludes' make[1]: *** [check-fixincludes] Error 2 make[1]: Leaving directory `/home/he/gccbuild' make: *** [do-check] Error 2
Ubuntu 16.04 编译 Ncurses 6.0 报错
### Ubuntu 16.04 LTS 编译 Ncurses 6.0 报错: ``` In file included from ./curses.priv.h:325:0, from ../ncurses/lib_gen.c:19: _24273.c:843:15: error: expected ‘)’ before ‘int’ ../include/curses.h:1631:56: note: in definition of macro ‘mouse_trafo’ #define mouse_trafo(y,x,to_screen) wmouse_trafo(stdscr,y,x,to_screen) ^ Makefile:962: recipe for target '../objects/lib_gen.o' failed make[1]: *** [../objects/lib_gen.o] Error 1 make[1]: Leaving directory '/home/netsamir/Sofware/Tmux/ncurses-6.0/ncurses' Makefile:113: recipe for target 'all' failed make: *** [all] Error 2 ``` ### 系统配置 ``` $ lsb_release -a No LSB modules are available. Distributor ID: Ubuntu Description: Ubuntu 16.04 LTS Release: 16.04 Codename: xenial $ gcc -v Using built-in specs. COLLECT_GCC=gcc COLLECT_LTO_WRAPPER=/usr/lib/gcc/x86_64-linux-gnu/5/lto-wrapper Target: x86_64-linux-gnu Configured with: ../src/configure -v --with-pkgversion='Ubuntu 5.4.0-6ubuntu1~16.04.4' --with-bugurl=file:///usr/share/doc/gcc-5/README.Bugs --enable-languages=c,ada,c++,java,go,d,fortran,objc,obj-c++ --prefix=/usr --program-suffix=-5 --enable-shared --enable-linker-build-id --libexecdir=/usr/lib --without-included-gettext --enable-threads=posix --libdir=/usr/lib --enable-nls --with-sysroot=/ --enable-clocale=gnu --enable-libstdcxx-debug --enable-libstdcxx-time=yes --with-default-libstdcxx-abi=new --enable-gnu-unique-object --disable-vtable-verify --enable-libmpx --enable-plugin --with-system-zlib --disable-browser-plugin --enable-java-awt=gtk --enable-gtk-cairo --with-java-home=/usr/lib/jvm/java-1.5.0-gcj-5-amd64/jre --enable-java-home --with-jvm-root-dir=/usr/lib/jvm/java-1.5.0-gcj-5-amd64 --with-jvm-jar-dir=/usr/lib/jvm-exports/java-1.5.0-gcj-5-amd64 --with-arch-directory=amd64 --with-ecj-jar=/usr/share/java/eclipse-ecj.jar --enable-objc-gc --enable-multiarch --disable-werror --with-arch-32=i686 --with-abi=m64 --with-multilib-list=m32,m64,mx32 --enable-multilib --with-tune=generic --enable-checking=release --build=x86_64-linux-gnu --host=x86_64-linux-gnu --target=x86_64-linux-gnu Thread model: posix gcc version 5.4.0 20160609 (Ubuntu 5.4.0-6ubuntu1~16.04.4) $ g++ -v Using built-in specs. COLLECT_GCC=g++ COLLECT_LTO_WRAPPER=/usr/lib/gcc/x86_64-linux-gnu/5/lto-wrapper Target: x86_64-linux-gnu Configured with: ../src/configure -v --with-pkgversion='Ubuntu 5.4.0-6ubuntu1~16.04.4' --with-bugurl=file:///usr/share/doc/gcc-5/README.Bugs --enable-languages=c,ada,c++,java,go,d,fortran,objc,obj-c++ --prefix=/usr --program-suffix=-5 --enable-shared --enable-linker-build-id --libexecdir=/usr/lib --without-included-gettext --enable-threads=posix --libdir=/usr/lib --enable-nls --with-sysroot=/ --enable-clocale=gnu --enable-libstdcxx-debug --enable-libstdcxx-time=yes --with-default-libstdcxx-abi=new --enable-gnu-unique-object --disable-vtable-verify --enable-libmpx --enable-plugin --with-system-zlib --disable-browser-plugin --enable-java-awt=gtk --enable-gtk-cairo --with-java-home=/usr/lib/jvm/java-1.5.0-gcj-5-amd64/jre --enable-java-home --with-jvm-root-dir=/usr/lib/jvm/java-1.5.0-gcj-5-amd64 --with-jvm-jar-dir=/usr/lib/jvm-exports/java-1.5.0-gcj-5-amd64 --with-arch-directory=amd64 --with-ecj-jar=/usr/share/java/eclipse-ecj.jar --enable-objc-gc --enable-multiarch --disable-werror --with-arch-32=i686 --with-abi=m64 --with-multilib-list=m32,m64,mx32 --enable-multilib --with-tune=generic --enable-checking=release --build=x86_64-linux-gnu --host=x86_64-linux-gnu --target=x86_64-linux-gnu Thread model: posix gcc version 5.4.0 20160609 (Ubuntu 5.4.0-6ubuntu1~16.04.4) ```
gcc从4.4.7升级到4.8.2后产生的问题
gcc 4.4.7 升级到 4.8.2。 升级前 动态加载的对象 和 主程序 看到的全局对象的 地址空间是一致的, 升级后两者看到的全局对象的地址空间不一致了。全局对象 是 static的。 产生此问题的原因是什么? 怎么解决?
求助,升级gcc8.2.0时一直编译失败
尝试安装一直失败,还望大神指点迷津。 下面是一张错误截图。![图片说明](https://img-ask.csdn.net/upload/201812/13/1544678993_238312.png)
关于centos卸载gcc的问题?
linux 3.10 centos 7系统,默认安装的gcc版本为4.8.5。因为跑程序要用到4.9以上的gcc版本,所以安装了gcc-8.3.0。 安装完成后,使用cat /proc/version命令只能看到gcc4.8.5,使用gcc -v命令只能看到gcc8.3.0。 运行程序时,又提示gcc版本不能高于gcc7.0,所以想卸载gcc8.3.0。但是利用rpm -q gcc 只能找到gcc-4.8.5,求问该怎么办?
Ubuntu 14.4安装完QtEmbedded-4.8.5-arm,加载qmake失败十万火急
![图片说明](https://img-ask.csdn.net/upload/201708/15/1502805113_761273.jpg) gcc版本为4.8.4,arm-linux-gcc为4.3.2
ubuntu16.04安装opencv时,make不通过该怎么办?
cmake已经完成,情况如下: ``` cmake .. -- Detected version of GNU GCC: 54 (504) -- Found ZLIB: /usr/lib/x86_64-linux-gnu/libz.so (found suitable version "1.2.8", minimum required is "1.2.3") -- Found ZLIB: /usr/lib/x86_64-linux-gnu/libz.so (found version "1.2.8") -- Checking for module 'gstreamer-base-1.0' -- No package 'gstreamer-base-1.0' found -- Checking for module 'gstreamer-video-1.0' -- No package 'gstreamer-video-1.0' found -- Checking for module 'gstreamer-app-1.0' -- No package 'gstreamer-app-1.0' found -- Checking for module 'gstreamer-riff-1.0' -- No package 'gstreamer-riff-1.0' found -- Checking for module 'gstreamer-pbutils-1.0' -- No package 'gstreamer-pbutils-1.0' found -- Checking for module 'gstreamer-base-0.10' -- No package 'gstreamer-base-0.10' found -- Checking for module 'gstreamer-video-0.10' -- No package 'gstreamer-video-0.10' found -- Checking for module 'gstreamer-app-0.10' -- No package 'gstreamer-app-0.10' found -- Checking for module 'gstreamer-riff-0.10' -- No package 'gstreamer-riff-0.10' found -- Checking for module 'gstreamer-pbutils-0.10' -- No package 'gstreamer-pbutils-0.10' found -- Looking for linux/videodev.h -- Looking for linux/videodev.h - not found -- Looking for linux/videodev2.h -- Looking for linux/videodev2.h - found -- Looking for sys/videoio.h -- Looking for sys/videoio.h - not found -- Checking for module 'libavresample' -- No package 'libavresample' found -- Looking for libavformat/avformat.h -- Looking for libavformat/avformat.h - found -- Looking for ffmpeg/avformat.h -- Looking for ffmpeg/avformat.h - not found -- Checking for module 'libgphoto2' -- No package 'libgphoto2' found -- found IPP (ICV version): 9.0.1 [9.0.1] -- at: /home/quxutao/opencv-3.1.0/3rdparty/ippicv/unpack/ippicv_lnx -- CUDA detected: 7.5 -- CUDA NVCC target flags: -gencode;arch=compute_20,code=sm_20;-gencode;arch=compute_20,code=sm_21;-gencode;arch=compute_30,code=sm_30;-gencode;arch=compute_35,code=sm_35;-gencode;arch=compute_30,code=compute_30 -- Could NOT find Doxygen (missing: DOXYGEN_EXECUTABLE) -- To enable PlantUML support, set PLANTUML_JAR environment variable or pass -DPLANTUML_JAR=<filepath> option to cmake -- Could NOT find PythonInterp: Found unsuitable version "1.4", but required is at least "2.7" (found /home/quxutao/.virtualenvs/cv/bin/python) -- Could NOT find PythonInterp: Found unsuitable version "1.4", but required is at least "2.6" (found /home/quxutao/.virtualenvs/cv/bin/python) -- Could NOT find PythonInterp: Found unsuitable version "1.4", but required is at least "3.4" (found /home/quxutao/.virtualenvs/cv/bin/python) -- Could NOT find PythonInterp: Found unsuitable version "1.4", but required is at least "3.2" (found /home/quxutao/.virtualenvs/cv/bin/python) -- Could NOT find JNI (missing: JAVA_INCLUDE_PATH JAVA_INCLUDE_PATH2 JAVA_AWT_INCLUDE_PATH) -- Could NOT find Matlab (missing: MATLAB_MEX_SCRIPT MATLAB_INCLUDE_DIRS MATLAB_ROOT_DIR MATLAB_LIBRARIES MATLAB_LIBRARY_DIRS MATLAB_MEXEXT MATLAB_ARCH MATLAB_BIN) -- VTK is not found. Please set -DVTK_DIR in CMake to VTK build directory, or to VTK install subdirectory with VTKConfig.cmake file -- Caffe: NO -- Protobuf: YES -- Glog: NO -- HDF5: YES -- Module opencv_sfm disabled because the following dependencies are not found: Eigen Glog/Gflags -- Tesseract: NO -- HDF5: YES -- Build libprotobuf from sources: -- The protocol buffer compiler not found -- Tesseract: NO -- -- General configuration for OpenCV 3.1.0 ===================================== -- Version control: unknown -- -- Platform: -- Host: Linux 4.15.0-47-generic x86_64 -- CMake: 3.5.1 -- CMake generator: Unix Makefiles -- CMake build tool: /usr/bin/make -- Configuration: RELEASE -- -- C/C++: -- Built as dynamic libs?: YES -- C++ Compiler: /usr/bin/c++ (ver 5.4.0) -- C++ flags (Release): -fsigned-char -W -Wall -Werror=return-type -Werror=non-virtual-dtor -Werror=address -Werror=sequence-point -Wformat -Werror=format-security -Wmissing-declarations -Wundef -Winit-self -Wpointer-arith -Wshadow -Wsign-promo -Wno-narrowing -Wno-delete-non-virtual-dtor -fdiagnostics-show-option -Wno-long-long -pthread -fomit-frame-pointer -msse -msse2 -mno-avx -msse3 -mno-ssse3 -mno-sse4.1 -mno-sse4.2 -ffunction-sections -fvisibility=hidden -fvisibility-inlines-hidden -O3 -DNDEBUG -DNDEBUG -- C++ flags (Debug): -fsigned-char -W -Wall -Werror=return-type -Werror=non-virtual-dtor -Werror=address -Werror=sequence-point -Wformat -Werror=format-security -Wmissing-declarations -Wundef -Winit-self -Wpointer-arith -Wshadow -Wsign-promo -Wno-narrowing -Wno-delete-non-virtual-dtor -fdiagnostics-show-option -Wno-long-long -pthread -fomit-frame-pointer -msse -msse2 -mno-avx -msse3 -mno-ssse3 -mno-sse4.1 -mno-sse4.2 -ffunction-sections -fvisibility=hidden -fvisibility-inlines-hidden -g -O0 -DDEBUG -D_DEBUG -- C Compiler: /usr/bin/cc -- C flags (Release): -fsigned-char -W -Wall -Werror=return-type -Werror=non-virtual-dtor -Werror=address -Werror=sequence-point -Wformat -Werror=format-security -Wmissing-declarations -Wmissing-prototypes -Wstrict-prototypes -Wundef -Winit-self -Wpointer-arith -Wshadow -Wno-narrowing -fdiagnostics-show-option -Wno-long-long -pthread -fomit-frame-pointer -msse -msse2 -mno-avx -msse3 -mno-ssse3 -mno-sse4.1 -mno-sse4.2 -ffunction-sections -fvisibility=hidden -O3 -DNDEBUG -DNDEBUG -- C flags (Debug): -fsigned-char -W -Wall -Werror=return-type -Werror=non-virtual-dtor -Werror=address -Werror=sequence-point -Wformat -Werror=format-security -Wmissing-declarations -Wmissing-prototypes -Wstrict-prototypes -Wundef -Winit-self -Wpointer-arith -Wshadow -Wno-narrowing -fdiagnostics-show-option -Wno-long-long -pthread -fomit-frame-pointer -msse -msse2 -mno-avx -msse3 -mno-ssse3 -mno-sse4.1 -mno-sse4.2 -ffunction-sections -fvisibility=hidden -g -O0 -DDEBUG -D_DEBUG -- Linker flags (Release): -- Linker flags (Debug): -- Precompiled headers: YES -- Extra dependencies: /usr/lib/x86_64-linux-gnu/libpng.so /usr/lib/x86_64-linux-gnu/libtiff.so /usr/lib/x86_64-linux-gnu/libjasper.so /usr/lib/x86_64-linux-gnu/libjpeg.so gtk-3 gdk-3 pangocairo-1.0 pango-1.0 atk-1.0 cairo-gobject cairo gdk_pixbuf-2.0 gio-2.0 gobject-2.0 gthread-2.0 glib-2.0 dc1394 v4l1 v4l2 avcodec-ffmpeg avformat-ffmpeg avutil-ffmpeg swscale-ffmpeg /usr/lib/x86_64-linux-gnu/libbz2.so /usr/lib/x86_64-linux-gnu/hdf5/openmpi/lib/libhdf5.so /usr/lib/x86_64-linux-gnu/libsz.so /usr/lib/x86_64-linux-gnu/libz.so /usr/lib/x86_64-linux-gnu/libdl.so /usr/lib/x86_64-linux-gnu/libm.so dl m pthread rt cudart nppc nppi npps cufft -L/usr/lib/x86_64-linux-gnu -- 3rdparty dependencies: libwebp IlmImf libprotobuf -- -- OpenCV modules: -- To be built: cudev core cudaarithm flann hdf imgproc ml reg surface_matching video cudabgsegm cudafilters cudaimgproc cudawarping dnn fuzzy imgcodecs photo shape videoio cudacodec highgui objdetect plot ts xobjdetect xphoto bgsegm bioinspired dpm face features2d line_descriptor saliency text calib3d ccalib cudafeatures2d cudalegacy cudaobjdetect cudaoptflow cudastereo datasets rgbd stereo structured_light superres tracking videostab xfeatures2d ximgproc aruco optflow stitching -- Disabled: world contrib_world -- Disabled by dependency: - -- Unavailable: java python2 python3 viz cvv matlab sfm -- -- GUI: -- QT: NO -- GTK+ 3.x: YES (ver 3.18.9) -- GThread : YES (ver 2.48.2) -- GtkGlExt: NO -- OpenGL support: NO -- VTK support: NO -- -- Media I/O: -- ZLib: /usr/lib/x86_64-linux-gnu/libz.so (ver 1.2.8) -- JPEG: /usr/lib/x86_64-linux-gnu/libjpeg.so (ver ) -- WEBP: build (ver 0.3.1) -- PNG: /usr/lib/x86_64-linux-gnu/libpng.so (ver 1.2.54) -- TIFF: /usr/lib/x86_64-linux-gnu/libtiff.so (ver 42 - 4.0.6) -- JPEG 2000: /usr/lib/x86_64-linux-gnu/libjasper.so (ver 1.900.1) -- OpenEXR: build (ver 1.7.1) -- GDAL: NO -- -- Video I/O: -- DC1394 1.x: NO -- DC1394 2.x: YES (ver 2.2.4) -- FFMPEG: YES -- codec: YES (ver 56.60.100) -- format: YES (ver 56.40.101) -- util: YES (ver 54.31.100) -- swscale: YES (ver 3.1.101) -- resample: NO -- gentoo-style: YES -- GStreamer: NO -- OpenNI: NO -- OpenNI PrimeSensor Modules: NO -- OpenNI2: NO -- PvAPI: NO -- GigEVisionSDK: NO -- UniCap: NO -- UniCap ucil: NO -- V4L/V4L2: Using libv4l1 (ver 1.10.0) / libv4l2 (ver 1.10.0) -- XIMEA: NO -- Xine: NO -- gPhoto2: NO -- -- Parallel framework: pthreads -- -- Other third-party libraries: -- Use IPP: 9.0.1 [9.0.1] -- at: /home/quxutao/opencv-3.1.0/3rdparty/ippicv/unpack/ippicv_lnx -- Use IPP Async: NO -- Use VA: NO -- Use Intel VA-API/OpenCL: NO -- Use Eigen: NO -- Use Cuda: YES (ver 7.5) -- Use OpenCL: YES -- Use custom HAL: NO -- -- NVIDIA CUDA -- Use CUFFT: YES -- Use CUBLAS: NO -- USE NVCUVID: NO -- NVIDIA GPU arch: 20 21 30 35 -- NVIDIA PTX archs: 30 -- Use fast math: NO -- -- OpenCL: -- Version: dynamic -- Include path: /home/quxutao/opencv-3.1.0/3rdparty/include/opencl/1.2 -- Use AMDFFT: NO -- Use AMDBLAS: NO -- -- Python 2: -- Interpreter: NO -- -- Python 3: -- Interpreter: NO -- -- Python (for build): NO -- -- Java: -- ant: NO -- JNI: NO -- Java wrappers: NO -- Java tests: NO -- -- Matlab: Matlab not found or implicitly disabled -- -- Documentation: -- Doxygen: NO -- PlantUML: NO -- -- Tests and samples: -- Tests: YES -- Performance tests: YES -- C/C++ Examples: YES -- -- Install path: /usr/local -- -- cvconfig.h is in: /home/quxutao/opencv-3.1.0/build -- ----------------------------------------------------------------- -- -- Configuring done -- Generating done -- Build files have been written to: /home/quxutao/opencv-3.1.0/build ``` 但是make的时候,就报错: ``` make [ 4%] Built target libwebp [ 4%] Built target IlmImf [ 4%] Built target opencv_cudev [ 4%] Built target opencv_core_pch_dephelp [ 4%] Built target pch_Generate_opencv_core [ 4%] Building NVCC (Device) object modules/core/CMakeFiles/cuda_compile.dir/src/cuda/cuda_compile_generated_gpu_mat.cu.o /usr/include/string.h: In function ‘void* __mempcpy_inline(void*, const void*, size_t)’: /usr/include/string.h:652:42: error: ‘memcpy’ was not declared in this scope return (char *) memcpy (__dest, __src, __n) + __n; ^ CMake Error at cuda_compile_generated_gpu_mat.cu.o.cmake:266 (message): Error generating file /home/quxutao/opencv-3.1.0/build/modules/core/CMakeFiles/cuda_compile.dir/src/cuda/./cuda_compile_generated_gpu_mat.cu.o modules/core/CMakeFiles/opencv_core.dir/build.make:399: recipe for target 'modules/core/CMakeFiles/cuda_compile.dir/src/cuda/cuda_compile_generated_gpu_mat.cu.o' failed make[2]: *** [modules/core/CMakeFiles/cuda_compile.dir/src/cuda/cuda_compile_generated_gpu_mat.cu.o] Error 1 CMakeFiles/Makefile2:2307: recipe for target 'modules/core/CMakeFiles/opencv_core.dir/all' failed make[1]: *** [modules/core/CMakeFiles/opencv_core.dir/all] Error 2 Makefile:160: recipe for target 'all' failed make: *** [all] Error 2 ``` 弄了一下午了,没有找到相关的解决办法。我的cuda是7.5,其实不用GPU也可以的,我只是想用KAZE滤波。。。跪求大神帮忙。。。
Linux下安装tripwire-2.4.2.2-src.tar.bz2报错
当我执行完./configure之后:checking build system type... x86_64-unknown-linux-gnu checking host system type... x86_64-unknown-linux-gnu checking target system type... x86_64-unknown-linux-gnu checking for a BSD-compatible install... /usr/bin/install -c checking whether build environment is sane... yes checking for gawk... gawk checking whether make sets $(MAKE)... yes checking for gcc... gcc checking for C compiler default output file name... configure: error: C compiler cannot create executables See `config.log' for more details. gcc版本信息为: gcc (GCC) 4.4.7 20120313 (Red Hat 4.4.7-4) Copyright (C) 2010 Free Software Foundation, Inc. This is free software; see the source for copying conditions. There is NO warranty; not even for MERCHANTABILITY or FITNESS FOR A PARTICULAR PURPOSE.
ubuntu16.04下--c语言gcc问题
写了一个小链表解决一个问题。 自己电脑上(gcc--version 5.4.0)gcc是没有任何问题的,给定的测试也没有任何问题。 但是在线测试(gcc4.7.2)却一直出现“段错误” 一脸懵逼。。。 请问各位大佬有没有关于这个问题的一些思路啊(如需要也可贴上代码)?
centos7.6 安装python3.执行/configure时,gcc异常
安装python时,执行./configure初始编译,报gcc没有工作: 错误信息: ``` checking build system type... x86_64-unknown-linux-gnu checking host system type... x86_64-unknown-linux-gnu checking for python3.6... no checking for python3... no checking for python... python checking for --enable-universalsdk... no checking for --with-universal-archs... no checking MACHDEP... linux checking for --without-gcc... no checking for --with-icc... no checking for gcc... gcc checking whether the C compiler works... no configure: error: in `/opt/Python-3.6.0': configure: error: C compiler cannot create executables ``` config.log信息: ![图片说明](https://img-ask.csdn.net/upload/201909/09/1568015863_225982.png) 去看日志发现ld找不到 执行which ld确实找不到。 ![图片说明](https://img-ask.csdn.net/upload/201909/09/1568015884_257870.png) 去搜索资料,都说安装gcc即可,可是我已经把python所需的依赖全部安装了,c编译器还是没有工作,我想可能是ld问题,我在安装pydoop时也遇到ld问题,很头疼,求解!!!
NCL-6.5.0安装后官方Test后失败
Ubuntu18 64bit gcc-6.5.0 安装ncl-6.5.0(装的是gcc-6.3.0的) 采用官方Test ![图片说明](https://img-ask.csdn.net/upload/201902/23/1550918375_458264.png) 第一步成功了,但第二步出现问题: ![图片说明](https://img-ask.csdn.net/upload/201902/23/1550918468_613806.png) 百度后未找到类似问题 麻烦求解!!!
ubuntu上把gcc高版本换成低版本
我安装了ubuntu14.04,gcc默认版本为4.8,可是我要用gcc4.7,怎么也换不过来了,各位有谁指点一下
Ubuntu14.04升级gcc版本到5出错
我主要按照博客[Ubuntu 14.04 LTS 下升级 gcc 到 gcc-4.9、gcc-5 版本](http://www.cnblogs.com/BlackStorm/p/5183490.html "")的步骤升级gcc。 ``` sudo add-apt-repository ppa:ubuntu-toolchain-r/test sudo apt-get update sudo apt-get install software-properties-common sudo apt-get upgrade sudo apt-get install gcc-5 g++-5 ``` 之后出现问题: ``` gph@gph-pc:~$ sudo apt-get install gcc-5 Reading package lists... Done Building dependency tree Reading state information... Done Some packages could not be installed. This may mean that you have requested an impossible situation or if you are using the unstable distribution that some required packages have not yet been created or been moved out of Incoming. The following information may help to resolve the situation: The following packages have unmet dependencies: gcc-5:i386 : Depends: cpp-5:i386 (= 5.4.1-2ubuntu1~14.04) but it is not going to be installed Depends: libcc1-0:i386 (>= 5.4.1-2ubuntu1~14.04) but it is not going to be installed Depends: binutils:i386 (>= 2.24) but it is not going to be installed Depends: libgcc-5-dev:i386 (= 5.4.1-2ubuntu1~14.04) but it is not going to be installed Depends: libc6:i386 (>= 2.15) but it is not going to be installed Depends: libgcc1:i386 (>= 1:3.0) but it is not going to be installed Depends: libgmp10:i386 but it is not going to be installed Depends: libisl15:i386 (>= 0.15) but it is not going to be installed Depends: libmpc3:i386 but it is not going to be installed Depends: libmpfr4:i386 (>= 3.1.3) but it is not going to be installed Depends: libstdc++6:i386 (>= 4.1.1) but it is not going to be installed Depends: zlib1g:i386 (>= 1:1.1.4) but it is not going to be installed Recommends: libc6-dev:i386 (>= 2.13-0ubuntu6) but it is not going to be installed E: Unable to correct problems, you have held broken packages. ``` 请问有人知道如何解决吗? 已经百度和Google过相关的问题了,还是没有解决,请各位提供帮助,谢谢! =================================================================== 最后通过本地编译安装的方式安装了gcc5.3.0,但是在编译一个代码的时候出现如下错误: ``` .build_release/lib/libcaffe.so: undefined reference to `boost::match_results<__gnu_cxx::__normal_iterator<char const*, std::__cxx11::basic_string<char.build_release/lib, std/libcaffe.so: undefined reference to `boost::match_results<__gnu_cxx::__normal_iterator<char const*, std:::__cxx11:::basic_string<charchar_traits, std<::char_traits<charchar>, std::allocator<char> > >, std::allocator<boost::sub_match<>__gnu_cxx::__normal_iterator<, .build_release/tools/get_image_size.o: In function `std::__cxx11::basic_string<char, std::char_traits<char>, std::allocator<char> >* google::MakeCheckOpString<unsigned long, unsigned long>(unsigned long const&, unsigned long const&, char const*)': get_image_size.cpp:(.text._ZN6google17MakeCheckOpStringImmEEPNSt7__cxx1112basic_stringIcSt11char_traitsIcESaIcEEERKT_RKT0_PKc[_ZN6google17MakeCheckOpStringImmEEPNSt7__cxx1112basic_stringIcSt11char_traitsIcESaIcEEERKT_RKT0_PKc]+0x41): undefined reference to `google::base::CheckOpMessageBuilder::NewString[abi:cxx11]()' .build_release/tools/get_image_size.o: In function `main': get_image_size.cpp:(.text.startup+0x66): undefined reference to `google::SetUsageMessage(std::__cxx11::basic_string<char, std::char_traits<char>, std::allocator<char> > const&)' get_image_size.cpp:(.text.startup+0x722): undefined reference to `caffe::GetImageSize(std::__cxx11::basic_string<char, std::char_traits<char>, std::allocator<char> > const&, int*, int*)' 。 。 。 。 。 。 .build_release/lib/libcaffe.so: undefined reference to `google::base::CheckOpMessageBuilder::NewString[abi:cxx11]()' collect2: error: ld returned 1 exit status make: *** [.build_release/tools/device_query.bin] Error 1 ``` 这又是什么问题。。。?
实用matlab+gcc 4. 7.7的时候出现报错
undefined reference to `__warn_memset_zero_len' 编译的时候出现的问题大概就是这个,我用的是matlab的2015b和gcc的4.7.7这里编译源码是matcnvnet我想知道解决的方法或者干脆就是直接给我一个编译好的也可以,真的要被逼疯了!
【菜鸟级GCC问题,求大牛指导】
我的系统是openSUSE13.1,已经安装了GCC4.8.1,想要升级GCC到5.1.0,已经下载了GCC5.1.0并且解压了,但是下一步不知道如何安装,求大牛指导,谢谢了
GCC4.7之后不是已经支持C11了么,为什么函数 aligned_alloc()仍然不能使用?
如题,GCC在版本4.7之后不是已经支持C11了吗?为什么C11中添加的函数 _aligned__alloc()仍然不能使用。求大神告知!
Kernel panic - not syncing: Attempted to kill init! exitcode=0x00000004、Linux4.19.66/at91/ramdisk/gcc7.3.1。
**环境描述:** 最近移植4.19.66内核,使用ramdisk文件系统,at91sam9x5,编译器使用的是gcc-linaro-7.3.1-2018.05-x86_64_arm-linux-gnueabi **问题如下:** 挂载文件系统报错 kernel panic - not syncing: Attempted to kill init exitcode=0x00000004 ![图片说明](https://img-ask.csdn.net/upload/201909/27/1569550340_681476.jpg) **尝试过的方法:** 网上所说的内核和busybox编译选择EABI选项,这个确认是选择了的,无法解决我的问题! 同时搜索看到有的朋友说gcc编译器的lib库复制问题,请问gcc库复制有什么特别的地方,我是将lib目录下的内容全部删除、sudo rm -rf *,然后复制,sudo cp -rf * ./,最后使用strip缩小文件大小。
130 个相见恨晚的超实用网站,一次性分享出来
相见恨晚的超实用网站 持续更新中。。。
我花了一夜用数据结构给女朋友写个H5走迷宫游戏
起因 又到深夜了,我按照以往在csdn和公众号写着数据结构!这占用了我大量的时间!我的超越妹妹严重缺乏陪伴而 怨气满满! 而女朋友时常埋怨,认为数据结构这么抽象难懂的东西没啥作用,常会问道:天天写这玩意,有啥作用。而我答道:能干事情多了,比如写个迷宫小游戏啥的! 当我码完字准备睡觉时:写不好别睡觉! 分析 如果用数据结构与算法造出东西来呢? ...
字节跳动视频编解码面经
三四月份投了字节跳动的实习(图形图像岗位),然后hr打电话过来问了一下会不会opengl,c++,shador,当时只会一点c++,其他两个都不会,也就直接被拒了。 七月初内推了字节跳动的提前批,因为内推没有具体的岗位,hr又打电话问要不要考虑一下图形图像岗,我说实习投过这个岗位不合适,不会opengl和shador,然后hr就说秋招更看重基础。我当时想着能进去就不错了,管他哪个岗呢,就同意了面试...
win10系统安装教程(U盘PE+UEFI安装)
一、准备工作 u盘,电脑一台,win10原版镜像(msdn官网) 二、下载wepe工具箱 极力推荐微pe(微pe官方下载) 下载64位的win10 pe,使用工具箱制作启动U盘打开软件, 选择安装到U盘(按照操作无需更改) 三、重启进入pe系统 1、关机后,将U盘插入电脑 2、按下电源后,按住F12进入启动项选择(技嘉主板是F12) 选择需要启...
大学四年自学走来,这些私藏的实用工具/学习网站我贡献出来了
大学四年,看课本是不可能一直看课本的了,对于学习,特别是自学,善于搜索网上的一些资源来辅助,还是非常有必要的,下面我就把这几年私藏的各种资源,网站贡献出来给你们。主要有:电子书搜索、实用工具、在线视频学习网站、非视频学习网站、软件下载、面试/求职必备网站。 注意:文中提到的所有资源,文末我都给你整理好了,你们只管拿去,如果觉得不错,转发、分享就是最大的支持了。 一、电子书搜索 对于大部分程序员...
《奇巧淫技》系列-python!!每天早上八点自动发送天气预报邮件到QQ邮箱
将代码部署服务器,每日早上定时获取到天气数据,并发送到邮箱。 也可以说是一个小人工智障。 思路可以运用在不同地方,主要介绍的是思路。
致 Python 初学者
欢迎来到“Python进阶”专栏!来到这里的每一位同学,应该大致上学习了很多 Python 的基础知识,正在努力成长的过程中。在此期间,一定遇到了很多的困惑,对未来的学习方向感到迷茫。我非常理解你们所面临的处境。我从2007年开始接触 python 这门编程语言,从2009年开始单一使用 python 应对所有的开发工作,直至今天。回顾自己的学习过程,也曾经遇到过无数的困难,也曾经迷茫过、困惑过。开办这个专栏,正是为了帮助像我当年一样困惑的 Python 初学者走出困境、快速成长。希望我的经验能真正帮到你
Linux(服务器编程):15---两种高效的事件处理模式(reactor模式、proactor模式)
前言 同步I/O模型通常用于实现Reactor模式 异步I/O模型则用于实现Proactor模式 最后我们会使用同步I/O方式模拟出Proactor模式 一、Reactor模式 Reactor模式特点 它要求主线程(I/O处理单元)只负责监听文件描述符上是否有事件发生,有的话就立即将时间通知工作线程(逻辑单元)。除此之外,主线程不做任何其他实质性的工作 读写数据,接受新的连接,以及处...
HAL 硬件抽象层介绍
和你一起终身学习,这里是程序员Android本篇文章主要介绍Android开发中的部分知识点,通过阅读本篇文章,您将收获以下内容:和你一起终身学习,这里是程序员 Android本篇文章主要介绍Android开发中的部分知识点,通过阅读本篇文章,您将收获以下内容:一、HAL 概述一、HAL 概述HAL定义了供硬件供应商实施的标准接口,该接口使Android无需考虑底层驱动程序的实现。使用HA...
加快推动区块链技术和产业创新发展,2019可信区块链峰会在京召开
11月8日,由中国信息通信研究院、中国通信标准化协会、中国互联网协会、可信区块链推进计划联合主办,科技行者协办的2019可信区块链峰会将在北京悠唐皇冠假日酒店开幕。   区块链技术被认为是继蒸汽机、电力、互联网之后,下一代颠覆性的核心技术。如果说蒸汽机释放了人类的生产力,电力解决了人类基本的生活需求,互联网彻底改变了信息传递的方式,区块链作为构造信任的技术有重要的价值。   1...
8年经验面试官详解 Java 面试秘诀
作者 |胡书敏 责编 | 刘静 出品 | CSDN(ID:CSDNnews) 本人目前在一家知名外企担任架构师,而且最近八年来,在多家外企和互联网公司担任Java技术面试官,前后累计面试了有两三百位候选人。在本文里,就将结合本人的面试经验,针对Java初学者、Java初级开发和Java开发,给出若干准备简历和准备面试的建议。 Java程序员准备和投递简历的实...
知乎高赞:中国有什么拿得出手的开源软件产品?(整理自本人原创回答)
知乎高赞:中国有什么拿得出手的开源软件产品? 在知乎上,有个问题问“中国有什么拿得出手的开源软件产品(在 GitHub 等社区受欢迎度较好的)?” 事实上,还不少呢~ 本人于2019.7.6进行了较为全面的回答,对这些受欢迎的 Github 开源项目分类整理如下: 分布式计算、云平台相关工具类 1.SkyWalking,作者吴晟、刘浩杨 等等 仓库地址: apache/skywalking 更...
致 Python 初学者们!
作者| 许向武 责编 | 屠敏 出品 | CSDN 博客 前言 在 Python 进阶的过程中,相信很多同学应该大致上学习了很多 Python 的基础知识,也正在努力成长。在此期间,一定遇到了很多的困惑,对未来的学习方向感到迷茫。我非常理解你们所面临的处境。我从2007年开始接触 Python 这门编程语言,从2009年开始单一使用 Python 应对所有的开发工作,直至今...
究竟你适不适合买Mac?
我清晰的记得,刚买的macbook pro回到家,开机后第一件事情,就是上了淘宝网,花了500元钱,找了一个上门维修电脑的师傅,上门给我装了一个windows系统。。。。。。 表砍我。。。 当时买mac的初衷,只是想要个固态硬盘的笔记本,用来运行一些复杂的扑克软件。而看了当时所有的SSD笔记本后,最终决定,还是买个好(xiong)看(da)的。 已经有好几个朋友问我mba怎么样了,所以今天尽量客观...
使用 Angular 打造微前端架构的 ToB 企业级应用
这篇文章其实已经准备了11个月了,因为虽然我们年初就开始使用 Angular 的微前端架构,但是产品一直没有正式发布,无法通过生产环境实践验证可行性,11月16日我们的产品正式灰度发布,所以是时候分享一下我们在使用 Angular 微前端这条路上的心得(踩过的坑)了额,希望和 Angular 社区一起成长一起进步,如果你对微前端有一定的了解并且已经在项目中尝试了可以忽略前面的章节。 什么是微前...
大学四年因为知道了这32个网站,我成了别人眼中的大神!
依稀记得,毕业那天,我们导员发给我毕业证的时候对我说“你可是咱们系的风云人物啊”,哎呀,别提当时多开心啦????,嗯,我们导员是所有导员中最帅的一个,真的???? 不过,导员说的是实话,很多人都叫我大神的,为啥,因为我知道这32个网站啊,你说强不强????,这次是绝对的干货,看好啦,走起来! PS:每个网站都是学计算机混互联网必须知道的,真的牛杯,我就不过多介绍了,大家自行探索,觉得没用的,尽管留言吐槽吧???? 社...
拿下微软、Google、Adobe,印度为何盛产科技圈 CEO?
作者 | 胡巍巍 出品 | CSDN(ID:CSDNnews) 世界500强中,30%的掌舵人,都是印度人。 是的,你没看错。这是近日《哈佛商业评论》的研究结果。 其中又以微软CEO萨提亚·纳德拉(Satya Nadella)、和谷歌CEO桑达尔·皮查伊(Sundar Pichai,以下简称劈柴)最为出名。 微软CEO萨提亚·纳德拉(Satya Nadella) 其他著名印度...
Linux(内核剖析):19---中断总体概述
一、为什么要引入中断? 任何操作系统内核的核心任务,都包含有对连接到计算机上的硬件设备进行有效管理,如硬盘、蓝光碟机、键盘、鼠标、3D 处理器,以及无线电等。而想要管理这些设备,首先要能和它们互通音信才行。众所周知,处理器的速度跟外围硬件设备的速度往往不在一个数量级上,因此,如果内核采取让处理器向硬件发出一个请求,然后专门等待回应的办法,显然差强人意。既然硬件的响应这么慢,那么内核就应该在此期间...
程序员写了一个新手都写不出的低级bug,被骂惨了。
这种新手都不会范的错,居然被一个工作好几年的小伙子写出来,差点被当场开除了。
Java工作4年来应聘要16K最后没要,细节如下。。。
前奏: 今天2B哥和大家分享一位前几天面试的一位应聘者,工作4年26岁,统招本科。 以下就是他的简历和面试情况。 基本情况: 专业技能: 1、&nbsp;熟悉Sping了解SpringMVC、SpringBoot、Mybatis等框架、了解SpringCloud微服务 2、&nbsp;熟悉常用项目管理工具:SVN、GIT、MAVEN、Jenkins 3、&nbsp;熟悉Nginx、tomca...
深度学习笔记------卷积神经网络
深度学习笔记------卷积神经网络
一文带你入门Linux
文章目录1.1 Linux的概述:1.1.1 什么是Linux:1.1.1.1 学习Linux之前先了解Unix1.1.1.2 Linux的概述:1.1.1.3 Linux的历史:1.1.1.4 Linux系统的应用:1.1.1.5 Linux的版本1.1.1.6 Linux的主流版本1.2 Linux的安装:1.2.1 虚拟机安装:1.2.1.1 什么是虚拟机1.2.1.2 安装VmWare1....
普通三本毕业,我怎么一路艰辛进入阿里的
英雄不问出处? 自古以来就有这样一句话,真的英雄不问出处吗?这句话太挫了。普通三本院校的我,大四的时候居然都不知道什么是校招,所以出处太重要了。这也是没有机会参加阿里校招的原因,毕竟校招门槛比社招还是要低的,最重要的是校招进入阿里能让你的起点比别人更高。 有幸可以社招进入阿里,了解了校招的思路,赶紧介绍给学弟们,现在我们三本院校的小学弟今年居然有 3 个人通过了阿里的校招。下面我也把这份宝贵的经...
作为一个程序员,CPU的这些硬核知识你必须会!
CPU对每个程序员来说,是个既熟悉又陌生的东西? 如果你只知道CPU是中央处理器的话,那可能对你并没有什么用,那么作为程序员的我们,必须要搞懂的就是CPU这家伙是如何运行的,尤其要搞懂它里面的寄存器是怎么一回事,因为这将让你从底层明白程序的运行机制。 随我一起,来好好认识下CPU这货吧 把CPU掰开来看 对于CPU来说,我们首先就要搞明白它是怎么回事,也就是它的内部构造,当然,CPU那么牛的一个东...
破14亿,Python分析我国存在哪些人口危机!
一、背景 二、爬取数据 三、数据分析 1、总人口 2、男女人口比例 3、人口城镇化 4、人口增长率 5、人口老化(抚养比) 6、各省人口 7、世界人口 四、遇到的问题 遇到的问题 1、数据分页,需要获取从1949-2018年数据,观察到有近20年参数:LAST20,由此推测获取近70年的参数可设置为:LAST70 2、2019年数据没有放上去,可以手动添加上去 3、将数据进行 行列转换 4、列名...
强烈推荐10本程序员在家读的书
很遗憾,这个春节注定是刻骨铭心的,新型冠状病毒让每个人的神经都是紧绷的。那些处在武汉的白衣天使们,尤其值得我们的尊敬。而我们这些窝在家里的程序员,能不外出就不外出,就是对社会做出的最大的贡献。 有些读者私下问我,窝了几天,有点颓丧,能否推荐几本书在家里看看。我花了一天的时间,挑选了 10 本我最喜欢的书,你可以挑选感兴趣的来读一读。读书不仅可以平复恐惧的压力,还可以对未来充满希望,毕竟苦难终将会...
Python实战:抓肺炎疫情实时数据,画2019-nCoV疫情地图
今天,群里白垩老师问如何用python画武汉肺炎疫情地图。白垩老师是研究海洋生态与地球生物的学者,国家重点实验室成员,于不惑之年学习python,实为我等学习楷模。先前我并没有关注武汉肺炎的具体数据,也没有画过类似的数据分布图。于是就拿了两个小时,专门研究了一下,遂成此文。
疫情数据接口api
返回json示例 { "errcode":0,//0标识接口正常 "data":{ "date":"2020-01-30 07:47:23",//实时更新时间 "diagnosed":7736,//确诊人数 "suspect":12167,//疑是病例人数 "death":170,//死亡人数 "cur...
智力题(程序员面试经典)
NO.1  有20瓶药丸,其中19瓶装有1克/粒的药丸,余下一瓶装有1.1克/粒的药丸。给你一台称重精准的天平,怎么找出比较重的那瓶药丸?天平只能用一次。 解法 有时候,严格的限制条件有可能反倒是解题的线索。在这个问题中,限制条件是天平只能用一次。 因为天平只能用一次,我们也得以知道一个有趣的事实:一次必须同时称很多药丸,其实更准确地说,是必须从19瓶拿出药丸进行称重。否则,如果跳过两瓶或更多瓶药...
疫情防控,开发者集结出战!
作者 | 屠敏出品 | CSDN(ID:CSDNnews)2020 年伊始,病毒肆虐,人心惶惶。截止北京时间 1 月 31 日 15 时 30 分,全国确诊新型冠状病毒肺炎的数字已达到了...
相关热词 c# 为空 判断 委托 c#记事本颜色 c# 系统默认声音 js中调用c#方法参数 c#引入dll文件报错 c#根据名称实例化 c#从邮件服务器获取邮件 c# 保存文件夹 c#代码打包引用 c# 压缩效率
立即提问