Ubuntu 16 64位安装gcc4.4.0 make失败,求大神解救

../.././gcc/gimple.h:67:54: warning: ISO C does not support ‘__FUNCTION__’ predefined identifier [-Wpedantic]
gimple_check_failed (__gs, FILE, LINE, FUNCTION, \
^
../.././gcc/gimple.h:4280:3: note: in expansion of macro ‘GIMPLE_CHECK’
GIMPLE_CHECK (gs, GIMPLE_PREDICT);
^
../.././gcc/gimple.h:68:17: warning: enum conversion when passing argument 6 of ‘gimple_check_failed’ is invalid in C++ -Wc++-compat, 0); \
^
../.././gcc/gimple.h:4280:3: note: in expansion of macro ‘GIMPLE_CHECK’
GIMPLE_CHECK (gs, GIMPLE_PREDICT);
^
../.././gcc/gimple.h:59:13: note: expected ‘enum tree_code’ but argument is of type ‘int’
extern void gimple_check_failed (const_gimple, const char , int, \
^
../.././gcc/toplev.c: At top level:
../.././gcc/toplev.c:536:1: error: redefinition of ‘floor_log2’
floor_log2 (unsigned HOST_WIDE_INT x)
^
In file included from ../.././gcc/toplev.c:58:0:
../.././gcc/toplev.h:190:1: note: previous definition of ‘floor_log2’ was here
floor_log2 (unsigned HOST_WIDE_INT x)
^
../.././gcc/toplev.c:571:1: error: redefinition of ‘exact_log2’
exact_log2 (unsigned HOST_WIDE_INT x)
^
In file included from ../.././gcc/toplev.c:58:0:
../.././gcc/toplev.h:196:1: note: previous definition of ‘exact_log2’ was here
exact_log2 (unsigned HOST_WIDE_INT x)
^
../.././gcc/toplev.c: In function ‘print_to_asm_out_file’:
../.././gcc/toplev.c:1185:7: warning: format not a string literal and no format arguments [-Wformat-security]
fprintf (asm_out_file, text);
^
../.././gcc/toplev.c: In function ‘print_to_stderr’:
../.././gcc/toplev.c:1214:7: warning: format not a string literal and no format arguments [-Wformat-security]
fprintf (stderr, text);
^
Makefile:2470: recipe for target 'toplev.o' failed
make[3]: *
* [toplev.o] Error 1
make[3]: Leaving directory '/home/zsj/下载/related/gcc-4.4.0/host-x86_64-unknown-linux-gnu/gcc'
Makefile:5144: recipe for target 'all-stage1-gcc' failed
make[2]: *** [all-stage1-gcc] Error 2
make[2]: Leaving directory '/home/zsj/下载/related/gcc-4.4.0'
Makefile:19883: recipe for target 'stage1-bubble' failed
make[1]: *** [stage1-bubble] Error 2
make[1]: Leaving directory '/home/zsj/下载/related/gcc-4.4.0'
Makefile:741: recipe for target 'all' failed
make: *** [all] Error 2

3个回答

你Ubuntu16自带的GCC版本应该起码gcc5了吧,你再编译gcc4.4的源码可能有一些语法警告错误。

oyljerry
oyljerry 你可以安装Oracle新版本支持Ubuntu16的
3 年多之前 回复
woxishiermei
小事儿儿 是的,自带gcc版本是gcc version 5.3.1 20160413 (Ubuntu 5.3.1-14ubuntu2),因为我安装oracle数据库,好像因为gcc版本过高,导致监听程序起不来。所以要重新装低版本的GCC,然后就出现一系列的错误了,安装了相关的依赖包,还是不行~刚开始学习,很多不懂。
3 年多之前 回复

是的,自带gcc版本是gcc version 5.3.1 20160413 (Ubuntu 5.3.1-14ubuntu2),因为我安装oracle数据库,好像因为gcc版本过高,导致监听程序起不来。所以要重新装低版本的GCC,然后就出现一系列的错误了,安装了相关的依赖包,还是不行~刚开始学习,很多不懂。

重复定义网上只有一种解决办法#ifndef...但我试着改了代码后没有效果,真恼人

Csdn user default icon
上传中...
上传图片
插入图片
抄袭、复制答案,以达到刷声望分或其他目的的行为,在CSDN问答是严格禁止的,一经发现立刻封号。是时候展现真正的技术了!
其他相关推荐
安装gcc4.9.0之后找不到include目录
[root@ptb habi]# g++ -v ccc.cpp 使用内建 specs。 COLLECT_GCC=g++ 目标:i686-pc-linux-gnu 配置为:../configure --prefix=/usr/local/gcc-4.9.0 --mandir=/usr/share/man --infodir=/usr/share/info --enable-shared --enable-threads=posix --enable-checking=release --with-system-zlib --enable-__cxa_atexit --disable-libunwind-exceptions --enable-libgcj-multifile --enable-languages=c,c++ 线程模型:posix gcc 版本 4.9.0 (GCC) COLLECT_GCC_OPTIONS='-v' '-shared-libgcc' '-mtune=generic' '-march=pentiumpro' cc1plus -quiet -v -iprefix /usr/bin/../lib/gcc/i686-pc-linux-gnu/4.9.0/ -D_GNU_SOURCE ccc.cpp -quiet -dumpbase ccc.cpp -mtune=generic -march=pentiumpro -auxbase ccc -version -o /tmp/ccpjzXOC.s GNU C++ (GCC) 版本 4.9.0 (i686-pc-linux-gnu) 由 GNU C 版本 4.9.0 编译,GMP 版本 4.3.2,MPFR 版本 2.4.2,MPC 版本 0.8.1 GGC 准则:--param ggc-min-expand=100 --param ggc-min-heapsize=131072 忽略不存在的目录“/usr/bin/../lib/gcc/i686-pc-linux-gnu/4.9.0/../../../../include/c++/4.9.0” 忽略不存在的目录“/usr/bin/../lib/gcc/i686-pc-linux-gnu/4.9.0/../../../../include/c++/4.9.0/i686-pc-linux-gnu” 忽略不存在的目录“/usr/bin/../lib/gcc/i686-pc-linux-gnu/4.9.0/../../../../include/c++/4.9.0/backward” 忽略不存在的目录“/usr/bin/../lib/gcc/i686-pc-linux-gnu/4.9.0/include” 忽略不存在的目录“/usr/bin/../lib/gcc/i686-pc-linux-gnu/4.9.0/include-fixed” 忽略不存在的目录“/usr/bin/../lib/gcc/i686-pc-linux-gnu/4.9.0/../../../../i686-pc-linux-gnu/include” 忽略不存在的目录“/usr/bin/../lib/gcc/../../lib/gcc/i686-pc-linux-gnu/4.9.0/../../../../include/c++/4.9.0” 忽略不存在的目录“/usr/bin/../lib/gcc/../../lib/gcc/i686-pc-linux-gnu/4.9.0/../../../../include/c++/4.9.0/i686-pc-linux-gnu” 忽略不存在的目录“/usr/bin/../lib/gcc/../../lib/gcc/i686-pc-linux-gnu/4.9.0/../../../../include/c++/4.9.0/backward” 忽略不存在的目录“/usr/bin/../lib/gcc/../../lib/gcc/i686-pc-linux-gnu/4.9.0/include” 忽略不存在的目录“/usr/local/include” 忽略不存在的目录“/usr/bin/../lib/gcc/../../lib/gcc/i686-pc-linux-gnu/4.9.0/include-fixed” 忽略不存在的目录“/usr/bin/../lib/gcc/../../lib/gcc/i686-pc-linux-gnu/4.9.0/../../../../i686-pc-linux-gnu/include” 忽略重复的目录“/usr/include” #include "..." 搜索从这里开始: #include <...> 搜索从这里开始: /usr/bin/../lib/gcc/../../include 搜索列表结束。 GNU C++ (GCC) 版本 4.9.0 (i686-pc-linux-gnu) 由 GNU C 版本 4.9.0 编译,GMP 版本 4.3.2,MPFR 版本 2.4.2,MPC 版本 0.8.1 GGC 准则:--param ggc-min-expand=100 --param ggc-min-heapsize=131072 Compiler executable checksum: 3c13c9968389e205e0f7e12bfe79e4e8 ccc.cpp:1:20: 致命错误:iostream:没有那个文件或目录 #include <iostream> ^ 编译中断。
Ubuntu server 15.0.4安装Redis make命令不能执行
按照官方的下载安装指导:http://redis.io/download#installation Download, extract and compile Redis with: $ wget http://download.redis.io/releases/redis-3.0.3.tar.gz $ tar xzf redis-3.0.3.tar.gz $ cd redis-3.0.3 $ make The binaries that are now compiled are available in thesrcdirectory. Run Redis with: $ src/redis-server You can interact with Redis using the built-in client: $ src/redis-cli redis> set foo bar OK redis> get foo "bar" 我在执行make命令的时候执行不下去了,为嘛我不能使用make命令呢?我下载包解压后,使用make 提示The program 'make' can not be found in following packages.* make .... * make-gradle .......求解释,对Ubuntu不是很熟,请大仙指教! 操作截图: ![图片说明](https://img-ask.csdn.net/upload/201508/19/1439975912_162053.png) ![图片说明](https://img-ask.csdn.net/upload/201508/19/1439975995_329486.png) 在sudo高级权限下操作make还是不行: ![图片说明](https://img-ask.csdn.net/upload/201508/19/1439976271_745329.png) ## 原因:Ubuntu需要安装gcc工具; ## 最终问题解决方案: 安装gcc前执行$sudo apt-get update,若不成功再执行$sudo apt-get clean: $sudo apt-get clean $sudo apt-get update $sudo apt-get build-dep gcc 按照上面处理就可以使用make命令了。
在升级到gcc4.9.1时 make check出现的错误
make[1]: Entering directory `/home/he/gccbuild' make[2]: Entering directory `/home/he/gccbuild/fixincludes' autogen -T ../../gcc-4.9.1/fixincludes/check.tpl ../../gcc-4.9.1/fixincludes/inclhack.def /bin/bash: autogen: command not found make[2]: *** [check] Error 127 make[2]: Leaving directory `/home/he/gccbuild/fixincludes' make[1]: *** [check-fixincludes] Error 2 make[1]: Leaving directory `/home/he/gccbuild' make: *** [do-check] Error 2
Ubuntu 16.04 编译 Ncurses 6.0 报错
### Ubuntu 16.04 LTS 编译 Ncurses 6.0 报错: ``` In file included from ./curses.priv.h:325:0, from ../ncurses/lib_gen.c:19: _24273.c:843:15: error: expected ‘)’ before ‘int’ ../include/curses.h:1631:56: note: in definition of macro ‘mouse_trafo’ #define mouse_trafo(y,x,to_screen) wmouse_trafo(stdscr,y,x,to_screen) ^ Makefile:962: recipe for target '../objects/lib_gen.o' failed make[1]: *** [../objects/lib_gen.o] Error 1 make[1]: Leaving directory '/home/netsamir/Sofware/Tmux/ncurses-6.0/ncurses' Makefile:113: recipe for target 'all' failed make: *** [all] Error 2 ``` ### 系统配置 ``` $ lsb_release -a No LSB modules are available. Distributor ID: Ubuntu Description: Ubuntu 16.04 LTS Release: 16.04 Codename: xenial $ gcc -v Using built-in specs. COLLECT_GCC=gcc COLLECT_LTO_WRAPPER=/usr/lib/gcc/x86_64-linux-gnu/5/lto-wrapper Target: x86_64-linux-gnu Configured with: ../src/configure -v --with-pkgversion='Ubuntu 5.4.0-6ubuntu1~16.04.4' --with-bugurl=file:///usr/share/doc/gcc-5/README.Bugs --enable-languages=c,ada,c++,java,go,d,fortran,objc,obj-c++ --prefix=/usr --program-suffix=-5 --enable-shared --enable-linker-build-id --libexecdir=/usr/lib --without-included-gettext --enable-threads=posix --libdir=/usr/lib --enable-nls --with-sysroot=/ --enable-clocale=gnu --enable-libstdcxx-debug --enable-libstdcxx-time=yes --with-default-libstdcxx-abi=new --enable-gnu-unique-object --disable-vtable-verify --enable-libmpx --enable-plugin --with-system-zlib --disable-browser-plugin --enable-java-awt=gtk --enable-gtk-cairo --with-java-home=/usr/lib/jvm/java-1.5.0-gcj-5-amd64/jre --enable-java-home --with-jvm-root-dir=/usr/lib/jvm/java-1.5.0-gcj-5-amd64 --with-jvm-jar-dir=/usr/lib/jvm-exports/java-1.5.0-gcj-5-amd64 --with-arch-directory=amd64 --with-ecj-jar=/usr/share/java/eclipse-ecj.jar --enable-objc-gc --enable-multiarch --disable-werror --with-arch-32=i686 --with-abi=m64 --with-multilib-list=m32,m64,mx32 --enable-multilib --with-tune=generic --enable-checking=release --build=x86_64-linux-gnu --host=x86_64-linux-gnu --target=x86_64-linux-gnu Thread model: posix gcc version 5.4.0 20160609 (Ubuntu 5.4.0-6ubuntu1~16.04.4) $ g++ -v Using built-in specs. COLLECT_GCC=g++ COLLECT_LTO_WRAPPER=/usr/lib/gcc/x86_64-linux-gnu/5/lto-wrapper Target: x86_64-linux-gnu Configured with: ../src/configure -v --with-pkgversion='Ubuntu 5.4.0-6ubuntu1~16.04.4' --with-bugurl=file:///usr/share/doc/gcc-5/README.Bugs --enable-languages=c,ada,c++,java,go,d,fortran,objc,obj-c++ --prefix=/usr --program-suffix=-5 --enable-shared --enable-linker-build-id --libexecdir=/usr/lib --without-included-gettext --enable-threads=posix --libdir=/usr/lib --enable-nls --with-sysroot=/ --enable-clocale=gnu --enable-libstdcxx-debug --enable-libstdcxx-time=yes --with-default-libstdcxx-abi=new --enable-gnu-unique-object --disable-vtable-verify --enable-libmpx --enable-plugin --with-system-zlib --disable-browser-plugin --enable-java-awt=gtk --enable-gtk-cairo --with-java-home=/usr/lib/jvm/java-1.5.0-gcj-5-amd64/jre --enable-java-home --with-jvm-root-dir=/usr/lib/jvm/java-1.5.0-gcj-5-amd64 --with-jvm-jar-dir=/usr/lib/jvm-exports/java-1.5.0-gcj-5-amd64 --with-arch-directory=amd64 --with-ecj-jar=/usr/share/java/eclipse-ecj.jar --enable-objc-gc --enable-multiarch --disable-werror --with-arch-32=i686 --with-abi=m64 --with-multilib-list=m32,m64,mx32 --enable-multilib --with-tune=generic --enable-checking=release --build=x86_64-linux-gnu --host=x86_64-linux-gnu --target=x86_64-linux-gnu Thread model: posix gcc version 5.4.0 20160609 (Ubuntu 5.4.0-6ubuntu1~16.04.4) ```
gcc从4.4.7升级到4.8.2后产生的问题
gcc 4.4.7 升级到 4.8.2。 升级前 动态加载的对象 和 主程序 看到的全局对象的 地址空间是一致的, 升级后两者看到的全局对象的地址空间不一致了。全局对象 是 static的。 产生此问题的原因是什么? 怎么解决?
求助,升级gcc8.2.0时一直编译失败
尝试安装一直失败,还望大神指点迷津。 下面是一张错误截图。![图片说明](https://img-ask.csdn.net/upload/201812/13/1544678993_238312.png)
关于centos卸载gcc的问题?
linux 3.10 centos 7系统,默认安装的gcc版本为4.8.5。因为跑程序要用到4.9以上的gcc版本,所以安装了gcc-8.3.0。 安装完成后,使用cat /proc/version命令只能看到gcc4.8.5,使用gcc -v命令只能看到gcc8.3.0。 运行程序时,又提示gcc版本不能高于gcc7.0,所以想卸载gcc8.3.0。但是利用rpm -q gcc 只能找到gcc-4.8.5,求问该怎么办?
Ubuntu 14.4安装完QtEmbedded-4.8.5-arm,加载qmake失败十万火急
![图片说明](https://img-ask.csdn.net/upload/201708/15/1502805113_761273.jpg) gcc版本为4.8.4,arm-linux-gcc为4.3.2
ubuntu16.04安装opencv时,make不通过该怎么办?
cmake已经完成,情况如下: ``` cmake .. -- Detected version of GNU GCC: 54 (504) -- Found ZLIB: /usr/lib/x86_64-linux-gnu/libz.so (found suitable version "1.2.8", minimum required is "1.2.3") -- Found ZLIB: /usr/lib/x86_64-linux-gnu/libz.so (found version "1.2.8") -- Checking for module 'gstreamer-base-1.0' -- No package 'gstreamer-base-1.0' found -- Checking for module 'gstreamer-video-1.0' -- No package 'gstreamer-video-1.0' found -- Checking for module 'gstreamer-app-1.0' -- No package 'gstreamer-app-1.0' found -- Checking for module 'gstreamer-riff-1.0' -- No package 'gstreamer-riff-1.0' found -- Checking for module 'gstreamer-pbutils-1.0' -- No package 'gstreamer-pbutils-1.0' found -- Checking for module 'gstreamer-base-0.10' -- No package 'gstreamer-base-0.10' found -- Checking for module 'gstreamer-video-0.10' -- No package 'gstreamer-video-0.10' found -- Checking for module 'gstreamer-app-0.10' -- No package 'gstreamer-app-0.10' found -- Checking for module 'gstreamer-riff-0.10' -- No package 'gstreamer-riff-0.10' found -- Checking for module 'gstreamer-pbutils-0.10' -- No package 'gstreamer-pbutils-0.10' found -- Looking for linux/videodev.h -- Looking for linux/videodev.h - not found -- Looking for linux/videodev2.h -- Looking for linux/videodev2.h - found -- Looking for sys/videoio.h -- Looking for sys/videoio.h - not found -- Checking for module 'libavresample' -- No package 'libavresample' found -- Looking for libavformat/avformat.h -- Looking for libavformat/avformat.h - found -- Looking for ffmpeg/avformat.h -- Looking for ffmpeg/avformat.h - not found -- Checking for module 'libgphoto2' -- No package 'libgphoto2' found -- found IPP (ICV version): 9.0.1 [9.0.1] -- at: /home/quxutao/opencv-3.1.0/3rdparty/ippicv/unpack/ippicv_lnx -- CUDA detected: 7.5 -- CUDA NVCC target flags: -gencode;arch=compute_20,code=sm_20;-gencode;arch=compute_20,code=sm_21;-gencode;arch=compute_30,code=sm_30;-gencode;arch=compute_35,code=sm_35;-gencode;arch=compute_30,code=compute_30 -- Could NOT find Doxygen (missing: DOXYGEN_EXECUTABLE) -- To enable PlantUML support, set PLANTUML_JAR environment variable or pass -DPLANTUML_JAR=<filepath> option to cmake -- Could NOT find PythonInterp: Found unsuitable version "1.4", but required is at least "2.7" (found /home/quxutao/.virtualenvs/cv/bin/python) -- Could NOT find PythonInterp: Found unsuitable version "1.4", but required is at least "2.6" (found /home/quxutao/.virtualenvs/cv/bin/python) -- Could NOT find PythonInterp: Found unsuitable version "1.4", but required is at least "3.4" (found /home/quxutao/.virtualenvs/cv/bin/python) -- Could NOT find PythonInterp: Found unsuitable version "1.4", but required is at least "3.2" (found /home/quxutao/.virtualenvs/cv/bin/python) -- Could NOT find JNI (missing: JAVA_INCLUDE_PATH JAVA_INCLUDE_PATH2 JAVA_AWT_INCLUDE_PATH) -- Could NOT find Matlab (missing: MATLAB_MEX_SCRIPT MATLAB_INCLUDE_DIRS MATLAB_ROOT_DIR MATLAB_LIBRARIES MATLAB_LIBRARY_DIRS MATLAB_MEXEXT MATLAB_ARCH MATLAB_BIN) -- VTK is not found. Please set -DVTK_DIR in CMake to VTK build directory, or to VTK install subdirectory with VTKConfig.cmake file -- Caffe: NO -- Protobuf: YES -- Glog: NO -- HDF5: YES -- Module opencv_sfm disabled because the following dependencies are not found: Eigen Glog/Gflags -- Tesseract: NO -- HDF5: YES -- Build libprotobuf from sources: -- The protocol buffer compiler not found -- Tesseract: NO -- -- General configuration for OpenCV 3.1.0 ===================================== -- Version control: unknown -- -- Platform: -- Host: Linux 4.15.0-47-generic x86_64 -- CMake: 3.5.1 -- CMake generator: Unix Makefiles -- CMake build tool: /usr/bin/make -- Configuration: RELEASE -- -- C/C++: -- Built as dynamic libs?: YES -- C++ Compiler: /usr/bin/c++ (ver 5.4.0) -- C++ flags (Release): -fsigned-char -W -Wall -Werror=return-type -Werror=non-virtual-dtor -Werror=address -Werror=sequence-point -Wformat -Werror=format-security -Wmissing-declarations -Wundef -Winit-self -Wpointer-arith -Wshadow -Wsign-promo -Wno-narrowing -Wno-delete-non-virtual-dtor -fdiagnostics-show-option -Wno-long-long -pthread -fomit-frame-pointer -msse -msse2 -mno-avx -msse3 -mno-ssse3 -mno-sse4.1 -mno-sse4.2 -ffunction-sections -fvisibility=hidden -fvisibility-inlines-hidden -O3 -DNDEBUG -DNDEBUG -- C++ flags (Debug): -fsigned-char -W -Wall -Werror=return-type -Werror=non-virtual-dtor -Werror=address -Werror=sequence-point -Wformat -Werror=format-security -Wmissing-declarations -Wundef -Winit-self -Wpointer-arith -Wshadow -Wsign-promo -Wno-narrowing -Wno-delete-non-virtual-dtor -fdiagnostics-show-option -Wno-long-long -pthread -fomit-frame-pointer -msse -msse2 -mno-avx -msse3 -mno-ssse3 -mno-sse4.1 -mno-sse4.2 -ffunction-sections -fvisibility=hidden -fvisibility-inlines-hidden -g -O0 -DDEBUG -D_DEBUG -- C Compiler: /usr/bin/cc -- C flags (Release): -fsigned-char -W -Wall -Werror=return-type -Werror=non-virtual-dtor -Werror=address -Werror=sequence-point -Wformat -Werror=format-security -Wmissing-declarations -Wmissing-prototypes -Wstrict-prototypes -Wundef -Winit-self -Wpointer-arith -Wshadow -Wno-narrowing -fdiagnostics-show-option -Wno-long-long -pthread -fomit-frame-pointer -msse -msse2 -mno-avx -msse3 -mno-ssse3 -mno-sse4.1 -mno-sse4.2 -ffunction-sections -fvisibility=hidden -O3 -DNDEBUG -DNDEBUG -- C flags (Debug): -fsigned-char -W -Wall -Werror=return-type -Werror=non-virtual-dtor -Werror=address -Werror=sequence-point -Wformat -Werror=format-security -Wmissing-declarations -Wmissing-prototypes -Wstrict-prototypes -Wundef -Winit-self -Wpointer-arith -Wshadow -Wno-narrowing -fdiagnostics-show-option -Wno-long-long -pthread -fomit-frame-pointer -msse -msse2 -mno-avx -msse3 -mno-ssse3 -mno-sse4.1 -mno-sse4.2 -ffunction-sections -fvisibility=hidden -g -O0 -DDEBUG -D_DEBUG -- Linker flags (Release): -- Linker flags (Debug): -- Precompiled headers: YES -- Extra dependencies: /usr/lib/x86_64-linux-gnu/libpng.so /usr/lib/x86_64-linux-gnu/libtiff.so /usr/lib/x86_64-linux-gnu/libjasper.so /usr/lib/x86_64-linux-gnu/libjpeg.so gtk-3 gdk-3 pangocairo-1.0 pango-1.0 atk-1.0 cairo-gobject cairo gdk_pixbuf-2.0 gio-2.0 gobject-2.0 gthread-2.0 glib-2.0 dc1394 v4l1 v4l2 avcodec-ffmpeg avformat-ffmpeg avutil-ffmpeg swscale-ffmpeg /usr/lib/x86_64-linux-gnu/libbz2.so /usr/lib/x86_64-linux-gnu/hdf5/openmpi/lib/libhdf5.so /usr/lib/x86_64-linux-gnu/libsz.so /usr/lib/x86_64-linux-gnu/libz.so /usr/lib/x86_64-linux-gnu/libdl.so /usr/lib/x86_64-linux-gnu/libm.so dl m pthread rt cudart nppc nppi npps cufft -L/usr/lib/x86_64-linux-gnu -- 3rdparty dependencies: libwebp IlmImf libprotobuf -- -- OpenCV modules: -- To be built: cudev core cudaarithm flann hdf imgproc ml reg surface_matching video cudabgsegm cudafilters cudaimgproc cudawarping dnn fuzzy imgcodecs photo shape videoio cudacodec highgui objdetect plot ts xobjdetect xphoto bgsegm bioinspired dpm face features2d line_descriptor saliency text calib3d ccalib cudafeatures2d cudalegacy cudaobjdetect cudaoptflow cudastereo datasets rgbd stereo structured_light superres tracking videostab xfeatures2d ximgproc aruco optflow stitching -- Disabled: world contrib_world -- Disabled by dependency: - -- Unavailable: java python2 python3 viz cvv matlab sfm -- -- GUI: -- QT: NO -- GTK+ 3.x: YES (ver 3.18.9) -- GThread : YES (ver 2.48.2) -- GtkGlExt: NO -- OpenGL support: NO -- VTK support: NO -- -- Media I/O: -- ZLib: /usr/lib/x86_64-linux-gnu/libz.so (ver 1.2.8) -- JPEG: /usr/lib/x86_64-linux-gnu/libjpeg.so (ver ) -- WEBP: build (ver 0.3.1) -- PNG: /usr/lib/x86_64-linux-gnu/libpng.so (ver 1.2.54) -- TIFF: /usr/lib/x86_64-linux-gnu/libtiff.so (ver 42 - 4.0.6) -- JPEG 2000: /usr/lib/x86_64-linux-gnu/libjasper.so (ver 1.900.1) -- OpenEXR: build (ver 1.7.1) -- GDAL: NO -- -- Video I/O: -- DC1394 1.x: NO -- DC1394 2.x: YES (ver 2.2.4) -- FFMPEG: YES -- codec: YES (ver 56.60.100) -- format: YES (ver 56.40.101) -- util: YES (ver 54.31.100) -- swscale: YES (ver 3.1.101) -- resample: NO -- gentoo-style: YES -- GStreamer: NO -- OpenNI: NO -- OpenNI PrimeSensor Modules: NO -- OpenNI2: NO -- PvAPI: NO -- GigEVisionSDK: NO -- UniCap: NO -- UniCap ucil: NO -- V4L/V4L2: Using libv4l1 (ver 1.10.0) / libv4l2 (ver 1.10.0) -- XIMEA: NO -- Xine: NO -- gPhoto2: NO -- -- Parallel framework: pthreads -- -- Other third-party libraries: -- Use IPP: 9.0.1 [9.0.1] -- at: /home/quxutao/opencv-3.1.0/3rdparty/ippicv/unpack/ippicv_lnx -- Use IPP Async: NO -- Use VA: NO -- Use Intel VA-API/OpenCL: NO -- Use Eigen: NO -- Use Cuda: YES (ver 7.5) -- Use OpenCL: YES -- Use custom HAL: NO -- -- NVIDIA CUDA -- Use CUFFT: YES -- Use CUBLAS: NO -- USE NVCUVID: NO -- NVIDIA GPU arch: 20 21 30 35 -- NVIDIA PTX archs: 30 -- Use fast math: NO -- -- OpenCL: -- Version: dynamic -- Include path: /home/quxutao/opencv-3.1.0/3rdparty/include/opencl/1.2 -- Use AMDFFT: NO -- Use AMDBLAS: NO -- -- Python 2: -- Interpreter: NO -- -- Python 3: -- Interpreter: NO -- -- Python (for build): NO -- -- Java: -- ant: NO -- JNI: NO -- Java wrappers: NO -- Java tests: NO -- -- Matlab: Matlab not found or implicitly disabled -- -- Documentation: -- Doxygen: NO -- PlantUML: NO -- -- Tests and samples: -- Tests: YES -- Performance tests: YES -- C/C++ Examples: YES -- -- Install path: /usr/local -- -- cvconfig.h is in: /home/quxutao/opencv-3.1.0/build -- ----------------------------------------------------------------- -- -- Configuring done -- Generating done -- Build files have been written to: /home/quxutao/opencv-3.1.0/build ``` 但是make的时候,就报错: ``` make [ 4%] Built target libwebp [ 4%] Built target IlmImf [ 4%] Built target opencv_cudev [ 4%] Built target opencv_core_pch_dephelp [ 4%] Built target pch_Generate_opencv_core [ 4%] Building NVCC (Device) object modules/core/CMakeFiles/cuda_compile.dir/src/cuda/cuda_compile_generated_gpu_mat.cu.o /usr/include/string.h: In function ‘void* __mempcpy_inline(void*, const void*, size_t)’: /usr/include/string.h:652:42: error: ‘memcpy’ was not declared in this scope return (char *) memcpy (__dest, __src, __n) + __n; ^ CMake Error at cuda_compile_generated_gpu_mat.cu.o.cmake:266 (message): Error generating file /home/quxutao/opencv-3.1.0/build/modules/core/CMakeFiles/cuda_compile.dir/src/cuda/./cuda_compile_generated_gpu_mat.cu.o modules/core/CMakeFiles/opencv_core.dir/build.make:399: recipe for target 'modules/core/CMakeFiles/cuda_compile.dir/src/cuda/cuda_compile_generated_gpu_mat.cu.o' failed make[2]: *** [modules/core/CMakeFiles/cuda_compile.dir/src/cuda/cuda_compile_generated_gpu_mat.cu.o] Error 1 CMakeFiles/Makefile2:2307: recipe for target 'modules/core/CMakeFiles/opencv_core.dir/all' failed make[1]: *** [modules/core/CMakeFiles/opencv_core.dir/all] Error 2 Makefile:160: recipe for target 'all' failed make: *** [all] Error 2 ``` 弄了一下午了,没有找到相关的解决办法。我的cuda是7.5,其实不用GPU也可以的,我只是想用KAZE滤波。。。跪求大神帮忙。。。
Linux下安装tripwire-2.4.2.2-src.tar.bz2报错
当我执行完./configure之后:checking build system type... x86_64-unknown-linux-gnu checking host system type... x86_64-unknown-linux-gnu checking target system type... x86_64-unknown-linux-gnu checking for a BSD-compatible install... /usr/bin/install -c checking whether build environment is sane... yes checking for gawk... gawk checking whether make sets $(MAKE)... yes checking for gcc... gcc checking for C compiler default output file name... configure: error: C compiler cannot create executables See `config.log' for more details. gcc版本信息为: gcc (GCC) 4.4.7 20120313 (Red Hat 4.4.7-4) Copyright (C) 2010 Free Software Foundation, Inc. This is free software; see the source for copying conditions. There is NO warranty; not even for MERCHANTABILITY or FITNESS FOR A PARTICULAR PURPOSE.
ubuntu16.04下--c语言gcc问题
写了一个小链表解决一个问题。 自己电脑上(gcc--version 5.4.0)gcc是没有任何问题的,给定的测试也没有任何问题。 但是在线测试(gcc4.7.2)却一直出现“段错误” 一脸懵逼。。。 请问各位大佬有没有关于这个问题的一些思路啊(如需要也可贴上代码)?
centos7.6 安装python3.执行/configure时,gcc异常
安装python时,执行./configure初始编译,报gcc没有工作: 错误信息: ``` checking build system type... x86_64-unknown-linux-gnu checking host system type... x86_64-unknown-linux-gnu checking for python3.6... no checking for python3... no checking for python... python checking for --enable-universalsdk... no checking for --with-universal-archs... no checking MACHDEP... linux checking for --without-gcc... no checking for --with-icc... no checking for gcc... gcc checking whether the C compiler works... no configure: error: in `/opt/Python-3.6.0': configure: error: C compiler cannot create executables ``` config.log信息: ![图片说明](https://img-ask.csdn.net/upload/201909/09/1568015863_225982.png) 去看日志发现ld找不到 执行which ld确实找不到。 ![图片说明](https://img-ask.csdn.net/upload/201909/09/1568015884_257870.png) 去搜索资料,都说安装gcc即可,可是我已经把python所需的依赖全部安装了,c编译器还是没有工作,我想可能是ld问题,我在安装pydoop时也遇到ld问题,很头疼,求解!!!
NCL-6.5.0安装后官方Test后失败
Ubuntu18 64bit gcc-6.5.0 安装ncl-6.5.0(装的是gcc-6.3.0的) 采用官方Test ![图片说明](https://img-ask.csdn.net/upload/201902/23/1550918375_458264.png) 第一步成功了,但第二步出现问题: ![图片说明](https://img-ask.csdn.net/upload/201902/23/1550918468_613806.png) 百度后未找到类似问题 麻烦求解!!!
ubuntu上把gcc高版本换成低版本
我安装了ubuntu14.04,gcc默认版本为4.8,可是我要用gcc4.7,怎么也换不过来了,各位有谁指点一下
Ubuntu14.04升级gcc版本到5出错
我主要按照博客[Ubuntu 14.04 LTS 下升级 gcc 到 gcc-4.9、gcc-5 版本](http://www.cnblogs.com/BlackStorm/p/5183490.html "")的步骤升级gcc。 ``` sudo add-apt-repository ppa:ubuntu-toolchain-r/test sudo apt-get update sudo apt-get install software-properties-common sudo apt-get upgrade sudo apt-get install gcc-5 g++-5 ``` 之后出现问题: ``` gph@gph-pc:~$ sudo apt-get install gcc-5 Reading package lists... Done Building dependency tree Reading state information... Done Some packages could not be installed. This may mean that you have requested an impossible situation or if you are using the unstable distribution that some required packages have not yet been created or been moved out of Incoming. The following information may help to resolve the situation: The following packages have unmet dependencies: gcc-5:i386 : Depends: cpp-5:i386 (= 5.4.1-2ubuntu1~14.04) but it is not going to be installed Depends: libcc1-0:i386 (>= 5.4.1-2ubuntu1~14.04) but it is not going to be installed Depends: binutils:i386 (>= 2.24) but it is not going to be installed Depends: libgcc-5-dev:i386 (= 5.4.1-2ubuntu1~14.04) but it is not going to be installed Depends: libc6:i386 (>= 2.15) but it is not going to be installed Depends: libgcc1:i386 (>= 1:3.0) but it is not going to be installed Depends: libgmp10:i386 but it is not going to be installed Depends: libisl15:i386 (>= 0.15) but it is not going to be installed Depends: libmpc3:i386 but it is not going to be installed Depends: libmpfr4:i386 (>= 3.1.3) but it is not going to be installed Depends: libstdc++6:i386 (>= 4.1.1) but it is not going to be installed Depends: zlib1g:i386 (>= 1:1.1.4) but it is not going to be installed Recommends: libc6-dev:i386 (>= 2.13-0ubuntu6) but it is not going to be installed E: Unable to correct problems, you have held broken packages. ``` 请问有人知道如何解决吗? 已经百度和Google过相关的问题了,还是没有解决,请各位提供帮助,谢谢! =================================================================== 最后通过本地编译安装的方式安装了gcc5.3.0,但是在编译一个代码的时候出现如下错误: ``` .build_release/lib/libcaffe.so: undefined reference to `boost::match_results<__gnu_cxx::__normal_iterator<char const*, std::__cxx11::basic_string<char.build_release/lib, std/libcaffe.so: undefined reference to `boost::match_results<__gnu_cxx::__normal_iterator<char const*, std:::__cxx11:::basic_string<charchar_traits, std<::char_traits<charchar>, std::allocator<char> > >, std::allocator<boost::sub_match<>__gnu_cxx::__normal_iterator<, .build_release/tools/get_image_size.o: In function `std::__cxx11::basic_string<char, std::char_traits<char>, std::allocator<char> >* google::MakeCheckOpString<unsigned long, unsigned long>(unsigned long const&, unsigned long const&, char const*)': get_image_size.cpp:(.text._ZN6google17MakeCheckOpStringImmEEPNSt7__cxx1112basic_stringIcSt11char_traitsIcESaIcEEERKT_RKT0_PKc[_ZN6google17MakeCheckOpStringImmEEPNSt7__cxx1112basic_stringIcSt11char_traitsIcESaIcEEERKT_RKT0_PKc]+0x41): undefined reference to `google::base::CheckOpMessageBuilder::NewString[abi:cxx11]()' .build_release/tools/get_image_size.o: In function `main': get_image_size.cpp:(.text.startup+0x66): undefined reference to `google::SetUsageMessage(std::__cxx11::basic_string<char, std::char_traits<char>, std::allocator<char> > const&)' get_image_size.cpp:(.text.startup+0x722): undefined reference to `caffe::GetImageSize(std::__cxx11::basic_string<char, std::char_traits<char>, std::allocator<char> > const&, int*, int*)' 。 。 。 。 。 。 .build_release/lib/libcaffe.so: undefined reference to `google::base::CheckOpMessageBuilder::NewString[abi:cxx11]()' collect2: error: ld returned 1 exit status make: *** [.build_release/tools/device_query.bin] Error 1 ``` 这又是什么问题。。。?
实用matlab+gcc 4. 7.7的时候出现报错
undefined reference to `__warn_memset_zero_len' 编译的时候出现的问题大概就是这个,我用的是matlab的2015b和gcc的4.7.7这里编译源码是matcnvnet我想知道解决的方法或者干脆就是直接给我一个编译好的也可以,真的要被逼疯了!
【菜鸟级GCC问题,求大牛指导】
我的系统是openSUSE13.1,已经安装了GCC4.8.1,想要升级GCC到5.1.0,已经下载了GCC5.1.0并且解压了,但是下一步不知道如何安装,求大牛指导,谢谢了
GCC4.7之后不是已经支持C11了么,为什么函数 aligned_alloc()仍然不能使用?
如题,GCC在版本4.7之后不是已经支持C11了吗?为什么C11中添加的函数 _aligned__alloc()仍然不能使用。求大神告知!
Kernel panic - not syncing: Attempted to kill init! exitcode=0x00000004、Linux4.19.66/at91/ramdisk/gcc7.3.1。
**环境描述:** 最近移植4.19.66内核,使用ramdisk文件系统,at91sam9x5,编译器使用的是gcc-linaro-7.3.1-2018.05-x86_64_arm-linux-gnueabi **问题如下:** 挂载文件系统报错 kernel panic - not syncing: Attempted to kill init exitcode=0x00000004 ![图片说明](https://img-ask.csdn.net/upload/201909/27/1569550340_681476.jpg) **尝试过的方法:** 网上所说的内核和busybox编译选择EABI选项,这个确认是选择了的,无法解决我的问题! 同时搜索看到有的朋友说gcc编译器的lib库复制问题,请问gcc库复制有什么特别的地方,我是将lib目录下的内容全部删除、sudo rm -rf *,然后复制,sudo cp -rf * ./,最后使用strip缩小文件大小。
终于明白阿里百度这样的大公司,为什么面试经常拿ThreadLocal考验求职者了
点击上面↑「爱开发」关注我们每晚10点,捕获技术思考和创业资源洞察什么是ThreadLocalThreadLocal是一个本地线程副本变量工具类,各个线程都拥有一份线程私有的数
程序员必须掌握的核心算法有哪些?
由于我之前一直强调数据结构以及算法学习的重要性,所以就有一些读者经常问我,数据结构与算法应该要学习到哪个程度呢?,说实话,这个问题我不知道要怎么回答你,主要取决于你想学习到哪些程度,不过针对这个问题,我稍微总结一下我学过的算法知识点,以及我觉得值得学习的算法。这些算法与数据结构的学习大多数是零散的,并没有一本把他们全部覆盖的书籍。下面是我觉得值得学习的一些算法以及数据结构,当然,我也会整理一些看过
《奇巧淫技》系列-python!!每天早上八点自动发送天气预报邮件到QQ邮箱
此博客仅为我业余记录文章所用,发布到此,仅供网友阅读参考,如有侵权,请通知我,我会删掉。 补充 有不少读者留言说本文章没有用,因为天气预报直接打开手机就可以收到了,为何要多此一举发送到邮箱呢!!!那我在这里只能说:因为你没用,所以你没用!!! 这里主要介绍的是思路,不是天气预报!不是天气预报!!不是天气预报!!!天气预报只是用于举例。请各位不要再刚了!!! 下面是我会用到的两个场景: 每日下
死磕YOLO系列,YOLOv1 的大脑、躯干和手脚
YOLO 是我非常喜欢的目标检测算法,堪称工业级的目标检测,能够达到实时的要求,它帮我解决了许多实际问题。 这就是 YOLO 的目标检测效果。它定位了图像中物体的位置,当然,也能预测物体的类别。 之前我有写博文介绍过它,但是每次重新读它的论文,我都有新的收获,为此我准备写一个系列的文章来详尽分析它。这是第一篇,从它的起始 YOLOv1 讲起。 YOLOv1 的论文地址:https://www.c
知乎高赞:中国有什么拿得出手的开源软件产品?(整理自本人原创回答)
知乎高赞:中国有什么拿得出手的开源软件产品? 在知乎上,有个问题问“中国有什么拿得出手的开源软件产品(在 GitHub 等社区受欢迎度较好的)?” 事实上,还不少呢~ 本人于2019.7.6进行了较为全面的 回答 - Bravo Yeung,获得该问题下回答中得最高赞(236赞和1枚专业勋章),对这些受欢迎的 Github 开源项目分类整理如下: 分布式计算、云平台相关工具类 1.SkyWalk
20行Python代码爬取王者荣耀全英雄皮肤
引言 王者荣耀大家都玩过吧,没玩过的也应该听说过,作为时下最火的手机MOBA游戏,咳咳,好像跑题了。我们今天的重点是爬取王者荣耀所有英雄的所有皮肤,而且仅仅使用20行Python代码即可完成。 准备工作 爬取皮肤本身并不难,难点在于分析,我们首先得得到皮肤图片的url地址,话不多说,我们马上来到王者荣耀的官网: 我们点击英雄资料,然后随意地选择一位英雄,接着F12打开调试台,找到英雄原皮肤的图片
简明易理解的@SpringBootApplication注解源码解析(包含面试提问)
欢迎关注文章系列 ,关注我 《提升能力,涨薪可待》 《面试知识,工作可待》 《实战演练,拒绝996》 欢迎关注我博客,原创技术文章第一时间推出 也欢迎关注公 众 号【Ccww笔记】,同时推出 如果此文对你有帮助、喜欢的话,那就点个赞呗,点个关注呗! 《提升能力,涨薪可待篇》- @SpringBootApplication注解源码解析 一、@SpringBootApplication 的作用是什
西游记团队中如果需要裁掉一个人,会先裁掉谁?
2019年互联网寒冬,大批企业开始裁员,下图是网上流传的一张截图: 裁员不可避免,那如何才能做到不管大环境如何变化,自身不受影响呢? 我们先来看一个有意思的故事,如果西游记取经团队需要裁员一名,会裁掉谁呢,为什么? 西游记团队组成: 1.唐僧 作为团队teamleader,有很坚韧的品性和极高的原则性,不达目的不罢休,遇到任何问题,都没有退缩过,又很得上司支持和赏识(直接得到唐太宗的任命,既给
Python语言高频重点汇总
Python语言高频重点汇总 GitHub面试宝典仓库——点这里跳转 文章目录Python语言高频重点汇总**GitHub面试宝典仓库——点这里跳转**1. 函数-传参2. 元类3. @staticmethod和@classmethod两个装饰器4. 类属性和实例属性5. Python的自省6. 列表、集合、字典推导式7. Python中单下划线和双下划线8. 格式化字符串中的%和format9.
究竟你适不适合买Mac?
我清晰的记得,刚买的macbook pro回到家,开机后第一件事情,就是上了淘宝网,花了500元钱,找了一个上门维修电脑的师傅,上门给我装了一个windows系统。。。。。。 表砍我。。。 当时买mac的初衷,只是想要个固态硬盘的笔记本,用来运行一些复杂的扑克软件。而看了当时所有的SSD笔记本后,最终决定,还是买个好(xiong)看(da)的。 已经有好几个朋友问我mba怎么样了,所以今天尽量客观
程序员一般通过什么途径接私活?
二哥,你好,我想知道一般程序猿都如何接私活,我也想接,能告诉我一些方法吗? 上面是一个读者“烦不烦”问我的一个问题。其实不止是“烦不烦”,还有很多读者问过我类似这样的问题。 我接的私活不算多,挣到的钱也没有多少,加起来不到 20W。说实话,这个数目说出来我是有点心虚的,毕竟太少了,大家轻喷。但我想,恰好配得上“一般程序员”这个称号啊。毕竟苍蝇再小也是肉,我也算是有经验的人了。 唾弃接私活、做外
ES6基础-ES6的扩展
进行对字符串扩展,正则扩展,数值扩展,函数扩展,对象扩展,数组扩展。 开发环境准备: 编辑器(VS Code, Atom,Sublime)或者IDE(Webstorm) 浏览器最新的Chrome 字符串的扩展: 模板字符串,部分新的方法,新的unicode表示和遍历方法: 部分新的字符串方法 padStart,padEnd,repeat,startsWith,endsWith,includes 字
Python爬虫爬取淘宝,京东商品信息
小编是一个理科生,不善长说一些废话。简单介绍下原理然后直接上代码。 使用的工具(Python+pycharm2019.3+selenium+xpath+chromedriver)其中要使用pycharm也可以私聊我selenium是一个框架可以通过pip下载 pip install selenium -i https://pypi.tuna.tsinghua.edu.cn/simple/ 
阿里程序员写了一个新手都写不出的低级bug,被骂惨了。
你知道的越多,你不知道的越多 点赞再看,养成习惯 本文 GitHub https://github.com/JavaFamily 已收录,有一线大厂面试点思维导图,也整理了很多我的文档,欢迎Star和完善,大家面试可以参照考点复习,希望我们一起有点东西。 前前言 为啥今天有个前前言呢? 因为你们的丙丙啊,昨天有牌面了哟,直接被微信官方推荐,知乎推荐,也就仅仅是还行吧(心里乐开花)
Java工作4年来应聘要16K最后没要,细节如下。。。
前奏: 今天2B哥和大家分享一位前几天面试的一位应聘者,工作4年26岁,统招本科。 以下就是他的简历和面试情况。 基本情况: 专业技能: 1、&nbsp;熟悉Sping了解SpringMVC、SpringBoot、Mybatis等框架、了解SpringCloud微服务 2、&nbsp;熟悉常用项目管理工具:SVN、GIT、MAVEN、Jenkins 3、&nbsp;熟悉Nginx、tomca
Python爬虫精简步骤1 获取数据
爬虫的工作分为四步: 1.获取数据。爬虫程序会根据我们提供的网址,向服务器发起请求,然后返回数据。 2.解析数据。爬虫程序会把服务器返回的数据解析成我们能读懂的格式。 3.提取数据。爬虫程序再从中提取出我们需要的数据。 4.储存数据。爬虫程序把这些有用的数据保存起来,便于你日后的使用和分析。 这一篇的内容就是:获取数据。 首先,我们将会利用一个强大的库——requests来获取数据。 在电脑上安装
作为一个程序员,CPU的这些硬核知识你必须会!
CPU对每个程序员来说,是个既熟悉又陌生的东西? 如果你只知道CPU是中央处理器的话,那可能对你并没有什么用,那么作为程序员的我们,必须要搞懂的就是CPU这家伙是如何运行的,尤其要搞懂它里面的寄存器是怎么一回事,因为这将让你从底层明白程序的运行机制。 随我一起,来好好认识下CPU这货吧 把CPU掰开来看 对于CPU来说,我们首先就要搞明白它是怎么回事,也就是它的内部构造,当然,CPU那么牛的一个东
破14亿,Python分析我国存在哪些人口危机!
2020年1月17日,国家统计局发布了2019年国民经济报告,报告中指出我国人口突破14亿。 猪哥的朋友圈被14亿人口刷屏,但是很多人并没有看到我国复杂的人口问题:老龄化、男女比例失衡、生育率下降、人口红利下降等。 今天我们就来分析一下我们国家的人口数据吧! 更多有趣分析教程,扫描下方二维码关注vx公号「裸睡的猪」 即可查看! 一、背景 1.人口突破14亿 2020年1月17日,国家统计局发布
web前端javascript+jquery知识点总结
Javascript javascript 在前端网页中占有非常重要的地位,可以用于验证表单,制作特效等功能,它是一种描述语言,也是一种基于对象(Object)和事件驱动并具有安全性的脚本语言 ,语法同java类似,是一种解释性语言,边执行边解释。 JavaScript的组成: ECMAScipt 用于描述: 语法,变量和数据类型,运算符,逻辑控制语句,关键字保留字,对象。 浏览器对象模型(Br
Qt实践录:开篇
本系列文章介绍笔者的Qt实践之路。 背景 笔者首次接触 Qt 大约是十多年前,当时试用了 Qt ,觉得不如 MFC 好用。现在 Qt 的 API、文档等都比较完善,在年初决定重新拾起,正所谓技多不压身,将 Qt 当为一种谋生工具亦未尝不可。利用春节假期的集中时间,快速专攻一下。 本系列名为“Qt实践”,故不是教程,笔者对 Qt 的定位是“使用”,可以帮助快速编写日常的工具,如串口、网络等。所以不
在家远程办公效率低?那你一定要收好这个「在家办公」神器!
相信大家都已经收到国务院延长春节假期的消息,接下来,在家远程办公可能将会持续一段时间。 但是问题来了。远程办公不是人在电脑前就当坐班了,相反,对于沟通效率,文件协作,以及信息安全都有着极高的要求。有着非常多的挑战,比如: 1在异地互相不见面的会议上,如何提高沟通效率? 2文件之间的来往反馈如何做到及时性?如何保证信息安全? 3如何规划安排每天工作,以及如何进行成果验收? ......
作为一个程序员,内存和磁盘的这些事情,你不得不知道啊!!!
截止目前,我已经分享了如下几篇文章: 一个程序在计算机中是如何运行的?超级干货!!! 作为一个程序员,CPU的这些硬核知识你必须会! 作为一个程序员,内存的这些硬核知识你必须懂! 这些知识可以说是我们之前都不太重视的基础知识,可能大家在上大学的时候都学习过了,但是嘞,当时由于老师讲解的没那么有趣,又加上这些知识本身就比较枯燥,所以嘞,大家当初几乎等于没学。 再说啦,学习这些,也看不出来有什么用啊!
这个世界上人真的分三六九等,你信吗?
偶然间,在知乎上看到一个问题 一时间,勾起了我深深的回忆。 以前在厂里打过两次工,做过家教,干过辅导班,做过中介。零下几度的晚上,贴过广告,满脸、满手地长冻疮。   再回首那段岁月,虽然苦,但让我学会了坚持和忍耐。让我明白了,在这个世界上,无论环境多么的恶劣,只要心存希望,星星之火,亦可燎原。   下文是原回答,希望能对你能有所启发。   如果我说,这个世界上人真的分三六九等,
为什么听过很多道理,依然过不好这一生?
记录学习笔记是一个重要的习惯,不希望学习过的东西成为过眼云烟。做总结的同时也是一次复盘思考的过程。 本文是根据阅读得到 App上《万维钢·精英日课》部分文章后所做的一点笔记和思考。学习是一个系统的过程,思维模型的建立需要相对完整的学习和思考过程。以下观点是在碎片化阅读后总结的一点心得总结。
B 站上有哪些很好的学习资源?
哇说起B站,在小九眼里就是宝藏般的存在,放年假宅在家时一天刷6、7个小时不在话下,更别提今年的跨年晚会,我简直是跪着看完的!! 最早大家聚在在B站是为了追番,再后来我在上面刷欧美新歌和漂亮小姐姐的舞蹈视频,最近两年我和周围的朋友们已经把B站当作学习教室了,而且学习成本还免费,真是个励志的好平台ヽ(.◕ฺˇд ˇ◕ฺ;)ノ 下面我们就来盘点一下B站上优质的学习资源: 综合类 Oeasy: 综合
雷火神山直播超两亿,Web播放器事件监听是怎么实现的?
Web播放器解决了在手机浏览器和PC浏览器上播放音视频数据的问题,让视音频内容可以不依赖用户安装App,就能进行播放以及在社交平台进行传播。在视频业务大数据平台中,播放数据的统计分析非常重要,所以Web播放器在使用过程中,需要对其内部的数据进行收集并上报至服务端,此时,就需要对发生在其内部的一些播放行为进行事件监听。 那么Web播放器事件监听是怎么实现的呢? 01 监听事件明细表 名
3万字总结,Mysql优化之精髓
本文知识点较多,篇幅较长,请耐心学习 MySQL已经成为时下关系型数据库产品的中坚力量,备受互联网大厂的青睐,出门面试想进BAT,想拿高工资,不会点MySQL优化知识,拿offer的成功率会大大下降。 为什么要优化 系统的吞吐量瓶颈往往出现在数据库的访问速度上 随着应用程序的运行,数据库的中的数据会越来越多,处理时间会相应变慢 数据是存放在磁盘上的,读写速度无法和内存相比 如何优化 设计
一条链接即可让黑客跟踪你的位置! | Seeker工具使用
搬运自:冰崖的部落阁(icecliffsnet) 严正声明:本文仅限于技术讨论,严禁用于其他用途。 请遵守相对应法律规则,禁止用作违法途径,出事后果自负! 上次写的防社工文章里边提到的gps定位信息(如何防止自己被社工或人肉) 除了主动收集他人位置信息以外,我们还可以进行被动收集 (没有技术含量) Seeker作为一款高精度地理位置跟踪工具,同时也是社交工程学(社会工程学)爱好者...
作为程序员的我,大学四年一直自学,全靠这些实用工具和学习网站!
我本人因为高中沉迷于爱情,导致学业荒废,后来高考,毫无疑问进入了一所普普通通的大学,实在惭愧...... 我又是那么好强,现在学历不行,没办法改变的事情了,所以,进入大学开始,我就下定决心,一定要让自己掌握更多的技能,尤其选择了计算机这个行业,一定要多学习技术。 在进入大学学习不久后,我就认清了一个现实:我这个大学的整体教学质量和学习风气,真的一言难尽,懂的人自然知道怎么回事? 怎么办?我该如何更好的提升
前端JS初级面试题二 (。•ˇ‸ˇ•。)老铁们!快来瞧瞧自己都会了么
1. 传统事件绑定和符合W3C标准的事件绑定有什么区别? 传统事件绑定 &lt;div onclick=""&gt;123&lt;/div&gt; div1.onclick = function(){}; &lt;button onmouseover=""&gt;&lt;/button&gt; 注意: 如果给同一个元素绑定了两次或多次相同类型的事件,那么后面的绑定会覆盖前面的绑定 (不支持DOM事...
相关热词 c#如何定义数组列表 c#倒序读取txt文件 java代码生成c# c# tcp发送数据 c#解决时间格式带星期 c#类似hashmap c#设置istbox的值 c#获取多线程返回值 c# 包含数字 枚举 c# timespan
立即提问