Nvidia的OpenCL库问题(CUDA 7.5+Vs2015

图片说明
为何这头文件里面包含的名字和头文件的文件名根本不一样,也根本不能用

1个回答

应该是没有附加包含库和依赖项

Csdn user default icon
上传中...
上传图片
插入图片
抄袭、复制答案,以达到刷声望分或其他目的的行为,在CSDN问答是严格禁止的,一经发现立刻封号。是时候展现真正的技术了!
其他相关推荐
Nvidia的OpenCL库问题(CUDA 7.5+Vs2015
![图片说明](https://img-ask.csdn.net/upload/201606/16/1466037397_3866.png) 为何这头文件里面包含的名字和头文件的文件名根本不一样,也根本不能用
ubuntu14.04.3下安装cuda7.5的问题
我在ubuntu14.04.3下安装cuda7.5。 安装完成后我使用命令nvcc -V,结果显示: nvcc未安装,若要安装请使用sudo apt-get install nvidia-cuda-toolkit. 所以我按照提示使用上面的命令安装了nvcc。然后使用nvcc -V,显示; Cuda compilation tools release5.5 V5.5.0 怎么会是5.5?而不是7.5。不管怎样,能用了。但是在~/samples目录下,make之后,./deviceQuery,显示: cuda driver version is insufficient for cuda runtime verdion。 所以我执行了这个命令sudo apt-get install cuda-drivers。其中因为以来关系,还安装了opencl。反正安装好了之后,./deviceQuery的结果就正确了。 但是问题来了,nvcc又显示未安装。 怎么办啊?
openCL 移植到Linux 3.10
请教哪位大神有openCL的移植经验呢,Android4.3以后就没有openCL了,只有OpenGL库;请教下如何移植openCL呢
opencv net.setPreferableTarget(DNN_TARGET_OPENCL)问题
opencv4.0 dnn加载yolov3模型,当使用opencl时,报错,错误信息如下,有没有大佬知道怎么回事?无法识别的命令是什么意思? [ INFO:0] Initialize OpenCL runtime... OpenCV(ocl4dnn): consider to specify kernel configuration cache directory via OPENCV_OCL4DNN_CONFIG_PATH parameter. [ INFO:0] Successfully initialized OpenCL cache directory: C:\Users\xx\AppData\Local\Temp\opencv\4.0\opencl_cache\ [ INFO:0] Preparing OpenCL cache configuration for context: NVIDIA_Corporation--GeForce_GTX_1050_Ti--419_67 OpenCL program build log: dnn/dummy Status -11: CL_BUILD_PROGRAM_FAILURE -cl-no-subgroup-ifp Error in processing command line: Don't understand command line argument "-cl-no-subgroup-ifp"!
ubuntu 安装配置c++的opencv 报错
我在ubuntu 上打算安装和配置c++的Opencv, 下载了opencv3.1.0版本的代码,然后也手动的下载了ippicv_linux_20151201.tgz。创建build文件夹后Cmake命令已经可以编译过去了。 但是在执行make命令的时候,经常会报错: ``` [ 15%] Building CXX object modules/core/CMakeFiles/opencv_core.dir/opencl_kernels_core.cpp.o [ 15%] Linking CXX shared library ../../lib/libopencv_core.so /usr/bin/ld: CMakeFiles/opencv_core.dir/src/va_intel.cpp.o: relocation R_X86_64_32 against `.rodata' can not be used when making a shared object; recompile with -fPIC CMakeFiles/opencv_core.dir/src/va_intel.cpp.o: 无法添加符号: 错误的值 collect2: error: ld returned 1 exit status modules/core/CMakeFiles/opencv_core.dir/build.make:1382: recipe for target 'lib/libopencv_core.so.3.1.0' failed make[2]: *** [lib/libopencv_core.so.3.1.0] Error 1 CMakeFiles/Makefile2:1420: recipe for target 'modules/core/CMakeFiles/opencv_core.dir/all' failed make[1]: *** [modules/core/CMakeFiles/opencv_core.dir/all] Error 2 Makefile:160: recipe for target 'all' failed make: *** [all] Error 2 ``` 有时候在33%进度的时候报这个错误,有时候就在15%时候报。我整整试了一整天,查遍了各种解决方法都无济于事。请大侠们帮忙解决下吧。跪谢。 是否有直接加载已经编译好的库的方式,可以快速实现配置,因为我急需要用Opencv实现代码。感谢各位大侠了。
make”连接未使用链接器输入文件,因为链接尚未完成“x264的连接
我要做yuv转h264,在linux编译了x264并且生成了libx264.a等文件,为什么make是产生: gcc -g -c src/x264_interface.c -o ./obj/x264_interface.o -Iinclude -Llib -lx264 gcc: -lx264:未使用链接器输入文件,因为链接尚未完成 g++ -g ./obj/x264_interface.o -o ./sbin/android_enc -lpthread -Iinclude -Llib -lx264 lib/libx264.a(opencl.o): In function `x264_opencl_close_library': opencl.c:(.text+0x572): undefined reference to `dlclose' lib/libx264.a(opencl.o): In function `x264_opencl_load_library': opencl.c:(.text+0x5d7): undefined reference to `dlopen' opencl.c:(.text+0x5f1): undefined reference to `dlsym' opencl.c:(.text+0x60e): undefined reference to `dlsym' opencl.c:(.text+0x62b): undefined reference to `dlsym' opencl.c:(.text+0x648): undefined reference to `dlsym' 怎么回事?难道我的x264没有编译好?求各位的帮助!!!!!!!!急急急急
opencl中的.cl文件是如何编译出来的?
最近在读《OpenCL实战》这本书,书上第四章有一个例子中的vector_bytes.cl,我使用了Notepad++打开,复制了其中的代码如下: ``` __kernel void vector_bytes(__global uchar16 *test) { /* Initialize a vector of four integers */ uint4 vec = {0x00010203, 0x04050607, 0x08090A0B, 0x0C0D0E0F}; /* Convert the uint4 to a uchar16 byte-by-byte */ uchar *p = &vec; *test = (uchar16)(*p, *(p+1), *(p+2), *(p+3), *(p+4), *(p+5), *(p+6), *(p+7), *(p+8), *(p+9), *(p+10), *(p+11), *(p+12), *(p+13), *(p+14), *(p+15)); } ``` 我将这段代码粘贴到了Notepad++中的新建文件中,同时另存为了"vector_bytes.cl"(与原.cl文件名一致),但VS提示编译器报错。 我打开以后才发现这两个文件的大小并不一样,请问这是为什么?下图是我看到的情况: ![图片说明](https://img-ask.csdn.net/upload/201905/10/1557459349_951907.jpg) 大佬求助!!!
在Win10 VS2015下配置opencv3.3出问题
我按百度上的配置完后,跑一段代码来测试是否配置成功 ``` #include <opencv.hpp> #include <iostream> using namespace cv; using namespace std; int main() { cout << "OpenCV Version: " << CV_VERSION << endl; Mat img = imread("img.jpg"); imshow("img", img); waitKey(0); return 0; } ``` 结果报了这么多问题,程序可以运行,但是窗口一闪而过,看不到图片,打开exe文件就会报错而中止 'computer vision1.exe' (Win32): Loaded 'C:\C++ 试作品\VS2015 Project\MFC 工程\computer vision1\x64\Debug\computer vision1.exe'. Symbols loaded. 'computer vision1.exe' (Win32): Loaded 'C:\Windows\System32\ntdll.dll'. Cannot find or open the PDB file. 'computer vision1.exe' (Win32): Loaded 'C:\Windows\System32\kernel32.dll'. Cannot find or open the PDB file. 'computer vision1.exe' (Win32): Loaded 'C:\Windows\System32\KernelBase.dll'. Cannot find or open the PDB file. 'computer vision1.exe' (Win32): Loaded 'C:\Windows\System32\vcruntime140d.dll'. Cannot find or open the PDB file. 'computer vision1.exe' (Win32): Loaded 'C:\Windows\System32\opencv_world330d.dll'. Cannot find or open the PDB file. 'computer vision1.exe' (Win32): Loaded 'C:\Windows\System32\msvcp140d.dll'. Cannot find or open the PDB file. 'computer vision1.exe' (Win32): Loaded 'C:\Windows\System32\opencv_world330.dll'. Cannot find or open the PDB file. 'computer vision1.exe' (Win32): Loaded 'C:\Windows\System32\ucrtbased.dll'. Cannot find or open the PDB file. 'computer vision1.exe' (Win32): Loaded 'C:\Windows\System32\user32.dll'. Cannot find or open the PDB file. 'computer vision1.exe' (Win32): Loaded 'C:\Windows\System32\gdi32.dll'. Cannot find or open the PDB file. 'computer vision1.exe' (Win32): Loaded 'C:\Windows\System32\win32u.dll'. Cannot find or open the PDB file. 'computer vision1.exe' (Win32): Loaded 'C:\Windows\System32\gdi32full.dll'. Cannot find or open the PDB file. 'computer vision1.exe' (Win32): Loaded 'C:\Windows\System32\ole32.dll'. Cannot find or open the PDB file. 'computer vision1.exe' (Win32): Loaded 'C:\Windows\System32\combase.dll'. Cannot find or open the PDB file. 'computer vision1.exe' (Win32): Loaded 'C:\Windows\System32\oleaut32.dll'. Cannot find or open the PDB file. 'computer vision1.exe' (Win32): Loaded 'C:\Windows\System32\ucrtbase.dll'. Cannot find or open the PDB file. 'computer vision1.exe' (Win32): Loaded 'C:\Windows\System32\msvcp_win.dll'. Cannot find or open the PDB file. 'computer vision1.exe' (Win32): Loaded 'C:\Windows\System32\rpcrt4.dll'. Cannot find or open the PDB file. 'computer vision1.exe' (Win32): Loaded 'C:\Windows\System32\comdlg32.dll'. Cannot find or open the PDB file. 'computer vision1.exe' (Win32): Loaded 'C:\Windows\System32\msvcrt.dll'. Cannot find or open the PDB file. 'computer vision1.exe' (Win32): Loaded 'C:\Windows\System32\bcryptprimitives.dll'. Cannot find or open the PDB file. 'computer vision1.exe' (Win32): Loaded 'C:\Windows\System32\sechost.dll'. Cannot find or open the PDB file. 'computer vision1.exe' (Win32): Loaded 'C:\Windows\System32\SHCore.dll'. Cannot find or open the PDB file. 'computer vision1.exe' (Win32): Loaded 'C:\Windows\System32\advapi32.dll'. Cannot find or open the PDB file. 'computer vision1.exe' (Win32): Loaded 'C:\Windows\System32\shlwapi.dll'. Cannot find or open the PDB file. 'computer vision1.exe' (Win32): Loaded 'C:\Windows\System32\shell32.dll'. Cannot find or open the PDB file. 'computer vision1.exe' (Win32): Loaded 'C:\Windows\System32\msvfw32.dll'. Cannot find or open the PDB file. 'computer vision1.exe' (Win32): Loaded 'C:\Windows\System32\avicap32.dll'. Cannot find or open the PDB file. 'computer vision1.exe' (Win32): Loaded 'C:\Windows\System32\avifil32.dll'. Cannot find or open the PDB file. 'computer vision1.exe' (Win32): Loaded 'C:\Windows\System32\cfgmgr32.dll'. Cannot find or open the PDB file. 'computer vision1.exe' (Win32): Loaded 'C:\Windows\System32\winmm.dll'. Cannot find or open the PDB file. 'computer vision1.exe' (Win32): Loaded 'C:\Windows\System32\winmmbase.dll'. Cannot find or open the PDB file. 'computer vision1.exe' (Win32): Loaded 'C:\Windows\System32\windows.storage.dll'. Cannot find or open the PDB file. 'computer vision1.exe' (Win32): Loaded 'C:\Windows\System32\powrprof.dll'. Cannot find or open the PDB file. 'computer vision1.exe' (Win32): Loaded 'C:\Windows\System32\concrt140d.dll'. Cannot find or open the PDB file. 'computer vision1.exe' (Win32): Loaded 'C:\Windows\WinSxS\amd64_microsoft.windows.common-controls_6595b64144ccf1df_5.82.14393.447_none_0d5aa7fbb6d35646\comctl32.dll'. Cannot find or open the PDB file. 'computer vision1.exe' (Win32): Loaded 'C:\Windows\WinSxS\amd64_microsoft.windows.common-controls_6595b64144ccf1df_5.82.14393.447_none_0d5aa7fbb6d35646\comctl32.dll'. Cannot find or open the PDB file. 'computer vision1.exe' (Win32): Loaded 'C:\Windows\System32\kernel.appcore.dll'. Cannot find or open the PDB file. 'computer vision1.exe' (Win32): Loaded 'C:\Windows\System32\profapi.dll'. Cannot find or open the PDB file. 'computer vision1.exe' (Win32): Loaded 'C:\Windows\System32\msacm32.dll'. Cannot find or open the PDB file. 'computer vision1.exe' (Win32): Unloaded 'C:\Windows\WinSxS\amd64_microsoft.windows.common-controls_6595b64144ccf1df_5.82.14393.447_none_0d5aa7fbb6d35646\comctl32.dll' 'computer vision1.exe' (Win32): Loaded 'C:\Windows\System32\msvcp140.dll'. Cannot find or open the PDB file. 'computer vision1.exe' (Win32): Loaded 'C:\Windows\System32\vcruntime140.dll'. Cannot find or open the PDB file. 'computer vision1.exe' (Win32): Loaded 'C:\Windows\System32\concrt140.dll'. Cannot find or open the PDB file. 'computer vision1.exe' (Win32): Loaded 'C:\Windows\System32\imm32.dll'. Cannot find or open the PDB file. 'computer vision1.exe' (Win32): Loaded 'C:\Windows\System32\uxtheme.dll'. Cannot find or open the PDB file. 'computer vision1.exe' (Win32): Loaded 'C:\Windows\System32\msctf.dll'. Cannot find or open the PDB file. 'computer vision1.exe' (Win32): Loaded 'C:\Windows\System32\dwmapi.dll'. Cannot find or open the PDB file. 'computer vision1.exe' (Win32): Loaded 'C:\Windows\System32\OpenCL.DLL'. Cannot find or open the PDB file. 'computer vision1.exe' (Win32): Loaded 'C:\Windows\System32\DriverStore\FileRepository\igdlh64.inf_amd64_e1474e9d5907af3f\IntelOpenCL64.dll'. Cannot find or open the PDB file. 'computer vision1.exe' (Win32): Loaded 'C:\Program Files (x86)\Common Files\Intel\OpenCL\bin\x64\intelocl64.dll'. Cannot find or open the PDB file. 'computer vision1.exe' (Win32): Loaded 'C:\Windows\System32\opengl32.dll'. Cannot find or open the PDB file. 'computer vision1.exe' (Win32): Loaded 'C:\Program Files (x86)\Common Files\Intel\OpenCL\bin\x64\task_executor64.dll'. Cannot find or open the PDB file. 'computer vision1.exe' (Win32): Loaded 'C:\Windows\System32\ddraw.dll'. Cannot find or open the PDB file. 'computer vision1.exe' (Win32): Loaded 'C:\Windows\System32\dciman32.dll'. Cannot find or open the PDB file. 'computer vision1.exe' (Win32): Loaded 'C:\Windows\System32\glu32.dll'. Cannot find or open the PDB file. 'computer vision1.exe' (Win32): Loaded 'C:\Program Files (x86)\Common Files\Intel\OpenCL\bin\x64\cpu_device64.dll'. Cannot find or open the PDB file. 'computer vision1.exe' (Win32): Loaded 'C:\Windows\System32\version.dll'. Cannot find or open the PDB file. 'computer vision1.exe' (Win32): Loaded 'C:\Windows\System32\DriverStore\FileRepository\igdlh64.inf_amd64_e1474e9d5907af3f\igdrcl64.dll'. Cannot find or open the PDB file. 'computer vision1.exe' (Win32): Loaded 'C:\Windows\System32\dxgi.dll'. Cannot find or open the PDB file. 'computer vision1.exe' (Win32): Loaded 'C:\Windows\System32\ResourcePolicyClient.dll'. Cannot find or open the PDB file. 'computer vision1.exe' (Win32): Unloaded 'C:\Windows\System32\ResourcePolicyClient.dll' 'computer vision1.exe' (Win32): Loaded 'C:\Windows\System32\DriverStore\FileRepository\igdlh64.inf_amd64_e1474e9d5907af3f\igdfcl64.dll'. Cannot find or open the PDB file. 'computer vision1.exe' (Win32): Loaded 'C:\Windows\System32\DriverStore\FileRepository\igdlh64.inf_amd64_e1474e9d5907af3f\igdmcl64.dll'. Cannot find or open the PDB file. 'computer vision1.exe' (Win32): Loaded 'C:\Windows\System32\dbghelp.dll'. Cannot find or open the PDB file. 'computer vision1.exe' (Win32): Loaded 'C:\Windows\System32\DriverStore\FileRepository\igdlh64.inf_amd64_e1474e9d5907af3f\igc64.dll'. Cannot find or open the PDB file. The thread 0x1cd4 has exited with code 0 (0x0). The thread 0x1750 has exited with code 0 (0x0). The thread 0x3668 has exited with code 0 (0x0). The thread 0x2b88 has exited with code 0 (0x0). The program '[6504] computer vision1.exe' has exited with code 0 (0x0).
OpenCL在Linux内核版本15.04上如何安装配置实验?
谁有有啥在15.04的Ubuntu上调试Open CL程序的经验分享一下?
ubuntu16.04安装opencv时,make不通过该怎么办?
cmake已经完成,情况如下: ``` cmake .. -- Detected version of GNU GCC: 54 (504) -- Found ZLIB: /usr/lib/x86_64-linux-gnu/libz.so (found suitable version "1.2.8", minimum required is "1.2.3") -- Found ZLIB: /usr/lib/x86_64-linux-gnu/libz.so (found version "1.2.8") -- Checking for module 'gstreamer-base-1.0' -- No package 'gstreamer-base-1.0' found -- Checking for module 'gstreamer-video-1.0' -- No package 'gstreamer-video-1.0' found -- Checking for module 'gstreamer-app-1.0' -- No package 'gstreamer-app-1.0' found -- Checking for module 'gstreamer-riff-1.0' -- No package 'gstreamer-riff-1.0' found -- Checking for module 'gstreamer-pbutils-1.0' -- No package 'gstreamer-pbutils-1.0' found -- Checking for module 'gstreamer-base-0.10' -- No package 'gstreamer-base-0.10' found -- Checking for module 'gstreamer-video-0.10' -- No package 'gstreamer-video-0.10' found -- Checking for module 'gstreamer-app-0.10' -- No package 'gstreamer-app-0.10' found -- Checking for module 'gstreamer-riff-0.10' -- No package 'gstreamer-riff-0.10' found -- Checking for module 'gstreamer-pbutils-0.10' -- No package 'gstreamer-pbutils-0.10' found -- Looking for linux/videodev.h -- Looking for linux/videodev.h - not found -- Looking for linux/videodev2.h -- Looking for linux/videodev2.h - found -- Looking for sys/videoio.h -- Looking for sys/videoio.h - not found -- Checking for module 'libavresample' -- No package 'libavresample' found -- Looking for libavformat/avformat.h -- Looking for libavformat/avformat.h - found -- Looking for ffmpeg/avformat.h -- Looking for ffmpeg/avformat.h - not found -- Checking for module 'libgphoto2' -- No package 'libgphoto2' found -- found IPP (ICV version): 9.0.1 [9.0.1] -- at: /home/quxutao/opencv-3.1.0/3rdparty/ippicv/unpack/ippicv_lnx -- CUDA detected: 7.5 -- CUDA NVCC target flags: -gencode;arch=compute_20,code=sm_20;-gencode;arch=compute_20,code=sm_21;-gencode;arch=compute_30,code=sm_30;-gencode;arch=compute_35,code=sm_35;-gencode;arch=compute_30,code=compute_30 -- Could NOT find Doxygen (missing: DOXYGEN_EXECUTABLE) -- To enable PlantUML support, set PLANTUML_JAR environment variable or pass -DPLANTUML_JAR=<filepath> option to cmake -- Could NOT find PythonInterp: Found unsuitable version "1.4", but required is at least "2.7" (found /home/quxutao/.virtualenvs/cv/bin/python) -- Could NOT find PythonInterp: Found unsuitable version "1.4", but required is at least "2.6" (found /home/quxutao/.virtualenvs/cv/bin/python) -- Could NOT find PythonInterp: Found unsuitable version "1.4", but required is at least "3.4" (found /home/quxutao/.virtualenvs/cv/bin/python) -- Could NOT find PythonInterp: Found unsuitable version "1.4", but required is at least "3.2" (found /home/quxutao/.virtualenvs/cv/bin/python) -- Could NOT find JNI (missing: JAVA_INCLUDE_PATH JAVA_INCLUDE_PATH2 JAVA_AWT_INCLUDE_PATH) -- Could NOT find Matlab (missing: MATLAB_MEX_SCRIPT MATLAB_INCLUDE_DIRS MATLAB_ROOT_DIR MATLAB_LIBRARIES MATLAB_LIBRARY_DIRS MATLAB_MEXEXT MATLAB_ARCH MATLAB_BIN) -- VTK is not found. Please set -DVTK_DIR in CMake to VTK build directory, or to VTK install subdirectory with VTKConfig.cmake file -- Caffe: NO -- Protobuf: YES -- Glog: NO -- HDF5: YES -- Module opencv_sfm disabled because the following dependencies are not found: Eigen Glog/Gflags -- Tesseract: NO -- HDF5: YES -- Build libprotobuf from sources: -- The protocol buffer compiler not found -- Tesseract: NO -- -- General configuration for OpenCV 3.1.0 ===================================== -- Version control: unknown -- -- Platform: -- Host: Linux 4.15.0-47-generic x86_64 -- CMake: 3.5.1 -- CMake generator: Unix Makefiles -- CMake build tool: /usr/bin/make -- Configuration: RELEASE -- -- C/C++: -- Built as dynamic libs?: YES -- C++ Compiler: /usr/bin/c++ (ver 5.4.0) -- C++ flags (Release): -fsigned-char -W -Wall -Werror=return-type -Werror=non-virtual-dtor -Werror=address -Werror=sequence-point -Wformat -Werror=format-security -Wmissing-declarations -Wundef -Winit-self -Wpointer-arith -Wshadow -Wsign-promo -Wno-narrowing -Wno-delete-non-virtual-dtor -fdiagnostics-show-option -Wno-long-long -pthread -fomit-frame-pointer -msse -msse2 -mno-avx -msse3 -mno-ssse3 -mno-sse4.1 -mno-sse4.2 -ffunction-sections -fvisibility=hidden -fvisibility-inlines-hidden -O3 -DNDEBUG -DNDEBUG -- C++ flags (Debug): -fsigned-char -W -Wall -Werror=return-type -Werror=non-virtual-dtor -Werror=address -Werror=sequence-point -Wformat -Werror=format-security -Wmissing-declarations -Wundef -Winit-self -Wpointer-arith -Wshadow -Wsign-promo -Wno-narrowing -Wno-delete-non-virtual-dtor -fdiagnostics-show-option -Wno-long-long -pthread -fomit-frame-pointer -msse -msse2 -mno-avx -msse3 -mno-ssse3 -mno-sse4.1 -mno-sse4.2 -ffunction-sections -fvisibility=hidden -fvisibility-inlines-hidden -g -O0 -DDEBUG -D_DEBUG -- C Compiler: /usr/bin/cc -- C flags (Release): -fsigned-char -W -Wall -Werror=return-type -Werror=non-virtual-dtor -Werror=address -Werror=sequence-point -Wformat -Werror=format-security -Wmissing-declarations -Wmissing-prototypes -Wstrict-prototypes -Wundef -Winit-self -Wpointer-arith -Wshadow -Wno-narrowing -fdiagnostics-show-option -Wno-long-long -pthread -fomit-frame-pointer -msse -msse2 -mno-avx -msse3 -mno-ssse3 -mno-sse4.1 -mno-sse4.2 -ffunction-sections -fvisibility=hidden -O3 -DNDEBUG -DNDEBUG -- C flags (Debug): -fsigned-char -W -Wall -Werror=return-type -Werror=non-virtual-dtor -Werror=address -Werror=sequence-point -Wformat -Werror=format-security -Wmissing-declarations -Wmissing-prototypes -Wstrict-prototypes -Wundef -Winit-self -Wpointer-arith -Wshadow -Wno-narrowing -fdiagnostics-show-option -Wno-long-long -pthread -fomit-frame-pointer -msse -msse2 -mno-avx -msse3 -mno-ssse3 -mno-sse4.1 -mno-sse4.2 -ffunction-sections -fvisibility=hidden -g -O0 -DDEBUG -D_DEBUG -- Linker flags (Release): -- Linker flags (Debug): -- Precompiled headers: YES -- Extra dependencies: /usr/lib/x86_64-linux-gnu/libpng.so /usr/lib/x86_64-linux-gnu/libtiff.so /usr/lib/x86_64-linux-gnu/libjasper.so /usr/lib/x86_64-linux-gnu/libjpeg.so gtk-3 gdk-3 pangocairo-1.0 pango-1.0 atk-1.0 cairo-gobject cairo gdk_pixbuf-2.0 gio-2.0 gobject-2.0 gthread-2.0 glib-2.0 dc1394 v4l1 v4l2 avcodec-ffmpeg avformat-ffmpeg avutil-ffmpeg swscale-ffmpeg /usr/lib/x86_64-linux-gnu/libbz2.so /usr/lib/x86_64-linux-gnu/hdf5/openmpi/lib/libhdf5.so /usr/lib/x86_64-linux-gnu/libsz.so /usr/lib/x86_64-linux-gnu/libz.so /usr/lib/x86_64-linux-gnu/libdl.so /usr/lib/x86_64-linux-gnu/libm.so dl m pthread rt cudart nppc nppi npps cufft -L/usr/lib/x86_64-linux-gnu -- 3rdparty dependencies: libwebp IlmImf libprotobuf -- -- OpenCV modules: -- To be built: cudev core cudaarithm flann hdf imgproc ml reg surface_matching video cudabgsegm cudafilters cudaimgproc cudawarping dnn fuzzy imgcodecs photo shape videoio cudacodec highgui objdetect plot ts xobjdetect xphoto bgsegm bioinspired dpm face features2d line_descriptor saliency text calib3d ccalib cudafeatures2d cudalegacy cudaobjdetect cudaoptflow cudastereo datasets rgbd stereo structured_light superres tracking videostab xfeatures2d ximgproc aruco optflow stitching -- Disabled: world contrib_world -- Disabled by dependency: - -- Unavailable: java python2 python3 viz cvv matlab sfm -- -- GUI: -- QT: NO -- GTK+ 3.x: YES (ver 3.18.9) -- GThread : YES (ver 2.48.2) -- GtkGlExt: NO -- OpenGL support: NO -- VTK support: NO -- -- Media I/O: -- ZLib: /usr/lib/x86_64-linux-gnu/libz.so (ver 1.2.8) -- JPEG: /usr/lib/x86_64-linux-gnu/libjpeg.so (ver ) -- WEBP: build (ver 0.3.1) -- PNG: /usr/lib/x86_64-linux-gnu/libpng.so (ver 1.2.54) -- TIFF: /usr/lib/x86_64-linux-gnu/libtiff.so (ver 42 - 4.0.6) -- JPEG 2000: /usr/lib/x86_64-linux-gnu/libjasper.so (ver 1.900.1) -- OpenEXR: build (ver 1.7.1) -- GDAL: NO -- -- Video I/O: -- DC1394 1.x: NO -- DC1394 2.x: YES (ver 2.2.4) -- FFMPEG: YES -- codec: YES (ver 56.60.100) -- format: YES (ver 56.40.101) -- util: YES (ver 54.31.100) -- swscale: YES (ver 3.1.101) -- resample: NO -- gentoo-style: YES -- GStreamer: NO -- OpenNI: NO -- OpenNI PrimeSensor Modules: NO -- OpenNI2: NO -- PvAPI: NO -- GigEVisionSDK: NO -- UniCap: NO -- UniCap ucil: NO -- V4L/V4L2: Using libv4l1 (ver 1.10.0) / libv4l2 (ver 1.10.0) -- XIMEA: NO -- Xine: NO -- gPhoto2: NO -- -- Parallel framework: pthreads -- -- Other third-party libraries: -- Use IPP: 9.0.1 [9.0.1] -- at: /home/quxutao/opencv-3.1.0/3rdparty/ippicv/unpack/ippicv_lnx -- Use IPP Async: NO -- Use VA: NO -- Use Intel VA-API/OpenCL: NO -- Use Eigen: NO -- Use Cuda: YES (ver 7.5) -- Use OpenCL: YES -- Use custom HAL: NO -- -- NVIDIA CUDA -- Use CUFFT: YES -- Use CUBLAS: NO -- USE NVCUVID: NO -- NVIDIA GPU arch: 20 21 30 35 -- NVIDIA PTX archs: 30 -- Use fast math: NO -- -- OpenCL: -- Version: dynamic -- Include path: /home/quxutao/opencv-3.1.0/3rdparty/include/opencl/1.2 -- Use AMDFFT: NO -- Use AMDBLAS: NO -- -- Python 2: -- Interpreter: NO -- -- Python 3: -- Interpreter: NO -- -- Python (for build): NO -- -- Java: -- ant: NO -- JNI: NO -- Java wrappers: NO -- Java tests: NO -- -- Matlab: Matlab not found or implicitly disabled -- -- Documentation: -- Doxygen: NO -- PlantUML: NO -- -- Tests and samples: -- Tests: YES -- Performance tests: YES -- C/C++ Examples: YES -- -- Install path: /usr/local -- -- cvconfig.h is in: /home/quxutao/opencv-3.1.0/build -- ----------------------------------------------------------------- -- -- Configuring done -- Generating done -- Build files have been written to: /home/quxutao/opencv-3.1.0/build ``` 但是make的时候,就报错: ``` make [ 4%] Built target libwebp [ 4%] Built target IlmImf [ 4%] Built target opencv_cudev [ 4%] Built target opencv_core_pch_dephelp [ 4%] Built target pch_Generate_opencv_core [ 4%] Building NVCC (Device) object modules/core/CMakeFiles/cuda_compile.dir/src/cuda/cuda_compile_generated_gpu_mat.cu.o /usr/include/string.h: In function ‘void* __mempcpy_inline(void*, const void*, size_t)’: /usr/include/string.h:652:42: error: ‘memcpy’ was not declared in this scope return (char *) memcpy (__dest, __src, __n) + __n; ^ CMake Error at cuda_compile_generated_gpu_mat.cu.o.cmake:266 (message): Error generating file /home/quxutao/opencv-3.1.0/build/modules/core/CMakeFiles/cuda_compile.dir/src/cuda/./cuda_compile_generated_gpu_mat.cu.o modules/core/CMakeFiles/opencv_core.dir/build.make:399: recipe for target 'modules/core/CMakeFiles/cuda_compile.dir/src/cuda/cuda_compile_generated_gpu_mat.cu.o' failed make[2]: *** [modules/core/CMakeFiles/cuda_compile.dir/src/cuda/cuda_compile_generated_gpu_mat.cu.o] Error 1 CMakeFiles/Makefile2:2307: recipe for target 'modules/core/CMakeFiles/opencv_core.dir/all' failed make[1]: *** [modules/core/CMakeFiles/opencv_core.dir/all] Error 2 Makefile:160: recipe for target 'all' failed make: *** [all] Error 2 ``` 弄了一下午了,没有找到相关的解决办法。我的cuda是7.5,其实不用GPU也可以的,我只是想用KAZE滤波。。。跪求大神帮忙。。。
新手提问,十万火急:eclipse中启动服务器报错
以前运行好好的,现在不能启动了,不知道怎么回事,网上也找不到原因,求大神们帮忙解决一下,十分感谢!! <br><br><br> Server Tomcat v8.0 Server at localhost failed to start. ![图片说明](https://img-ask.csdn.net/upload/201909/21/1569074501_604160.png) <br><br><br> 有人说是配置文件问题,看一下。。 <br><br><br> ![图片说明](https://img-ask.csdn.net/upload/201909/21/1569074681_560506.png) <br><br><br> 报错信息比较多,我复制一下:<br><br><br> ``` 九月 21, 2019 10:06:36 下午 org.apache.tomcat.util.digester.SetPropertiesRule begin 警告: [SetPropertiesRule]{Server/Service/Engine/Host/Context} Setting property 'source' to 'org.eclipse.jst.jee.server:testssm' did not find a matching property. 九月 21, 2019 10:06:36 下午 org.apache.catalina.startup.VersionLoggerListener log 信息: Server version: Apache Tomcat/8.0.52 九月 21, 2019 10:06:36 下午 org.apache.catalina.startup.VersionLoggerListener log 信息: Server built: Apr 28 2018 16:24:29 UTC 九月 21, 2019 10:06:36 下午 org.apache.catalina.startup.VersionLoggerListener log 信息: Server number: 8.0.52.0 九月 21, 2019 10:06:36 下午 org.apache.catalina.startup.VersionLoggerListener log 信息: OS Name: Windows 7 九月 21, 2019 10:06:36 下午 org.apache.catalina.startup.VersionLoggerListener log 信息: OS Version: 6.1 九月 21, 2019 10:06:36 下午 org.apache.catalina.startup.VersionLoggerListener log 信息: Architecture: x86 九月 21, 2019 10:06:36 下午 org.apache.catalina.startup.VersionLoggerListener log 信息: Java Home: C:\Java\jdk\jre 九月 21, 2019 10:06:36 下午 org.apache.catalina.startup.VersionLoggerListener log 信息: JVM Version: 1.8.0_65-b17 九月 21, 2019 10:06:36 下午 org.apache.catalina.startup.VersionLoggerListener log 信息: JVM Vendor: Oracle Corporation 九月 21, 2019 10:06:36 下午 org.apache.catalina.startup.VersionLoggerListener log 信息: CATALINA_BASE: C:\code\.metadata\.plugins\org.eclipse.wst.server.core\tmp0 九月 21, 2019 10:06:36 下午 org.apache.catalina.startup.VersionLoggerListener log 信息: CATALINA_HOME: C:\tomcat\apache-tomcat-8.0.52 九月 21, 2019 10:06:36 下午 org.apache.catalina.startup.VersionLoggerListener log 信息: Command line argument: -Dcatalina.base=C:\code\.metadata\.plugins\org.eclipse.wst.server.core\tmp0 九月 21, 2019 10:06:36 下午 org.apache.catalina.startup.VersionLoggerListener log 信息: Command line argument: -Dcatalina.home=C:\tomcat\apache-tomcat-8.0.52 九月 21, 2019 10:06:36 下午 org.apache.catalina.startup.VersionLoggerListener log 信息: Command line argument: -Dwtp.deploy=C:\tomcat\apache-tomcat-8.0.52\webapps 九月 21, 2019 10:06:36 下午 org.apache.catalina.startup.VersionLoggerListener log 信息: Command line argument: -Djava.endorsed.dirs=C:\tomcat\apache-tomcat-8.0.52\endorsed 九月 21, 2019 10:06:36 下午 org.apache.catalina.startup.VersionLoggerListener log 信息: Command line argument: -Dfile.encoding=GBK 九月 21, 2019 10:06:36 下午 org.apache.catalina.core.AprLifecycleListener lifecycleEvent 信息: The APR based Apache Tomcat Native library which allows optimal performance in production environments was not found on the java.library.path: C:\Java\jdk\bin;C:\Windows\Sun\Java\bin;C:\Windows\system32;C:\Windows;C:/Java/jdk/bin/../jre/bin/client;C:/Java/jdk/bin/../jre/bin;C:/Java/jdk/bin/../jre/lib/i386;C:\Java\jdk\bin;C:\Java\apache-maven-3.5.3\bin;C:\Windows\system32;C:\Windows;C:\Windows\System32\Wbem;C:\Windows\System32\WindowsPowerShell\v1.0\;C:\Program Files (x86)\Intel\OpenCL SDK\2.0\bin\x86;C:\Program Files (x86)\Intel\OpenCL SDK\2.0\bin\x64;C:\Program Files\Git\cmd;C:\code\eclipse;;. 九月 21, 2019 10:06:36 下午 org.apache.coyote.AbstractProtocol init 信息: Initializing ProtocolHandler ["http-nio-8080"] 九月 21, 2019 10:06:36 下午 org.apache.tomcat.util.net.NioSelectorPool getSharedSelector 信息: Using a shared selector for servlet write/read 九月 21, 2019 10:06:36 下午 org.apache.coyote.AbstractProtocol init 信息: Initializing ProtocolHandler ["ajp-nio-8009"] 九月 21, 2019 10:06:36 下午 org.apache.tomcat.util.net.NioSelectorPool getSharedSelector 信息: Using a shared selector for servlet write/read 九月 21, 2019 10:06:36 下午 org.apache.catalina.startup.Catalina load 信息: Initialization processed in 680 ms 九月 21, 2019 10:06:36 下午 org.apache.catalina.core.StandardService startInternal 信息: Starting service Catalina 九月 21, 2019 10:06:36 下午 org.apache.catalina.core.StandardEngine startInternal 信息: Starting Servlet Engine: Apache Tomcat/8.0.52 九月 21, 2019 10:06:37 下午 org.apache.catalina.util.SessionIdGeneratorBase createSecureRandom 警告: Creation of SecureRandom instance for session ID generation using [SHA1PRNG] took [125] milliseconds. 九月 21, 2019 10:06:37 下午 org.apache.catalina.core.ContainerBase startInternal 严重: A child container failed during start java.util.concurrent.ExecutionException: org.apache.catalina.LifecycleException: Failed to start component [StandardEngine[Catalina].StandardHost[localhost].StandardContext[/testssm]] at java.util.concurrent.FutureTask.report(FutureTask.java:122) at java.util.concurrent.FutureTask.get(FutureTask.java:192) at org.apache.catalina.core.ContainerBase.startInternal(ContainerBase.java:945) at org.apache.catalina.core.StandardHost.startInternal(StandardHost.java:871) at org.apache.catalina.util.LifecycleBase.start(LifecycleBase.java:145) at org.apache.catalina.core.ContainerBase$StartChild.call(ContainerBase.java:1410) at org.apache.catalina.core.ContainerBase$StartChild.call(ContainerBase.java:1400) at java.util.concurrent.FutureTask.run(FutureTask.java:266) at java.util.concurrent.ThreadPoolExecutor.runWorker(ThreadPoolExecutor.java:1142) at java.util.concurrent.ThreadPoolExecutor$Worker.run(ThreadPoolExecutor.java:617) at java.lang.Thread.run(Thread.java:745) Caused by: org.apache.catalina.LifecycleException: Failed to start component [StandardEngine[Catalina].StandardHost[localhost].StandardContext[/testssm]] at org.apache.catalina.util.LifecycleBase.start(LifecycleBase.java:162) ... 6 more Caused by: org.apache.catalina.LifecycleException: Failed to start component [org.apache.catalina.webresources.StandardRoot@fdd2b1] at org.apache.catalina.util.LifecycleBase.start(LifecycleBase.java:162) at org.apache.catalina.core.StandardContext.resourcesStart(StandardContext.java:5016) at org.apache.catalina.core.StandardContext.startInternal(StandardContext.java:5149) at org.apache.catalina.util.LifecycleBase.start(LifecycleBase.java:145) ... 6 more Caused by: org.apache.catalina.LifecycleException: Failed to initialize component [org.apache.catalina.webresources.JarResourceSet@154fd45] at org.apache.catalina.util.LifecycleBase.init(LifecycleBase.java:107) at org.apache.catalina.util.LifecycleBase.start(LifecycleBase.java:135) at org.apache.catalina.webresources.StandardRoot.startInternal(StandardRoot.java:722) at org.apache.catalina.util.LifecycleBase.start(LifecycleBase.java:145) ... 9 more Caused by: java.lang.IllegalArgumentException: java.util.zip.ZipException: invalid LOC header (bad signature) at org.apache.catalina.webresources.AbstractSingleArchiveResourceSet.initInternal(AbstractSingleArchiveResourceSet.java:142) at org.apache.catalina.util.LifecycleBase.init(LifecycleBase.java:102) ... 12 more Caused by: java.util.zip.ZipException: invalid LOC header (bad signature) at java.util.zip.ZipFile.read(Native Method) at java.util.zip.ZipFile.access$1400(ZipFile.java:60) at java.util.zip.ZipFile$ZipFileInputStream.read(ZipFile.java:716) at java.util.zip.ZipFile$ZipFileInflaterInputStream.fill(ZipFile.java:419) at java.util.zip.InflaterInputStream.read(InflaterInputStream.java:158) at sun.misc.IOUtils.readFully(IOUtils.java:65) at java.util.jar.JarFile.getBytes(JarFile.java:425) at java.util.jar.JarFile.getManifestFromReference(JarFile.java:193) at java.util.jar.JarFile.getManifest(JarFile.java:180) at org.apache.catalina.webresources.AbstractSingleArchiveResourceSet.initInternal(AbstractSingleArchiveResourceSet.java:140) ... 13 more 九月 21, 2019 10:06:37 下午 org.apache.catalina.core.ContainerBase startInternal 严重: A child container failed during start java.util.concurrent.ExecutionException: org.apache.catalina.LifecycleException: Failed to start component [StandardEngine[Catalina].StandardHost[localhost]] at java.util.concurrent.FutureTask.report(FutureTask.java:122) at java.util.concurrent.FutureTask.get(FutureTask.java:192) at org.apache.catalina.core.ContainerBase.startInternal(ContainerBase.java:945) at org.apache.catalina.core.StandardEngine.startInternal(StandardEngine.java:262) at org.apache.catalina.util.LifecycleBase.start(LifecycleBase.java:145) at org.apache.catalina.core.StandardService.startInternal(StandardService.java:441) at org.apache.catalina.util.LifecycleBase.start(LifecycleBase.java:145) at org.apache.catalina.core.StandardServer.startInternal(StandardServer.java:789) at org.apache.catalina.util.LifecycleBase.start(LifecycleBase.java:145) at org.apache.catalina.startup.Catalina.start(Catalina.java:641) at sun.reflect.NativeMethodAccessorImpl.invoke0(Native Method) at sun.reflect.NativeMethodAccessorImpl.invoke(NativeMethodAccessorImpl.java:62) at sun.reflect.DelegatingMethodAccessorImpl.invoke(DelegatingMethodAccessorImpl.java:43) at java.lang.reflect.Method.invoke(Method.java:497) at org.apache.catalina.startup.Bootstrap.start(Bootstrap.java:349) at org.apache.catalina.startup.Bootstrap.main(Bootstrap.java:483) Caused by: org.apache.catalina.LifecycleException: Failed to start component [StandardEngine[Catalina].StandardHost[localhost]] at org.apache.catalina.util.LifecycleBase.start(LifecycleBase.java:162) at org.apache.catalina.core.ContainerBase$StartChild.call(ContainerBase.java:1410) at org.apache.catalina.core.ContainerBase$StartChild.call(ContainerBase.java:1400) at java.util.concurrent.FutureTask.run(FutureTask.java:266) at java.util.concurrent.ThreadPoolExecutor.runWorker(ThreadPoolExecutor.java:1142) at java.util.concurrent.ThreadPoolExecutor$Worker.run(ThreadPoolExecutor.java:617) at java.lang.Thread.run(Thread.java:745) Caused by: org.apache.catalina.LifecycleException: A child container failed during start at org.apache.catalina.core.ContainerBase.startInternal(ContainerBase.java:953) at org.apache.catalina.core.StandardHost.startInternal(StandardHost.java:871) at org.apache.catalina.util.LifecycleBase.start(LifecycleBase.java:145) ... 6 more 九月 21, 2019 10:06:37 下午 org.apache.catalina.startup.Catalina start 严重: The required Server component failed to start so Tomcat is unable to start. org.apache.catalina.LifecycleException: Failed to start component [StandardServer[8005]] at org.apache.catalina.util.LifecycleBase.start(LifecycleBase.java:162) at org.apache.catalina.startup.Catalina.start(Catalina.java:641) at sun.reflect.NativeMethodAccessorImpl.invoke0(Native Method) at sun.reflect.NativeMethodAccessorImpl.invoke(NativeMethodAccessorImpl.java:62) at sun.reflect.DelegatingMethodAccessorImpl.invoke(DelegatingMethodAccessorImpl.java:43) at java.lang.reflect.Method.invoke(Method.java:497) at org.apache.catalina.startup.Bootstrap.start(Bootstrap.java:349) at org.apache.catalina.startup.Bootstrap.main(Bootstrap.java:483) Caused by: org.apache.catalina.LifecycleException: Failed to start component [StandardService[Catalina]] at org.apache.catalina.util.LifecycleBase.start(LifecycleBase.java:162) at org.apache.catalina.core.StandardServer.startInternal(StandardServer.java:789) at org.apache.catalina.util.LifecycleBase.start(LifecycleBase.java:145) ... 7 more Caused by: org.apache.catalina.LifecycleException: Failed to start component [StandardEngine[Catalina]] at org.apache.catalina.util.LifecycleBase.start(LifecycleBase.java:162) at org.apache.catalina.core.StandardService.startInternal(StandardService.java:441) at org.apache.catalina.util.LifecycleBase.start(LifecycleBase.java:145) ... 9 more Caused by: org.apache.catalina.LifecycleException: A child container failed during start at org.apache.catalina.core.ContainerBase.startInternal(ContainerBase.java:953) at org.apache.catalina.core.StandardEngine.startInternal(StandardEngine.java:262) at org.apache.catalina.util.LifecycleBase.start(LifecycleBase.java:145) ... 11 more 九月 21, 2019 10:06:37 下午 org.apache.coyote.AbstractProtocol pause 信息: Pausing ProtocolHandler ["http-nio-8080"] 九月 21, 2019 10:06:37 下午 org.apache.coyote.AbstractProtocol pause 信息: Pausing ProtocolHandler ["ajp-nio-8009"] 九月 21, 2019 10:06:37 下午 org.apache.catalina.core.StandardService stopInternal 信息: Stopping service Catalina 九月 21, 2019 10:06:37 下午 org.apache.coyote.AbstractProtocol destroy 信息: Destroying ProtocolHandler ["http-nio-8080"] 九月 21, 2019 10:06:37 下午 org.apache.coyote.AbstractProtocol destroy 严重: Failed to destroy end point associated with ProtocolHandler ["http-nio-8080"] java.lang.NullPointerException at org.apache.tomcat.util.net.NioEndpoint.releaseCaches(NioEndpoint.java:315) at org.apache.tomcat.util.net.NioEndpoint.unbind(NioEndpoint.java:491) at org.apache.tomcat.util.net.AbstractEndpoint.destroy(AbstractEndpoint.java:896) at org.apache.coyote.AbstractProtocol.destroy(AbstractProtocol.java:551) at org.apache.catalina.connector.Connector.destroyInternal(Connector.java:1023) at org.apache.catalina.util.LifecycleBase.destroy(LifecycleBase.java:292) at org.apache.catalina.core.StandardService.destroyInternal(StandardService.java:589) at org.apache.catalina.util.LifecycleBase.destroy(LifecycleBase.java:292) at org.apache.catalina.core.StandardServer.destroyInternal(StandardServer.java:879) at org.apache.catalina.util.LifecycleBase.destroy(LifecycleBase.java:292) at org.apache.catalina.startup.Catalina.start(Catalina.java:645) at sun.reflect.NativeMethodAccessorImpl.invoke0(Native Method) at sun.reflect.NativeMethodAccessorImpl.invoke(NativeMethodAccessorImpl.java:62) at sun.reflect.DelegatingMethodAccessorImpl.invoke(DelegatingMethodAccessorImpl.java:43) at java.lang.reflect.Method.invoke(Method.java:497) at org.apache.catalina.startup.Bootstrap.start(Bootstrap.java:349) at org.apache.catalina.startup.Bootstrap.main(Bootstrap.java:483) 九月 21, 2019 10:06:37 下午 org.apache.coyote.AbstractProtocol destroy 信息: Destroying ProtocolHandler ["ajp-nio-8009"] 九月 21, 2019 10:06:37 下午 org.apache.coyote.AbstractProtocol destroy 严重: Failed to destroy end point associated with ProtocolHandler ["ajp-nio-8009"] java.lang.NullPointerException at org.apache.tomcat.util.net.NioEndpoint.releaseCaches(NioEndpoint.java:315) at org.apache.tomcat.util.net.NioEndpoint.unbind(NioEndpoint.java:491) at org.apache.tomcat.util.net.AbstractEndpoint.destroy(AbstractEndpoint.java:896) at org.apache.coyote.AbstractProtocol.destroy(AbstractProtocol.java:551) at org.apache.catalina.connector.Connector.destroyInternal(Connector.java:1023) at org.apache.catalina.util.LifecycleBase.destroy(LifecycleBase.java:292) at org.apache.catalina.core.StandardService.destroyInternal(StandardService.java:589) at org.apache.catalina.util.LifecycleBase.destroy(LifecycleBase.java:292) at org.apache.catalina.core.StandardServer.destroyInternal(StandardServer.java:879) at org.apache.catalina.util.LifecycleBase.destroy(LifecycleBase.java:292) at org.apache.catalina.startup.Catalina.start(Catalina.java:645) at sun.reflect.NativeMethodAccessorImpl.invoke0(Native Method) at sun.reflect.NativeMethodAccessorImpl.invoke(NativeMethodAccessorImpl.java:62) at sun.reflect.DelegatingMethodAccessorImpl.invoke(DelegatingMethodAccessorImpl.java:43) at java.lang.reflect.Method.invoke(Method.java:497) at org.apache.catalina.startup.Bootstrap.start(Bootstrap.java:349) at org.apache.catalina.startup.Bootstrap.main(Bootstrap.java:483) ```
网上说web.xml里面缺"/"没有啊
八月 30, 2015 9:57:53 上午 org.apache.catalina.core.AprLifecycleListener init 信息: The APR based Apache Tomcat Native library which allows optimal performance in production environments was not found on the java.library.path: D:\Program Files\Java\jdk1.7.0_67\bin;C:\Windows\Sun\Java\bin;C:\Windows\system32;C:\Windows;C:\Windows\system32;C:\Windows;C:\Windows\System32\Wbem;C:\Windows\System32\WindowsPowerShell\v1.0\;C:\Program Files (x86)\Intel\OpenCL SDK\3.0\bin\x86;C:\Program Files (x86)\Intel\OpenCL SDK\3.0\bin\x64;E:\Program Files\WIDCOMM\Bluetooth Software\;E:\Program Files\WIDCOMM\Bluetooth Software\syswow64;D:\Program Files (x86)\Java\jdk1.7.0\bin;D:\Program Files\MySQL\MySQL Server 5.0\bin;C:\Program Files\Microsoft\Web Platform Installer\;C:\Program Files (x86)\Microsoft ASP.NET\ASP.NET Web Pages\v1.0\;C:\Program Files (x86)\Windows Kits\8.0\Windows Performance Toolkit\;D:\Program Files\Java\jdk1.7.0_67\bin;D:\Program Files (x86)\Microsoft SQL Server\100\Tools\Binn\;D:\Program Files\Microsoft SQL Server\100\Tools\Binn\;D:\Program Files\Microsoft SQL Server\100\DTS\Binn\;D:\Program Files (x86)\Microsoft SQL Server\100\Tools\Binn\VSShell\Common7\IDE\;D:\Program Files (x86)\Microsoft SQL Server\100\DTS\Binn\;C:\Program Files (x86)\Microsoft Visual Studio 9.0\Common7\IDE\PrivateAssemblies\;. 八月 30, 2015 9:57:53 上午 org.apache.tomcat.util.digester.SetPropertiesRule begin 警告: [SetPropertiesRule]{Server/Service/Engine/Host/Context} Setting property 'source' to 'org.eclipse.jst.jee.server:yuuzoo' did not find a matching property. 八月 30, 2015 9:57:53 上午 org.apache.coyote.AbstractProtocol init 信息: Initializing ProtocolHandler ["http-bio-8080"] 八月 30, 2015 9:57:53 上午 org.apache.coyote.AbstractProtocol init 信息: Initializing ProtocolHandler ["ajp-bio-8009"] 八月 30, 2015 9:57:53 上午 org.apache.catalina.startup.Catalina load 信息: Initialization processed in 1396 ms 八月 30, 2015 9:57:53 上午 org.apache.catalina.core.StandardService startInternal 信息: Starting service Catalina 八月 30, 2015 9:57:53 上午 org.apache.catalina.core.StandardEngine startInternal 信息: Starting Servlet Engine: Apache Tomcat/7.0.27 八月 30, 2015 9:57:54 上午 org.apache.catalina.core.ContainerBase startInternal 严重: A child container failed during start java.util.concurrent.ExecutionException: org.apache.catalina.LifecycleException: Failed to start component [StandardEngine[Catalina].StandardHost[localhost].StandardContext[/yuuzoo]] at java.util.concurrent.FutureTask.report(FutureTask.java:122) at java.util.concurrent.FutureTask.get(FutureTask.java:188) at org.apache.catalina.core.ContainerBase.startInternal(ContainerBase.java:1128) at org.apache.catalina.core.StandardHost.startInternal(StandardHost.java:782) at org.apache.catalina.util.LifecycleBase.start(LifecycleBase.java:150) at org.apache.catalina.core.ContainerBase$StartChild.call(ContainerBase.java:1566) at org.apache.catalina.core.ContainerBase$StartChild.call(ContainerBase.java:1556) at java.util.concurrent.FutureTask.run(FutureTask.java:262) at java.util.concurrent.ThreadPoolExecutor.runWorker(ThreadPoolExecutor.java:1145) at java.util.concurrent.ThreadPoolExecutor$Worker.run(ThreadPoolExecutor.java:615) at java.lang.Thread.run(Thread.java:745) Caused by: org.apache.catalina.LifecycleException: Failed to start component [StandardEngine[Catalina].StandardHost[localhost].StandardContext[/yuuzoo]] at org.apache.catalina.util.LifecycleBase.start(LifecycleBase.java:154) ... 6 more Caused by: java.lang.NoClassDefFoundError: FilterConfig at java.lang.Class.getDeclaredMethods0(Native Method) at java.lang.Class.privateGetDeclaredMethods(Class.java:2570) at java.lang.Class.getDeclaredMethods(Class.java:1855) at org.apache.catalina.startup.WebAnnotationSet.getDeclaredMethods(WebAnnotationSet.java:470) at org.apache.catalina.startup.WebAnnotationSet.loadMethodsAnnotation(WebAnnotationSet.java:275) at org.apache.catalina.startup.WebAnnotationSet.loadApplicationFilterAnnotations(WebAnnotationSet.java:108) at org.apache.catalina.startup.WebAnnotationSet.loadApplicationAnnotations(WebAnnotationSet.java:65) at org.apache.catalina.startup.ContextConfig.applicationAnnotationsConfig(ContextConfig.java:381) at org.apache.catalina.startup.ContextConfig.configureStart(ContextConfig.java:858) at org.apache.catalina.startup.ContextConfig.lifecycleEvent(ContextConfig.java:345) at org.apache.catalina.util.LifecycleSupport.fireLifecycleEvent(LifecycleSupport.java:119) at org.apache.catalina.util.LifecycleBase.fireLifecycleEvent(LifecycleBase.java:90) at org.apache.catalina.core.StandardContext.startInternal(StandardContext.java:5161) at org.apache.catalina.util.LifecycleBase.start(LifecycleBase.java:150) ... 6 more Caused by: java.lang.ClassNotFoundException: FilterConfig at org.apache.catalina.loader.WebappClassLoader.loadClass(WebappClassLoader.java:1711) at org.apache.catalina.loader.WebappClassLoader.loadClass(WebappClassLoader.java:1556) ... 20 more 八月 30, 2015 9:57:54 上午 org.apache.catalina.util.SessionIdGenerator createSecureRandom 信息: Creation of SecureRandom instance for session ID generation using [SHA1PRNG] took [191] milliseconds. 八月 30, 2015 9:57:54 上午 org.apache.catalina.core.ContainerBase startInternal 严重: A child container failed during start java.util.concurrent.ExecutionException: org.apache.catalina.LifecycleException: Failed to start component [StandardEngine[Catalina].StandardHost[localhost]] at java.util.concurrent.FutureTask.report(FutureTask.java:122) at java.util.concurrent.FutureTask.get(FutureTask.java:188) at org.apache.catalina.core.ContainerBase.startInternal(ContainerBase.java:1128) at org.apache.catalina.core.StandardEngine.startInternal(StandardEngine.java:302) at org.apache.catalina.util.LifecycleBase.start(LifecycleBase.java:150) at org.apache.catalina.core.StandardService.startInternal(StandardService.java:443) at org.apache.catalina.util.LifecycleBase.start(LifecycleBase.java:150) at org.apache.catalina.core.StandardServer.startInternal(StandardServer.java:732) at org.apache.catalina.util.LifecycleBase.start(LifecycleBase.java:150) at org.apache.catalina.startup.Catalina.start(Catalina.java:675) at sun.reflect.NativeMethodAccessorImpl.invoke0(Native Method) at sun.reflect.NativeMethodAccessorImpl.invoke(NativeMethodAccessorImpl.java:57) at sun.reflect.DelegatingMethodAccessorImpl.invoke(DelegatingMethodAccessorImpl.java:43) at java.lang.reflect.Method.invoke(Method.java:606) at org.apache.catalina.startup.Bootstrap.start(Bootstrap.java:322) at org.apache.catalina.startup.Bootstrap.main(Bootstrap.java:450) Caused by: org.apache.catalina.LifecycleException: Failed to start component [StandardEngine[Catalina].StandardHost[localhost]] at org.apache.catalina.util.LifecycleBase.start(LifecycleBase.java:154) at org.apache.catalina.core.ContainerBase$StartChild.call(ContainerBase.java:1566) at org.apache.catalina.core.ContainerBase$StartChild.call(ContainerBase.java:1556) at java.util.concurrent.FutureTask.run(FutureTask.java:262) at java.util.concurrent.ThreadPoolExecutor.runWorker(ThreadPoolExecutor.java:1145) at java.util.concurrent.ThreadPoolExecutor$Worker.run(ThreadPoolExecutor.java:615) at java.lang.Thread.run(Thread.java:745) Caused by: org.apache.catalina.LifecycleException: A child container failed during start at org.apache.catalina.core.ContainerBase.startInternal(ContainerBase.java:1136) at org.apache.catalina.core.StandardHost.startInternal(StandardHost.java:782) at org.apache.catalina.util.LifecycleBase.start(LifecycleBase.java:150) ... 6 more 八月 30, 2015 9:57:54 上午 org.apache.catalina.startup.Catalina start 严重: Catalina.start: org.apache.catalina.LifecycleException: Failed to start component [StandardServer[8005]] at org.apache.catalina.util.LifecycleBase.start(LifecycleBase.java:154) at org.apache.catalina.startup.Catalina.start(Catalina.java:675) at sun.reflect.NativeMethodAccessorImpl.invoke0(Native Method) at sun.reflect.NativeMethodAccessorImpl.invoke(NativeMethodAccessorImpl.java:57) at sun.reflect.DelegatingMethodAccessorImpl.invoke(DelegatingMethodAccessorImpl.java:43) at java.lang.reflect.Method.invoke(Method.java:606) at org.apache.catalina.startup.Bootstrap.start(Bootstrap.java:322) at org.apache.catalina.startup.Bootstrap.main(Bootstrap.java:450) Caused by: org.apache.catalina.LifecycleException: Failed to start component [StandardService[Catalina]] at org.apache.catalina.util.LifecycleBase.start(LifecycleBase.java:154) at org.apache.catalina.core.StandardServer.startInternal(StandardServer.java:732) at org.apache.catalina.util.LifecycleBase.start(LifecycleBase.java:150) ... 7 more Caused by: org.apache.catalina.LifecycleException: Failed to start component [StandardEngine[Catalina]] at org.apache.catalina.util.LifecycleBase.start(LifecycleBase.java:154) at org.apache.catalina.core.StandardService.startInternal(StandardService.java:443) at org.apache.catalina.util.LifecycleBase.start(LifecycleBase.java:150) ... 9 more Caused by: org.apache.catalina.LifecycleException: A child container failed during start at org.apache.catalina.core.ContainerBase.startInternal(ContainerBase.java:1136) at org.apache.catalina.core.StandardEngine.startInternal(StandardEngine.java:302) at org.apache.catalina.util.LifecycleBase.start(LifecycleBase.java:150) ... 11 more 八月 30, 2015 9:57:54 上午 org.apache.catalina.startup.Catalina start 信息: Server startup in 1247 ms
大佬请进!手机GPU是否支持OpenCL的cl_khr_fp64扩展?
萌新求助! 目前市面上手机的GPU性能越来越好,支持opencl(1.x和2.x)的手机也越来越多。 在主机显卡领域,例如N卡、AMD显卡都支持K家的cl_khr_fp64的扩展,这样就能够支持double类型的数据,从而可以支持FMA(浮点加乘操作)。 那么现在主流版本的手机GPU是否支持K家(Khronos)为opencl提供的cl_khr_fp64扩展呢?
AMD R7 360 显卡支不支持opencl2.0?
官网上说支持2.0,但我跑的程序显示不支持2.0,如图,而且在运行SVM相关的示例程序在clSVMAlloc报错。 ![图片说明](https://img-ask.csdn.net/upload/201606/05/1465110527_977821.png)
Ubuntu AMDAPPSDK OpenCL
After I install AMDAPPSDK-3.0 in my Ubuntu14.04, I can't find relative env variables in both ~/.bashrc and /etc/profile. However, the installation said that all those vars were exported successfully. Since that I can't run OpenCL programs. What can I do to fix this problem?
GPU与CPU同时并行问题
我现在在用Fortran对一个随机方程进行模拟。需要计算大量的样本,每个样本之间互相独立,并且每个样本返回的值很简单,只有两个浮点值,但每个样本的计算量很大。我现在用omp对每个样本在CPU上建立一个样本进行计算。但感觉还是不够快。最近想把显卡用上。但研究了一下OpenCL和CUDA,现在只能在仅显卡上做。我有两颗E5,如果只用显卡感觉挺浪费。能不能让CPU和GPU同时计算不同的样本。曾经在论坛上搜到在OpenCL的上下文设置一下就成,但找了些资料没头绪。求大神指点一下。如果能把CUDA和OpenCL的实现方法分别说一下就更好了。谢谢。
Hadoop2.4.0环境下HBase-0.9.60-hadoo2版本冲突问题
我的Hadoop环境是Hadoop2.4.0,HBase是HBase-0.9.60-hadoo2,今天使用HBase API编写了一个程序,运行的时候曝下面的错误: 2014-09-01 18:16:00,247 WARN [main] util.NativeCodeLoader (NativeCodeLoader.java:<clinit>(62)) - Unable to load native-hadoop library for your platform... using builtin-java classes where applicable 2014-09-01 18:16:00,283 ERROR [main] util.Shell (Shell.java:getWinUtilsPath(303)) - Failed to locate the winutils binary in the hadoop binary path java.io.IOException: Could not locate executable null\bin\winutils.exe in the Hadoop binaries. at org.apache.hadoop.util.Shell.getQualifiedBinPath(Shell.java:278) at org.apache.hadoop.util.Shell.getWinUtilsPath(Shell.java:300) at org.apache.hadoop.util.Shell.<clinit>(Shell.java:293) at org.apache.hadoop.util.StringUtils.<clinit>(StringUtils.java:76) at org.apache.hadoop.conf.Configuration.getStrings(Configuration.java:1514) at org.apache.hadoop.hbase.zookeeper.ZKConfig.makeZKProps(ZKConfig.java:113) at org.apache.hadoop.hbase.zookeeper.ZKConfig.getZKQuorumServersString(ZKConfig.java:265) at org.apache.hadoop.hbase.zookeeper.ZooKeeperWatcher.<init>(ZooKeeperWatcher.java:159) at org.apache.hadoop.hbase.zookeeper.ZooKeeperWatcher.<init>(ZooKeeperWatcher.java:134) at org.apache.hadoop.hbase.client.ZooKeeperKeepAliveConnection.<init>(ZooKeeperKeepAliveConnection.java:43) at org.apache.hadoop.hbase.client.HConnectionManager$HConnectionImplementation.getKeepAliveZooKeeperWatcher(HConnectionManager.java:1710) at org.apache.hadoop.hbase.client.ZooKeeperRegistry.getClusterId(ZooKeeperRegistry.java:82) at org.apache.hadoop.hbase.client.HConnectionManager$HConnectionImplementation.retrieveClusterId(HConnectionManager.java:806) at org.apache.hadoop.hbase.client.HConnectionManager$HConnectionImplementation.<init>(HConnectionManager.java:633) at sun.reflect.NativeConstructorAccessorImpl.newInstance0(Native Method) at sun.reflect.NativeConstructorAccessorImpl.newInstance(NativeConstructorAccessorImpl.java:57) at sun.reflect.DelegatingConstructorAccessorImpl.newInstance(DelegatingConstructorAccessorImpl.java:45) at java.lang.reflect.Constructor.newInstance(Constructor.java:526) at org.apache.hadoop.hbase.client.HConnectionManager.createConnection(HConnectionManager.java:387) at org.apache.hadoop.hbase.client.HConnectionManager.createConnection(HConnectionManager.java:366) at org.apache.hadoop.hbase.client.HConnectionManager.getConnection(HConnectionManager.java:247) at org.apache.hadoop.hbase.client.HBaseAdmin.<init>(HBaseAdmin.java:183) at cn.haha.HBase.HBaseApp1.main(HBaseApp1.java:26) 2014-09-01 18:16:00,297 INFO [main] zookeeper.ZooKeeper (Environment.java:logEnv(100)) - Client environment:zookeeper.version=3.4.5-1392090, built on 09/30/2012 17:52 GMT 2014-09-01 18:16:00,297 INFO [main] zookeeper.ZooKeeper (Environment.java:logEnv(100)) - Client environment:host.name=Admin-PC 2014-09-01 18:16:00,297 INFO [main] zookeeper.ZooKeeper (Environment.java:logEnv(100)) - Client environment:java.version=1.7.0_65 2014-09-01 18:16:00,297 INFO [main] zookeeper.ZooKeeper (Environment.java:logEnv(100)) - Client environment:java.vendor=Oracle Corporation 2014-09-01 18:16:00,297 INFO [main] zookeeper.ZooKeeper (Environment.java:logEnv(100)) - Client environment:java.home=C:\workDir\jdk7u65\jre 2014-09-01 18:16:00,297 INFO [main] zookeeper.ZooKeeper (Environment.java:logEnv(100)) - Client environment:java.class.path=E:\workDir\workspace_eclipse\HBase-0.96\bin;E:\workDir\workspace_eclipse\HBase-0.96\lib\activation-1.1.jar;E:\workDir\workspace_eclipse\HBase-0.96\lib\aopalliance-1.0.jar;E:\workDir\workspace_eclipse\HBase-0.96\lib\asm-3.1.jar;E:\workDir\workspace_eclipse\HBase-0.96\lib\avro-1.7.4.jar;E:\workDir\workspace_eclipse\HBase-0.96\lib\commons-beanutils-1.7.0.jar;E:\workDir\workspace_eclipse\HBase-0.96\lib\commons-beanutils-core-1.8.0.jar;E:\workDir\workspace_eclipse\HBase-0.96\lib\commons-cli-1.2.jar;E:\workDir\workspace_eclipse\HBase-0.96\lib\commons-codec-1.7.jar;E:\workDir\workspace_eclipse\HBase-0.96\lib\commons-collections-3.2.1.jar;E:\workDir\workspace_eclipse\HBase-0.96\lib\commons-compress-1.4.1.jar;E:\workDir\workspace_eclipse\HBase-0.96\lib\commons-configuration-1.6.jar;E:\workDir\workspace_eclipse\HBase-0.96\lib\commons-daemon-1.0.13.jar;E:\workDir\workspace_eclipse\HBase-0.96\lib\commons-digester-1.8.jar;E:\workDir\workspace_eclipse\HBase-0.96\lib\commons-el-1.0.jar;E:\workDir\workspace_eclipse\HBase-0.96\lib\commons-httpclient-3.1.jar;E:\workDir\workspace_eclipse\HBase-0.96\lib\commons-io-2.4.jar;E:\workDir\workspace_eclipse\HBase-0.96\lib\commons-lang-2.6.jar;E:\workDir\workspace_eclipse\HBase-0.96\lib\commons-logging-1.1.1.jar;E:\workDir\workspace_eclipse\HBase-0.96\lib\commons-math-2.1.jar;E:\workDir\workspace_eclipse\HBase-0.96\lib\commons-net-3.1.jar;E:\workDir\workspace_eclipse\HBase-0.96\lib\findbugs-annotations-1.3.9-1.jar;E:\workDir\workspace_eclipse\HBase-0.96\lib\gmbal-api-only-3.0.0-b023.jar;E:\workDir\workspace_eclipse\HBase-0.96\lib\grizzly-framework-2.1.2.jar;E:\workDir\workspace_eclipse\HBase-0.96\lib\grizzly-http-2.1.2.jar;E:\workDir\workspace_eclipse\HBase-0.96\lib\grizzly-http-server-2.1.2.jar;E:\workDir\workspace_eclipse\HBase-0.96\lib\grizzly-http-servlet-2.1.2.jar;E:\workDir\workspace_eclipse\HBase-0.96\lib\grizzly-rcm-2.1.2.jar;E:\workDir\workspace_eclipse\HBase-0.96\lib\guava-12.0.1.jar;E:\workDir\workspace_eclipse\HBase-0.96\lib\guice-3.0.jar;E:\workDir\workspace_eclipse\HBase-0.96\lib\guice-servlet-3.0.jar;E:\workDir\workspace_eclipse\HBase-0.96\lib\hadoop-annotations-2.2.0.jar;E:\workDir\workspace_eclipse\HBase-0.96\lib\hadoop-auth-2.2.0.jar;E:\workDir\workspace_eclipse\HBase-0.96\lib\hadoop-client-2.2.0.jar;E:\workDir\workspace_eclipse\HBase-0.96\lib\hadoop-common-2.2.0.jar;E:\workDir\workspace_eclipse\HBase-0.96\lib\hadoop-hdfs-2.2.0-tests.jar;E:\workDir\workspace_eclipse\HBase-0.96\lib\hadoop-hdfs-2.2.0.jar;E:\workDir\workspace_eclipse\HBase-0.96\lib\hadoop-mapreduce-client-app-2.2.0.jar;E:\workDir\workspace_eclipse\HBase-0.96\lib\hadoop-mapreduce-client-common-2.2.0.jar;E:\workDir\workspace_eclipse\HBase-0.96\lib\hadoop-mapreduce-client-core-2.2.0.jar;E:\workDir\workspace_eclipse\HBase-0.96\lib\hadoop-mapreduce-client-jobclient-2.2.0-tests.jar;E:\workDir\workspace_eclipse\HBase-0.96\lib\hadoop-mapreduce-client-jobclient-2.2.0.jar;E:\workDir\workspace_eclipse\HBase-0.96\lib\hadoop-mapreduce-client-shuffle-2.2.0.jar;E:\workDir\workspace_eclipse\HBase-0.96\lib\hadoop-yarn-api-2.2.0.jar;E:\workDir\workspace_eclipse\HBase-0.96\lib\hadoop-yarn-client-2.2.0.jar;E:\workDir\workspace_eclipse\HBase-0.96\lib\hadoop-yarn-common-2.2.0.jar;E:\workDir\workspace_eclipse\HBase-0.96\lib\hadoop-yarn-server-common-2.2.0.jar;E:\workDir\workspace_eclipse\HBase-0.96\lib\hadoop-yarn-server-nodemanager-2.2.0.jar;E:\workDir\workspace_eclipse\HBase-0.96\lib\hamcrest-core-1.3.jar;E:\workDir\workspace_eclipse\HBase-0.96\lib\hbase-client-0.96.2-hadoop2.jar;E:\workDir\workspace_eclipse\HBase-0.96\lib\hbase-common-0.96.2-hadoop2-tests.jar;E:\workDir\workspace_eclipse\HBase-0.96\lib\hbase-common-0.96.2-hadoop2.jar;E:\workDir\workspace_eclipse\HBase-0.96\lib\hbase-examples-0.96.2-hadoop2.jar;E:\workDir\workspace_eclipse\HBase-0.96\lib\hbase-hadoop-compat-0.96.2-hadoop2.jar;E:\workDir\workspace_eclipse\HBase-0.96\lib\hbase-hadoop2-compat-0.96.2-hadoop2.jar;E:\workDir\workspace_eclipse\HBase-0.96\lib\hbase-it-0.96.2-hadoop2-tests.jar;E:\workDir\workspace_eclipse\HBase-0.96\lib\hbase-it-0.96.2-hadoop2.jar;E:\workDir\workspace_eclipse\HBase-0.96\lib\hbase-prefix-tree-0.96.2-hadoop2.jar;E:\workDir\workspace_eclipse\HBase-0.96\lib\hbase-protocol-0.96.2-hadoop2.jar;E:\workDir\workspace_eclipse\HBase-0.96\lib\hbase-server-0.96.2-hadoop2-tests.jar;E:\workDir\workspace_eclipse\HBase-0.96\lib\hbase-server-0.96.2-hadoop2.jar;E:\workDir\workspace_eclipse\HBase-0.96\lib\hbase-shell-0.96.2-hadoop2.jar;E:\workDir\workspace_eclipse\HBase-0.96\lib\hbase-testing-util-0.96.2-hadoop2.jar;E:\workDir\workspace_eclipse\HBase-0.96\lib\hbase-thrift-0.96.2-hadoop2.jar;E:\workDir\workspace_eclipse\HBase-0.96\lib\htrace-core-2.04.jar;E:\workDir\workspace_eclipse\HBase-0.96\lib\httpclient-4.1.3.jar;E:\workDir\workspace_eclipse\HBase-0.96\lib\httpcore-4.1.3.jar;E:\workDir\workspace_eclipse\HBase-0.96\lib\jackson-core-asl-1.8.8.jar;E:\workDir\workspace_eclipse\HBase-0.96\lib\jackson-jaxrs-1.8.8.jar;E:\workDir\workspace_eclipse\HBase-0.96\lib\jackson-mapper-asl-1.8.8.jar;E:\workDir\workspace_eclipse\HBase-0.96\lib\jackson-xc-1.8.8.jar;E:\workDir\workspace_eclipse\HBase-0.96\lib\jamon-runtime-2.3.1.jar;E:\workDir\workspace_eclipse\HBase-0.96\lib\jasper-compiler-5.5.23.jar;E:\workDir\workspace_eclipse\HBase-0.96\lib\jasper-runtime-5.5.23.jar;E:\workDir\workspace_eclipse\HBase-0.96\lib\javax.inject-1.jar;E:\workDir\workspace_eclipse\HBase-0.96\lib\javax.servlet-3.1.jar;E:\workDir\workspace_eclipse\HBase-0.96\lib\javax.servlet-api-3.0.1.jar;E:\workDir\workspace_eclipse\HBase-0.96\lib\jaxb-api-2.2.2.jar;E:\workDir\workspace_eclipse\HBase-0.96\lib\jaxb-impl-2.2.3-1.jar;E:\workDir\workspace_eclipse\HBase-0.96\lib\jersey-client-1.9.jar;E:\workDir\workspace_eclipse\HBase-0.96\lib\jersey-core-1.8.jar;E:\workDir\workspace_eclipse\HBase-0.96\lib\jersey-grizzly2-1.9.jar;E:\workDir\workspace_eclipse\HBase-0.96\lib\jersey-guice-1.9.jar;E:\workDir\workspace_eclipse\HBase-0.96\lib\jersey-json-1.8.jar;E:\workDir\workspace_eclipse\HBase-0.96\lib\jersey-server-1.8.jar;E:\workDir\workspace_eclipse\HBase-0.96\lib\jersey-test-framework-core-1.9.jar;E:\workDir\workspace_eclipse\HBase-0.96\lib\jersey-test-framework-grizzly2-1.9.jar;E:\workDir\workspace_eclipse\HBase-0.96\lib\jets3t-0.6.1.jar;E:\workDir\workspace_eclipse\HBase-0.96\lib\jettison-1.3.1.jar;E:\workDir\workspace_eclipse\HBase-0.96\lib\jetty-6.1.26.jar;E:\workDir\workspace_eclipse\HBase-0.96\lib\jetty-sslengine-6.1.26.jar;E:\workDir\workspace_eclipse\HBase-0.96\lib\jetty-util-6.1.26.jar;E:\workDir\workspace_eclipse\HBase-0.96\lib\jruby-complete-1.6.8.jar;E:\workDir\workspace_eclipse\HBase-0.96\lib\jsch-0.1.42.jar;E:\workDir\workspace_eclipse\HBase-0.96\lib\jsp-2.1-6.1.14.jar;E:\workDir\workspace_eclipse\HBase-0.96\lib\jsp-api-2.1-6.1.14.jar;E:\workDir\workspace_eclipse\HBase-0.96\lib\jsr305-1.3.9.jar;E:\workDir\workspace_eclipse\HBase-0.96\lib\junit-4.11.jar;E:\workDir\workspace_eclipse\HBase-0.96\lib\libthrift-0.9.0.jar;E:\workDir\workspace_eclipse\HBase-0.96\lib\log4j-1.2.17.jar;E:\workDir\workspace_eclipse\HBase-0.96\lib\management-api-3.0.0-b012.jar;E:\workDir\workspace_eclipse\HBase-0.96\lib\metrics-core-2.1.2.jar;E:\workDir\workspace_eclipse\HBase-0.96\lib\netty-3.6.6.Final.jar;E:\workDir\workspace_eclipse\HBase-0.96\lib\paranamer-2.3.jar;E:\workDir\workspace_eclipse\HBase-0.96\lib\protobuf-java-2.5.0.jar;E:\workDir\workspace_eclipse\HBase-0.96\lib\servlet-api-2.5-6.1.14.jar;E:\workDir\workspace_eclipse\HBase-0.96\lib\slf4j-api-1.6.4.jar;E:\workDir\workspace_eclipse\HBase-0.96\lib\slf4j-log4j12-1.6.4.jar;E:\workDir\workspace_eclipse\HBase-0.96\lib\snappy-java-1.0.4.1.jar;E:\workDir\workspace_eclipse\HBase-0.96\lib\xmlenc-0.52.jar;E:\workDir\workspace_eclipse\HBase-0.96\lib\xz-1.0.jar;E:\workDir\workspace_eclipse\HBase-0.96\lib\zookeeper-3.4.5.jar 2014-09-01 18:16:00,297 INFO [main] zookeeper.ZooKeeper (Environment.java:logEnv(100)) - Client environment:java.library.path=C:\workDir\jdk7u65\bin;C:\windows\Sun\Java\bin;C:\windows\system32;C:\windows;C:/workDir/jdk7u65/bin/../jre/bin/client;C:/workDir/jdk7u65/bin/../jre/bin;C:/workDir/jdk7u65/bin/../jre/lib/i386;C:\Program Files (x86)\Common Files\NetSarang;C:\workDir\jdk7u65\bin;E:\workDir\apache-tomcat-7.0.55;E:\workDir\apache-tomcat-7.0.55;%CATALINA_HOME%\common\lib\common\lib\bin;C:\Program Files (x86)\Intel\iCLS Client\;C:\Program Files\Intel\iCLS Client\;C:\windows\system32;C:\windows;C:\windows\System32\Wbem;C:\windows\System32\WindowsPowerShell\v1.0\;C:\Program Files\Intel\Intel(R) Management Engine Components\DAL;C:\Program Files\Intel\Intel(R) Management Engine Components\IPT;C:\Program Files (x86)\Intel\Intel(R) Management Engine Components\DAL;C:\Program Files (x86)\Intel\Intel(R) Management Engine Components\IPT;C:\Program Files\Intel\WiFi\bin\;C:\Program Files\Common Files\Intel\WirelessCommon\;C:\Program Files\Lenovo\Fingerprint Manager Pro\;C:\Program Files (x86)\Intel\OpenCL SDK\3.0\bin\x86;C:\Program Files (x86)\Intel\OpenCL SDK\3.0\bin\x64;C:\Program Files (x86)\IDM Computer Solutions\UltraEdit\;E:\workDir\eclipse-indigo-3.7.2;;. 2014-09-01 18:16:00,297 INFO [main] zookeeper.ZooKeeper (Environment.java:logEnv(100)) - Client environment:java.io.tmpdir=C:\Users\ADMINI~1\AppData\Local\Temp\ 2014-09-01 18:16:00,298 INFO [main] zookeeper.ZooKeeper (Environment.java:logEnv(100)) - Client environment:java.compiler=<NA> 2014-09-01 18:16:00,298 INFO [main] zookeeper.ZooKeeper (Environment.java:logEnv(100)) - Client environment:os.name=Windows 7 2014-09-01 18:16:00,298 INFO [main] zookeeper.ZooKeeper (Environment.java:logEnv(100)) - Client environment:os.arch=x86 2014-09-01 18:16:00,298 INFO [main] zookeeper.ZooKeeper (Environment.java:logEnv(100)) - Client environment:os.version=6.1 2014-09-01 18:16:00,298 INFO [main] zookeeper.ZooKeeper (Environment.java:logEnv(100)) - Client environment:user.name=Administrator 2014-09-01 18:16:00,298 INFO [main] zookeeper.ZooKeeper (Environment.java:logEnv(100)) - Client environment:user.home=C:\Users\Administrator 2014-09-01 18:16:00,298 INFO [main] zookeeper.ZooKeeper (Environment.java:logEnv(100)) - Client environment:user.dir=E:\workDir\workspace_eclipse\HBase-0.96 2014-09-01 18:16:00,299 INFO [main] zookeeper.ZooKeeper (ZooKeeper.java:<init>(438)) - Initiating client connection, connectString=hadoop2.slave01:2181,hadoop2.master:2181,hadoop2.slave02:2181 sessionTimeout=90000 watcher=hconnection-0xde1f90, quorum=hadoop2.slave01:2181,hadoop2.master:2181,hadoop2.slave02:2181, baseZNode=/hbase 2014-09-01 18:16:00,326 INFO [main] zookeeper.RecoverableZooKeeper (RecoverableZooKeeper.java:<init>(120)) - Process identifier=hconnection-0xde1f90 connecting to ZooKeeper ensemble=hadoop2.slave01:2181,hadoop2.master:2181,hadoop2.slave02:2181 2014-09-01 18:16:00,328 INFO [main-SendThread(hadoop2.slave01:2181)] zookeeper.ClientCnxn (ClientCnxn.java:logStartConnect(966)) - Opening socket connection to server hadoop2.slave01/192.168.100.51:2181. Will not attempt to authenticate using SASL (unknown error) 2014-09-01 18:16:00,329 INFO [main-SendThread(hadoop2.slave01:2181)] zookeeper.ClientCnxn (ClientCnxn.java:primeConnection(849)) - Socket connection established to hadoop2.slave01/192.168.100.51:2181, initiating session 2014-09-01 18:16:00,335 INFO [main-SendThread(hadoop2.slave01:2181)] zookeeper.ClientCnxn (ClientCnxn.java:onConnected(1207)) - Session establishment complete on server hadoop2.slave01/192.168.100.51:2181, sessionid = 0x1482f4c45e2001c, negotiated timeout = 40000 2014-09-01 18:16:00,472 INFO [main] zookeeper.ZooKeeper (ZooKeeper.java:<init>(438)) - Initiating client connection, connectString=hadoop2.slave01:2181,hadoop2.master:2181,hadoop2.slave02:2181 sessionTimeout=90000 watcher=catalogtracker-on-hconnection-0xde1f90, quorum=hadoop2.slave01:2181,hadoop2.master:2181,hadoop2.slave02:2181, baseZNode=/hbase 2014-09-01 18:16:00,473 INFO [main] zookeeper.RecoverableZooKeeper (RecoverableZooKeeper.java:<init>(120)) - Process identifier=catalogtracker-on-hconnection-0xde1f90 connecting to ZooKeeper ensemble=hadoop2.slave01:2181,hadoop2.master:2181,hadoop2.slave02:2181 2014-09-01 18:16:00,474 INFO [main-SendThread(hadoop2.slave01:2181)] zookeeper.ClientCnxn (ClientCnxn.java:logStartConnect(966)) - Opening socket connection to server hadoop2.slave01/192.168.100.51:2181. Will not attempt to authenticate using SASL (unknown error) 2014-09-01 18:16:00,474 INFO [main-SendThread(hadoop2.slave01:2181)] zookeeper.ClientCnxn (ClientCnxn.java:primeConnection(849)) - Socket connection established to hadoop2.slave01/192.168.100.51:2181, initiating session 2014-09-01 18:16:00,478 INFO [main-SendThread(hadoop2.slave01:2181)] zookeeper.ClientCnxn (ClientCnxn.java:onConnected(1207)) - Session establishment complete on server hadoop2.slave01/192.168.100.51:2181, sessionid = 0x1482f4c45e2001d, negotiated timeout = 40000 2014-09-01 18:16:00,499 INFO [main] Configuration.deprecation (Configuration.java:warnOnceIfDeprecated(840)) - hadoop.native.lib is deprecated. Instead, use io.native.lib.available 2014-09-01 18:16:00,817 INFO [main] zookeeper.ZooKeeper (ZooKeeper.java:close(684)) - Session: 0x1482f4c45e2001d closed 2014-09-01 18:16:00,817 INFO [main-EventThread] zookeeper.ClientCnxn (ClientCnxn.java:run(509)) - EventThread shut down 2014-09-01 18:16:01,288 INFO [main] zookeeper.ZooKeeper (ZooKeeper.java:<init>(438)) - Initiating client connection, connectString=hadoop2.slave01:2181,hadoop2.master:2181,hadoop2.slave02:2181 sessionTimeout=90000 watcher=catalogtracker-on-hconnection-0xde1f90, quorum=hadoop2.slave01:2181,hadoop2.master:2181,hadoop2.slave02:2181, baseZNode=/hbase 2014-09-01 18:16:01,290 INFO [main] zookeeper.RecoverableZooKeeper (RecoverableZooKeeper.java:<init>(120)) - Process identifier=catalogtracker-on-hconnection-0xde1f90 connecting to ZooKeeper ensemble=hadoop2.slave01:2181,hadoop2.master:2181,hadoop2.slave02:2181 2014-09-01 18:16:01,290 INFO [main-SendThread(hadoop2.slave01:2181)] zookeeper.ClientCnxn (ClientCnxn.java:logStartConnect(966)) - Opening socket connection to server hadoop2.slave01/192.168.100.51:2181. Will not attempt to authenticate using SASL (unknown error) 2014-09-01 18:16:01,291 INFO [main-SendThread(hadoop2.slave01:2181)] zookeeper.ClientCnxn (ClientCnxn.java:primeConnection(849)) - Socket connection established to hadoop2.slave01/192.168.100.51:2181, initiating session 2014-09-01 18:16:01,294 INFO [main-SendThread(hadoop2.slave01:2181)] zookeeper.ClientCnxn (ClientCnxn.java:onConnected(1207)) - Session establishment complete on server hadoop2.slave01/192.168.100.51:2181, sessionid = 0x1482f4c45e2001e, negotiated timeout = 40000 2014-09-01 18:16:01,304 INFO [main] zookeeper.ZooKeeper (ZooKeeper.java:close(684)) - Session: 0x1482f4c45e2001e closed 2014-09-01 18:16:01,304 INFO [main-EventThread] zookeeper.ClientCnxn (ClientCnxn.java:run(509)) - EventThread shut down
一个简单的for循环,在Opencl中如何实现呢
![图片说明](https://img-ask.csdn.net/upload/201505/30/1432962675_416403.jpg) 例如这样一个,在Opencl的kernel里应该是什么样的呢?
opencv3.0+vs2010中使用cvQueryFrame出现问题!
CvCapture *capture; capture = cvCreateCameraCapture(0); cvNamedWindow("Laplace",0); IplImage *frame; while(1) { frame = cvQueryFrame(capture);//运行到这,出现failed to load opencl //runtime cvShowImage("Laplace",frame); if('a' ==cvWaitKey(10)) break; } cvReleaseCapture(&capture); cvDestroyWindow("Laplace"); return 0;
求解决 tomcat启动失败
我启动tomcat时候![图片说明](https://img-ask.csdn.net/upload/201609/20/1474356096_479216.png) 九月 20, 2016 3:18:03 下午 org.apache.catalina.core.AprLifecycleListener init 信息: The APR based Apache Tomcat Native library which allows optimal performance in production environments was not found on the java.library.path: C:\Program Files\Java\jdk1.7.0_67\bin;C:\WINDOWS\Sun\Java\bin;C:\WINDOWS\system32;C:\WINDOWS;D:\AppServ\php5.3\;C:\Program Files (x86)\Intel\iCLS Client\;C:\Program Files\Intel\iCLS Client\;C:\WINDOWS\system32;C:\WINDOWS;C:\WINDOWS\System32\Wbem;C:\WINDOWS\System32\WindowsPowerShell\v1.0\;C:\Program Files (x86)\Intel\OpenCL SDK\2.0\bin\x86;C:\Program Files (x86)\Intel\OpenCL SDK\2.0\bin\x64;C:\Program Files\Intel\Intel(R) Management Engine Components\DAL;C:\Program Files\Intel\Intel(R) Management Engine Components\IPT;C:\Program Files (x86)\Intel\Intel(R) Management Engine Components\DAL;C:\Program Files (x86)\Intel\Intel(R) Management Engine Components\IPT;D:\Program Files\TortoiseSVN\bin;C:\Program Files\Java\jdk1.7.0_67;D:\apache-maven-3.2.3\bin;D:\activator-1.2.3;d:\AppServ\Apache2.2\bin;d:\AppServ\php5;d:\AppServ\MySQL\bin;C:\Program Files\Java\jdk1.7.0_67;d:\apache-maven-3.3.9\bin;E:\apache-cxf-2.7.11\bin;%USERPROFILE%\AppData\Local\Microsoft\WindowsApps;;. 九月 20, 2016 3:18:03 下午 org.apache.tomcat.util.digester.SetPropertiesRule begin 警告: [SetPropertiesRule]{Server/Service/Engine/Host/Context} Setting property 'source' to 'org.eclipse.jst.jee.server:institutionSimulator-website' did not find a matching property. 九月 20, 2016 3:18:04 下午 org.apache.coyote.AbstractProtocol init 信息: Initializing ProtocolHandler ["http-bio-8080"] 九月 20, 2016 3:18:04 下午 org.apache.coyote.AbstractProtocol init 信息: Initializing ProtocolHandler ["ajp-bio-8009"] 九月 20, 2016 3:18:04 下午 org.apache.catalina.startup.Catalina load 信息: Initialization processed in 466 ms 九月 20, 2016 3:18:04 下午 org.apache.catalina.core.StandardService startInternal 信息: Starting service Catalina 九月 20, 2016 3:18:04 下午 org.apache.catalina.core.StandardEngine startInternal 信息: Starting Servlet Engine: Apache Tomcat/7.0.55 九月 20, 2016 3:18:06 下午 org.apache.catalina.core.ContainerBase startInternal 严重: A child container failed during start java.util.concurrent.ExecutionException: org.apache.catalina.LifecycleException: Failed to start component [StandardEngine[Catalina].StandardHost[localhost].StandardContext[/ccjmu-pay]] at java.util.concurrent.FutureTask.report(FutureTask.java:122) at java.util.concurrent.FutureTask.get(FutureTask.java:188) at org.apache.catalina.core.ContainerBase.startInternal(ContainerBase.java:1123) at org.apache.catalina.core.StandardHost.startInternal(StandardHost.java:816) at org.apache.catalina.util.LifecycleBase.start(LifecycleBase.java:150) at org.apache.catalina.core.ContainerBase$StartChild.call(ContainerBase.java:1575) at org.apache.catalina.core.ContainerBase$StartChild.call(ContainerBase.java:1565) at java.util.concurrent.FutureTask.run(FutureTask.java:262) at java.util.concurrent.ThreadPoolExecutor.runWorker(ThreadPoolExecutor.java:1145) at java.util.concurrent.ThreadPoolExecutor$Worker.run(ThreadPoolExecutor.java:615) at java.lang.Thread.run(Thread.java:745) Caused by: org.apache.catalina.LifecycleException: Failed to start component [StandardEngine[Catalina].StandardHost[localhost].StandardContext[/ccjmu-pay]] at org.apache.catalina.util.LifecycleBase.start(LifecycleBase.java:154) ... 6 more Caused by: java.lang.NoClassDefFoundError: payment/simulator/institution/ccjoin/form/PaymentFrom at java.lang.Class.getDeclaredMethods0(Native Method) at java.lang.Class.privateGetDeclaredMethods(Class.java:2570) at java.lang.Class.getDeclaredMethods(Class.java:1855) at org.apache.catalina.util.Introspection.getDeclaredMethods(Introspection.java:127) at org.apache.catalina.startup.WebAnnotationSet.loadMethodsAnnotation(WebAnnotationSet.java:287) at org.apache.catalina.startup.WebAnnotationSet.loadApplicationServletAnnotations(WebAnnotationSet.java:140) at org.apache.catalina.startup.WebAnnotationSet.loadApplicationAnnotations(WebAnnotationSet.java:65) at org.apache.catalina.startup.ContextConfig.applicationAnnotationsConfig(ContextConfig.java:403) at org.apache.catalina.startup.ContextConfig.configureStart(ContextConfig.java:879) at org.apache.catalina.startup.ContextConfig.lifecycleEvent(ContextConfig.java:374) at org.apache.catalina.util.LifecycleSupport.fireLifecycleEvent(LifecycleSupport.java:117) at org.apache.catalina.util.LifecycleBase.fireLifecycleEvent(LifecycleBase.java:90) at org.apache.catalina.core.StandardContext.startInternal(StandardContext.java:5378) at org.apache.catalina.util.LifecycleBase.start(LifecycleBase.java:150) ... 6 more Caused by: java.lang.ClassNotFoundException: payment.simulator.institution.ccjoin.form.PaymentFrom at org.apache.catalina.loader.WebappClassLoader.loadClass(WebappClassLoader.java:1720) at org.apache.catalina.loader.WebappClassLoader.loadClass(WebappClassLoader.java:1571) ... 20 more 九月 20, 2016 3:18:06 下午 org.apache.catalina.core.ContainerBase startInternal 严重: A child container failed during start java.util.concurrent.ExecutionException: org.apache.catalina.LifecycleException: Failed to start component [StandardEngine[Catalina].StandardHost[localhost]] at java.util.concurrent.FutureTask.report(FutureTask.java:122) at java.util.concurrent.FutureTask.get(FutureTask.java:188) at org.apache.catalina.core.ContainerBase.startInternal(ContainerBase.java:1123) at org.apache.catalina.core.StandardEngine.startInternal(StandardEngine.java:300) at org.apache.catalina.util.LifecycleBase.start(LifecycleBase.java:150) at org.apache.catalina.core.StandardService.startInternal(StandardService.java:443) at org.apache.catalina.util.LifecycleBase.start(LifecycleBase.java:150) at org.apache.catalina.core.StandardServer.startInternal(StandardServer.java:739) at org.apache.catalina.util.LifecycleBase.start(LifecycleBase.java:150) at org.apache.catalina.startup.Catalina.start(Catalina.java:689) at sun.reflect.NativeMethodAccessorImpl.invoke0(Native Method) at sun.reflect.NativeMethodAccessorImpl.invoke(NativeMethodAccessorImpl.java:57) at sun.reflect.DelegatingMethodAccessorImpl.invoke(DelegatingMethodAccessorImpl.java:43) at java.lang.reflect.Method.invoke(Method.java:606) at org.apache.catalina.startup.Bootstrap.start(Bootstrap.java:321) at org.apache.catalina.startup.Bootstrap.main(Bootstrap.java:455) Caused by: org.apache.catalina.LifecycleException: Failed to start component [StandardEngine[Catalina].StandardHost[localhost]] at org.apache.catalina.util.LifecycleBase.start(LifecycleBase.java:154) at org.apache.catalina.core.ContainerBase$StartChild.call(ContainerBase.java:1575) at org.apache.catalina.core.ContainerBase$StartChild.call(ContainerBase.java:1565) at java.util.concurrent.FutureTask.run(FutureTask.java:262) at java.util.concurrent.ThreadPoolExecutor.runWorker(ThreadPoolExecutor.java:1145) at java.util.concurrent.ThreadPoolExecutor$Worker.run(ThreadPoolExecutor.java:615) at java.lang.Thread.run(Thread.java:745) Caused by: org.apache.catalina.LifecycleException: A child container failed during start at org.apache.catalina.core.ContainerBase.startInternal(ContainerBase.java:1131) at org.apache.catalina.core.StandardHost.startInternal(StandardHost.java:816) at org.apache.catalina.util.LifecycleBase.start(LifecycleBase.java:150) ... 6 more 九月 20, 2016 3:18:06 下午 org.apache.catalina.startup.Catalina start 严重: The required Server component failed to start so Tomcat is unable to start. org.apache.catalina.LifecycleException: Failed to start component [StandardServer[8005]] at org.apache.catalina.util.LifecycleBase.start(LifecycleBase.java:154) at org.apache.catalina.startup.Catalina.start(Catalina.java:689) at sun.reflect.NativeMethodAccessorImpl.invoke0(Native Method) at sun.reflect.NativeMethodAccessorImpl.invoke(NativeMethodAccessorImpl.java:57) at sun.reflect.DelegatingMethodAccessorImpl.invoke(DelegatingMethodAccessorImpl.java:43) at java.lang.reflect.Method.invoke(Method.java:606) at org.apache.catalina.startup.Bootstrap.start(Bootstrap.java:321) at org.apache.catalina.startup.Bootstrap.main(Bootstrap.java:455) Caused by: org.apache.catalina.LifecycleException: Failed to start component [StandardService[Catalina]] at org.apache.catalina.util.LifecycleBase.start(LifecycleBase.java:154) at org.apache.catalina.core.StandardServer.startInternal(StandardServer.java:739) at org.apache.catalina.util.LifecycleBase.start(LifecycleBase.java:150) ... 7 more Caused by: org.apache.catalina.LifecycleException: Failed to start component [StandardEngine[Catalina]] at org.apache.catalina.util.LifecycleBase.start(LifecycleBase.java:154) at org.apache.catalina.core.StandardService.startInternal(StandardService.java:443) at org.apache.catalina.util.LifecycleBase.start(LifecycleBase.java:150) ... 9 more Caused by: org.apache.catalina.LifecycleException: A child container failed during start at org.apache.catalina.core.ContainerBase.startInternal(ContainerBase.java:1131) at org.apache.catalina.core.StandardEngine.startInternal(StandardEngine.java:300) at org.apache.catalina.util.LifecycleBase.start(LifecycleBase.java:150) ... 11 more 九月 20, 2016 3:18:06 下午 org.apache.coyote.AbstractProtocol pause 信息: Pausing ProtocolHandler ["http-bio-8080"] 九月 20, 2016 3:18:06 下午 org.apache.coyote.AbstractProtocol pause 信息: Pausing ProtocolHandler ["ajp-bio-8009"] 九月 20, 2016 3:18:06 下午 org.apache.catalina.core.StandardService stopInternal 信息: Stopping service Catalina 九月 20, 2016 3:18:06 下午 org.apache.coyote.AbstractProtocol destroy 信息: Destroying ProtocolHandler ["http-bio-8080"] 九月 20, 2016 3:18:06 下午 org.apache.coyote.AbstractProtocol destroy 信息: Destroying ProtocolHandler ["ajp-bio-8009"]
Java学习的正确打开方式
在博主认为,对于入门级学习java的最佳学习方法莫过于视频+博客+书籍+总结,前三者博主将淋漓尽致地挥毫于这篇博客文章中,至于总结在于个人,实际上越到后面你会发现学习的最好方式就是阅读参考官方文档其次就是国内的书籍,博客次之,这又是一个层次了,这里暂时不提后面再谈。博主将为各位入门java保驾护航,各位只管冲鸭!!!上天是公平的,只要不辜负时间,时间自然不会辜负你。 何谓学习?博主所理解的学习,它
大学四年自学走来,这些私藏的实用工具/学习网站我贡献出来了
大学四年,看课本是不可能一直看课本的了,对于学习,特别是自学,善于搜索网上的一些资源来辅助,还是非常有必要的,下面我就把这几年私藏的各种资源,网站贡献出来给你们。主要有:电子书搜索、实用工具、在线视频学习网站、非视频学习网站、软件下载、面试/求职必备网站。 注意:文中提到的所有资源,文末我都给你整理好了,你们只管拿去,如果觉得不错,转发、分享就是最大的支持了。 一、PDF搜索网站推荐 对于大部
linux系列之常用运维命令整理笔录
本博客记录工作中需要的linux运维命令,大学时候开始接触linux,会一些基本操作,可是都没有整理起来,加上是做开发,不做运维,有些命令忘记了,所以现在整理成博客,当然vi,文件操作等就不介绍了,慢慢积累一些其它拓展的命令,博客不定时更新 顺便拉下票,我在参加csdn博客之星竞选,欢迎投票支持,每个QQ或者微信每天都可以投5票,扫二维码即可,http://m234140.nofollow.ax.
Vue + Spring Boot 项目实战(十四):用户认证方案与完善的访问拦截
本篇文章主要讲解 token、session 等用户认证方案的区别并分析常见误区,以及如何通过前后端的配合实现完善的访问拦截,为下一步权限控制的实现打下基础。
比特币原理详解
一、什么是比特币 比特币是一种电子货币,是一种基于密码学的货币,在2008年11月1日由中本聪发表比特币白皮书,文中提出了一种去中心化的电子记账系统,我们平时的电子现金是银行来记账,因为银行的背后是国家信用。去中心化电子记账系统是参与者共同记账。比特币可以防止主权危机、信用风险。其好处不多做赘述,这一层面介绍的文章很多,本文主要从更深层的技术原理角度进行介绍。 二、问题引入  假设现有4个人
程序员接私活怎样防止做完了不给钱?
首先跟大家说明一点,我们做 IT 类的外包开发,是非标品开发,所以很有可能在开发过程中会有这样那样的需求修改,而这种需求修改很容易造成扯皮,进而影响到费用支付,甚至出现做完了项目收不到钱的情况。 那么,怎么保证自己的薪酬安全呢? 我们在开工前,一定要做好一些证据方面的准备(也就是“讨薪”的理论依据),这其中最重要的就是需求文档和验收标准。一定要让需求方提供这两个文档资料作为开发的基础。之后开发
网页实现一个简单的音乐播放器(大佬别看。(⊙﹏⊙))
今天闲着无事,就想写点东西。然后听了下歌,就打算写个播放器。 于是乎用h5 audio的加上js简单的播放器完工了。 欢迎 改进 留言。 演示地点跳到演示地点 html代码如下`&lt;!DOCTYPE html&gt; &lt;html&gt; &lt;head&gt; &lt;title&gt;music&lt;/title&gt; &lt;meta charset="utf-8"&gt
Python十大装B语法
Python 是一种代表简单思想的语言,其语法相对简单,很容易上手。不过,如果就此小视 Python 语法的精妙和深邃,那就大错特错了。本文精心筛选了最能展现 Python 语法之精妙的十个知识点,并附上详细的实例代码。如能在实战中融会贯通、灵活使用,必将使代码更为精炼、高效,同时也会极大提升代码B格,使之看上去更老练,读起来更优雅。 1. for - else 什么?不是 if 和 else 才
数据库优化 - SQL优化
前面一篇文章从实例的角度进行数据库优化,通过配置一些参数让数据库性能达到最优。但是一些“不好”的SQL也会导致数据库查询变慢,影响业务流程。本文从SQL角度进行数据库优化,提升SQL运行效率。 判断问题SQL 判断SQL是否有问题时可以通过两个表象进行判断: 系统级别表象 CPU消耗严重 IO等待严重 页面响应时间过长
2019年11月中国大陆编程语言排行榜
2019年11月2日,我统计了某招聘网站,获得有效程序员招聘数据9万条。针对招聘信息,提取编程语言关键字,并统计如下: 编程语言比例 rank pl_ percentage 1 java 33.62% 2 c/c++ 16.42% 3 c_sharp 12.82% 4 javascript 12.31% 5 python 7.93% 6 go 7.25% 7
通俗易懂地给女朋友讲:线程池的内部原理
餐厅的约会 餐盘在灯光的照耀下格外晶莹洁白,女朋友拿起红酒杯轻轻地抿了一小口,对我说:“经常听你说线程池,到底线程池到底是个什么原理?”我楞了一下,心里想女朋友今天是怎么了,怎么突然问出这么专业的问题,但做为一个专业人士在女朋友面前也不能露怯啊,想了一下便说:“我先给你讲讲我前同事老王的故事吧!” 大龄程序员老王 老王是一个已经北漂十多年的程序员,岁数大了,加班加不动了,升迁也无望,于是拿着手里
经典算法(5)杨辉三角
写在前面: 我是 扬帆向海,这个昵称来源于我的名字以及女朋友的名字。我热爱技术、热爱开源、热爱编程。技术是开源的、知识是共享的。 这博客是对自己学习的一点点总结及记录,如果您对 Java、算法 感兴趣,可以关注我的动态,我们一起学习。 用知识改变命运,让我们的家人过上更好的生活。 目录一、杨辉三角的介绍二、杨辉三角的算法思想三、代码实现1.第一种写法2.第二种写法 一、杨辉三角的介绍 百度
腾讯算法面试题:64匹马8个跑道需要多少轮才能选出最快的四匹?
昨天,有网友私信我,说去阿里面试,彻底的被打击到了。问了为什么网上大量使用ThreadLocal的源码都会加上private static?他被难住了,因为他从来都没有考虑过这个问题。无独有偶,今天笔者又发现有网友吐槽了一道腾讯的面试题,我们一起来看看。 腾讯算法面试题:64匹马8个跑道需要多少轮才能选出最快的四匹? 在互联网职场论坛,一名程序员发帖求助到。二面腾讯,其中一个算法题:64匹
面试官:你连RESTful都不知道我怎么敢要你?
面试官:了解RESTful吗? 我:听说过。 面试官:那什么是RESTful? 我:就是用起来很规范,挺好的 面试官:是RESTful挺好的,还是自我感觉挺好的 我:都挺好的。 面试官:… 把门关上。 我:… 要干嘛?先关上再说。 面试官:我说出去把门关上。 我:what ?,夺门而去 文章目录01 前言02 RESTful的来源03 RESTful6大原则1. C-S架构2. 无状态3.统一的接
SQL-小白最佳入门sql查询一
一 说明 如果是初学者,建议去网上寻找安装Mysql的文章安装,以及使用navicat连接数据库,以后的示例基本是使用mysql数据库管理系统; 二 准备前提 需要建立一张学生表,列分别是id,名称,年龄,学生信息;本示例中文章篇幅原因SQL注释略; 建表语句: CREATE TABLE `student` ( `id` int(11) NOT NULL AUTO_INCREMENT, `
项目中的if else太多了,该怎么重构?
介绍 最近跟着公司的大佬开发了一款IM系统,类似QQ和微信哈,就是聊天软件。我们有一部分业务逻辑是这样的 if (msgType = "文本") { // dosomething } else if(msgType = "图片") { // doshomething } else if(msgType = "视频") { // doshomething } else { // dosho
漫话:什么是平衡(AVL)树?这应该是把AVL树讲的最好的文章了
这篇文章通过对话的形式,由浅入深带你读懂 AVL 树,看完让你保证理解 AVL 树的各种操作,如果觉得不错,别吝啬你的赞哦。 1、若它的左子树不为空,则左子树上所有的节点值都小于它的根节点值。 2、若它的右子树不为空,则右子树上所有的节点值均大于它的根节点值。 3、它的左右子树也分别可以充当为二叉查找树。 例如: 例如,我现在想要查找数值为14的节点。由于二叉查找树的特性,我们可...
“狗屁不通文章生成器”登顶GitHub热榜,分分钟写出万字形式主义大作
一、垃圾文字生成器介绍 最近在浏览GitHub的时候,发现了这样一个骨骼清奇的雷人项目,而且热度还特别高。 项目中文名:狗屁不通文章生成器 项目英文名:BullshitGenerator 根据作者的介绍,他是偶尔需要一些中文文字用于GUI开发时测试文本渲染,因此开发了这个废话生成器。但由于生成的废话实在是太过富于哲理,所以最近已经被小伙伴们给玩坏了。 他的文风可能是这样的: 你发现,
程序员:我终于知道post和get的区别
IT界知名的程序员曾说:对于那些月薪三万以下,自称IT工程师的码农们,其实我们从来没有把他们归为我们IT工程师的队伍。他们虽然总是以IT工程师自居,但只是他们一厢情愿罢了。 此话一出,不知激起了多少(码农)程序员的愤怒,却又无可奈何,于是码农问程序员。 码农:你知道get和post请求到底有什么区别? 程序员:你看这篇就知道了。 码农:你月薪三万了? 程序员:嗯。 码农:你是怎么做到的? 程序员:
《程序人生》系列-这个程序员只用了20行代码就拿了冠军
你知道的越多,你不知道的越多 点赞再看,养成习惯GitHub上已经开源https://github.com/JavaFamily,有一线大厂面试点脑图,欢迎Star和完善 前言 这一期不算《吊打面试官》系列的,所有没前言我直接开始。 絮叨 本来应该是没有这期的,看过我上期的小伙伴应该是知道的嘛,双十一比较忙嘛,要值班又要去帮忙拍摄年会的视频素材,还得搞个程序员一天的Vlog,还要写BU
开源并不是你认为的那些事
点击上方蓝字 关注我们开源之道导读所以 ————想要理清开源是什么?先要厘清开源不是什么,名正言顺是句中国的古代成语,概念本身的理解非常之重要。大部分生物多样性的起源,...
加快推动区块链技术和产业创新发展,2019可信区块链峰会在京召开
      11月8日,由中国信息通信研究院、中国通信标准化协会、中国互联网协会、可信区块链推进计划联合主办,科技行者协办的2019可信区块链峰会将在北京悠唐皇冠假日酒店开幕。   区块链技术被认为是继蒸汽机、电力、互联网之后,下一代颠覆性的核心技术。如果说蒸汽机释放了人类的生产力,电力解决了人类基本的生活需求,互联网彻底改变了信息传递的方式,区块链作为构造信任的技术有重要的价值。   1
程序员把地府后台管理系统做出来了,还有3.0版本!12月7号最新消息:已在开发中有github地址
第一幕:缘起 听说阎王爷要做个生死簿后台管理系统,我们派去了一个程序员…… 996程序员做的梦: 第一场:团队招募 为了应对地府管理危机,阎王打算找“人”开发一套地府后台管理系统,于是就在地府总经办群中发了项目需求。 话说还是中国电信的信号好,地府都是满格,哈哈!!! 经常会有外行朋友问:看某网站做的不错,功能也简单,你帮忙做一下? 而这次,面对这样的需求,这个程序员
网易云6亿用户音乐推荐算法
网易云音乐是音乐爱好者的集聚地,云音乐推荐系统致力于通过 AI 算法的落地,实现用户千人千面的个性化推荐,为用户带来不一样的听歌体验。 本次分享重点介绍 AI 算法在音乐推荐中的应用实践,以及在算法落地过程中遇到的挑战和解决方案。 将从如下两个部分展开: AI 算法在音乐推荐中的应用 音乐场景下的 AI 思考 从 2013 年 4 月正式上线至今,网易云音乐平台持续提供着:乐屏社区、UGC
【技巧总结】位运算装逼指南
位算法的效率有多快我就不说,不信你可以去用 10 亿个数据模拟一下,今天给大家讲一讲位运算的一些经典例子。不过,最重要的不是看懂了这些例子就好,而是要在以后多去运用位运算这些技巧,当然,采用位运算,也是可以装逼的,不信,你往下看。我会从最简单的讲起,一道比一道难度递增,不过居然是讲技巧,那么也不会太难,相信你分分钟看懂。 判断奇偶数 判断一个数是基于还是偶数,相信很多人都做过,一般的做法的代码如下
《C++ Primer》学习笔记(六):C++模块设计——函数
专栏C++学习笔记 《C++ Primer》学习笔记/习题答案 总目录 https://blog.csdn.net/TeFuirnever/article/details/100700212 —————————————————————————————————————————————————————— 《C++ Primer》习题参考答案:第6章 - C++模块设计——函数 文章目录专栏C+...
8年经验面试官详解 Java 面试秘诀
    作者 | 胡书敏 责编 | 刘静 出品 | CSDN(ID:CSDNnews) 本人目前在一家知名外企担任架构师,而且最近八年来,在多家外企和互联网公司担任Java技术面试官,前后累计面试了有两三百位候选人。在本文里,就将结合本人的面试经验,针对Java初学者、Java初级开发和Java开发,给出若干准备简历和准备面试的建议。   Java程序员准备和投递简历的实
面试官如何考察你的思维方式?
1.两种思维方式在求职面试中,经常会考察这种问题:北京有多少量特斯拉汽车? 某胡同口的煎饼摊一年能卖出多少个煎饼? 深圳有多少个产品经理? 一辆公交车里能装下多少个乒乓球? 一
so easy! 10行代码写个"狗屁不通"文章生成器
前几天,GitHub 有个开源项目特别火,只要输入标题就可以生成一篇长长的文章。背后实现代码一定很复杂吧,里面一定有很多高深莫测的机器学习等复杂算法不过,当我看了源代码之后这程序不到50
知乎高赞:中国有什么拿得出手的开源软件产品?(整理自本人原创回答)
知乎高赞:中国有什么拿得出手的开源软件产品? 在知乎上,有个问题问“中国有什么拿得出手的开源软件产品(在 GitHub 等社区受欢迎度较好的)?” 事实上,还不少呢~ 本人于2019.7.6进行了较为全面的 回答 - Bravo Yeung,获得该问题下回答中得最高赞(236赞和1枚专业勋章),对这些受欢迎的 Github 开源项目分类整理如下: 分布式计算、云平台相关工具类 1.SkyWalk
相关热词 c# 图片上传 c# gdi 占用内存 c#中遍历字典 c#控制台模拟dos c# 斜率 最小二乘法 c#进程延迟 c# mysql完整项目 c# grid 总行数 c# web浏览器插件 c# xml 生成xsd
立即提问