在linux上打包system.img出现错误

显示:浮点数据例外(核心已转储)。并且生成了一个0k的system.img。请问这是怎么回事?

0

1个回答

发生异常了。产生了core dump。

0
Csdn user default icon
上传中...
上传图片
插入图片
抄袭、复制答案,以达到刷声望分或其他目的的行为,在CSDN问答是严格禁止的,一经发现立刻封号。是时候展现真正的技术了!
其他相关推荐
linux mtk system.img 解包 打包
里面有详细的说明,但是亲首次运行要安装linux库文件的。
system.img解包打包
system.img有两种格式:raw和sparse。 $file system.img system.img: data 这说明我的system.img是sparse的。 $simg2img system.img system.raw $file system.raw system.raw: Linux rev 1.0 ext4 filesystem data, UU
system.img 修改工具 for Linux
system.img 修改工具打包,方便其它机友。
打包时出现错误
C:\Users\xuhf60\PycharmProjects\zhanhao>pyinstaller -D tongji.py --hidden-import =pandas._libs.tslibs.np_datetime --hidden-import=pandas._libs.tslibs.nattype --h idden-import=pandas._libs.skiplist ...
entitybean打包出现的错误.
我在用java weblogic.ejbc打包的时候, 出现下面的错误:rnweblogic.utils.AssertionError: ***** ASSERTION FAILED *****[ Deployment Error: jrnava.lang.NoSuchFieldException ]rn at weblogic.ejb20.persistence.CMPBeanDescriptorImpl.(CMPBeanDescrirnptorImpl.java:287)rn at weblogic.ejb20.deployer.MBeanDeploymentInfoImpl.initializeBeanInfos(MrnBeanDeploymentInfoImpl.java:411)rn at weblogic.ejb20.deployer.MBeanDeploymentInfoImpl.(MBeanDeploymenrnrn第一次做entitybean, 还没有摸到头脑呢,那位能指点一下可能是什么样的错误? 谢谢了
py2exe打包出现错误
是这样的,我脚本文件里tkinter使用了两张图片,使用的是绝对路径引入的。现在我要用py2exe打包,打包这两张图片时提示出错。打包的setup.py是这样的:rn#setup.pyrnfrom distutils.core import setuprnimport py2exernrnsetup(windows=["12_13.py"],rn data_files=("img",[r"d:\midas to abaqus\1.gif",rn r"d:\midas to abaqus\2.gif"]))rnrn打包提示错误是:can't copy 'img',doesn't exist or not a regular file
webpack 打包出现的错误
如果出现以下图示的错误,有可能是webpack.config.js文件中引用的文件的地址写错了。 出现这种原因是webpack.config.js文件没有配置好
maven 打包出现的错误
maven 这东西虽好,但每次用的时候总出现乱七八糟的的问题,今天在eclipse 。package 的时候   出现了 maven: 软件包 org.apache.log4j 不存在的错误 org.slf4j slf4j-api 修改为 org.slf4j jcl-over-slf4j ${org.slf4j.version} runtime
打包出现错误。
昨天我在对一个程序进行制作安装程序时,在打包的时候提示457错误,打包未能完成。rn是不是我装的VB6有问题??rn还是别的问题?rn解决后马上结贴!!rn
linux 上打包命令
  实例文件:demo.sql demo2.sql   .tar  解包:tar xvf demo.tar 打包:tar cvf demo.tar demo.sql demo2.sql   .gz 解压1:gunzip demo.gz 解压2:gzip -d demo.gz 压缩:gzip demo.sql   .tar.gz 和 .tgz 解压:tar zxvf ...
proxool移植到linux上出现的错误(2)
proxool和spring加载顺序问题
Qt在Linux上安装时出现的错误
qmake: could not exec ‘/usr/lib/i386-linux-gnu/qt4/bin/qmake’: No such file or directory 1、错误如下图所示:2、解决的办法按网上一般的步骤来,但还是会遇到讲解不清楚的地方输入密码获取权限,进入如下页面:关键在这里,该如何改,我在这磨蹭了好一会不得门道,现将具体方法告知各位像我一样的小白。 3、上一步用到V
ACE在linux上安装一直出现错误
make[1]: Entering directory `/home/coreland/Desktop/ACE_wrappers/apps/gperf'rnrnGNUmakefile: /home/coreland/Desktop/ACE_wrappers/apps/gperf/GNUmakefile.gperf_docs MAKEFLAGS=wrnrnmake[1]: Leaving directory `/home/coreland/Desktop/ACE_wrappers/apps/gperf'rnmake[1]: Entering directory `/home/coreland/Desktop/ACE_wrappers/apps/gperf/src'rnrnGNUmakefile: /home/coreland/Desktop/ACE_wrappers/apps/gperf/src/GNUmakefile.gperf MAKEFLAGS=wrnrnmake[1]: Leaving directory `/home/coreland/Desktop/ACE_wrappers/apps/gperf/src'rnmake[1]: Entering directory `/home/coreland/Desktop/ACE_wrappers/apps/gperf/tests'rnrnGNUmakefile: /home/coreland/Desktop/ACE_wrappers/apps/gperf/tests/GNUmakefile.cppinset MAKEFLAGS=wrnrn../../../bin/ace_gperf -a -D cpp.gperf > cpp.cpprn17 input keysigs have identical hash values, examine output carefully...rnGPERF: Automatically changing to -S1 switch optionrng++ -fvisibility=hidden -fvisibility-inlines-hidden -DACE_GCC_HAS_TEMPLATE_INSTANTIATION_VISIBILITY_ATTRS=1 -O3 -ggdb -pthread -Wall -W -Wpointer-arith -pipe -D_GNU_SOURCE -I/home/coreland/Desktop/ACE_wrappers -D__ACE_INLINE__ -I../../.. -c -o .obj/cpp.o cpp.cpprncpp.cpp:42: 错误:缺少结尾的 " 字符rncpp.cpp:43: 错误:缺少结尾的 " 字符rncpp.cpp:44: 错误:缺少结尾的 " 字符rncpp.cpp:45: 错误:缺少结尾的 " 字符rncpp.cpp:46: 错误:缺少结尾的 " 字符rncpp.cpp:47: 错误:缺少结尾的 " 字符rncpp.cpp:48: 错误:缺少结尾的 " 字符rncpp.cpp:49: 错误:缺少结尾的 " 字符rncpp.cpp:50: 错误:缺少结尾的 " 字符rncpp.cpp:51: 错误:缺少结尾的 " 字符rncpp.cpp:52: 错误:缺少结尾的 " 字符rncpp.cpp:53: 错误:缺少结尾的 " 字符rncpp.cpp:54: 错误:缺少结尾的 " 字符rncpp.cpp:55: 错误:缺少结尾的 " 字符rncpp.cpp:56: 错误:缺少结尾的 " 字符rncpp.cpp:57: 错误:缺少结尾的 " 字符rncpp.cpp:58: 错误:缺少结尾的 " 字符rncpp.cpp:59: 错误:缺少结尾的 " 字符rncpp.cpp:60: 错误:缺少结尾的 " 字符rncpp.cpp:61: 错误:缺少结尾的 " 字符rncpp.cpp:62: 错误:缺少结尾的 " 字符rncpp.cpp:63: 错误:缺少结尾的 " 字符rncpp.cpp:64: 错误:缺少结尾的 " 字符rncpp.cpp:65: 错误:缺少结尾的 " 字符rncpp.cpp:66: 错误:缺少结尾的 " 字符rncpp.cpp:67: 错误:缺少结尾的 " 字符rncpp.cpp:68: 错误:缺少结尾的 " 字符rncpp.cpp:69: 错误:缺少结尾的 " 字符rncpp.cpp:70: 错误:缺少结尾的 " 字符rncpp.cpp:71: 错误:缺少结尾的 " 字符rncpp.cpp:72: 错误:缺少结尾的 " 字符rncpp.cpp:73: 错误:缺少结尾的 " 字符rncpp.cpp:74: 错误:缺少结尾的 " 字符rncpp.cpp:75: 错误:缺少结尾的 " 字符rncpp.cpp:76: 错误:缺少结尾的 " 字符rncpp.cpp:77: 错误:缺少结尾的 " 字符rncpp.cpp:78: 错误:缺少结尾的 " 字符rncpp.cpp:79: 错误:缺少结尾的 " 字符rncpp.cpp:80: 错误:缺少结尾的 " 字符rncpp.cpp:81: 错误:缺少结尾的 " 字符rncpp.cpp:82: 错误:缺少结尾的 " 字符rncpp.cpp:83: 错误:缺少结尾的 " 字符rncpp.cpp:84: 错误:缺少结尾的 " 字符rncpp.cpp:85: 错误:缺少结尾的 " 字符rncpp.cpp:86: 错误:缺少结尾的 " 字符rncpp.cpp:87: 错误:缺少结尾的 " 字符rncpp.cpp:88: 错误:缺少结尾的 " 字符rncpp.cpp:89: 错误:缺少结尾的 " 字符rncpp.cpp:90: 错误:缺少结尾的 " 字符rncpp.cpp:91: 错误:缺少结尾的 " 字符rncpp.cpp:92: 错误:缺少结尾的 " 字符rncpp.cpp:93: 错误:缺少结尾的 " 字符rncpp.cpp:94: 错误:缺少结尾的 " 字符rncpp.cpp:95: 错误:缺少结尾的 " 字符rncpp.cpp:96: 错误:缺少结尾的 " 字符rncpp.cpp:97: 错误:缺少结尾的 " 字符rncpp.cpp:98: 错误:缺少结尾的 " 字符rncpp.cpp:99: 错误:缺少结尾的 " 字符rncpp.cpp:100: 错误:缺少结尾的 " 字符rncpp.cpp:101: 错误:缺少结尾的 " 字符rncpp.cpp:102: 错误:缺少结尾的 " 字符rncpp.cpp:103: 错误:缺少结尾的 " 字符rncpp.cpp:104: 错误:缺少结尾的 " 字符rncpp.cpp:105: 错误:缺少结尾的 " 字符rncpp.cpp:106: 错误:缺少结尾的 " 字符rncpp.cpp:107: 错误:缺少结尾的 " 字符rncpp.cpp:108: 错误:缺少结尾的 " 字符rncpp.cpp:109: 错误:缺少结尾的 " 字符rncpp.cpp:110: 错误:缺少结尾的 " 字符rncpp.cpp:111: 错误:缺少结尾的 " 字符rncpp.cpp:112: 错误:缺少结尾的 " 字符rncpp.cpp:113: 错误:缺少结尾的 " 字符rncpp.cpp:114: 错误:缺少结尾的 " 字符rncpp.cpp:115: 错误:缺少结尾的 " 字符rncpp.cpp:116: 错误:缺少结尾的 " 字符rncpp.cpp:117: 错误:缺少结尾的 " 字符rncpp.cpp:118: 错误:缺少结尾的 " 字符rncpp.cpp:119: 错误:缺少结尾的 " 字符rncpp.cpp:120: 错误:缺少结尾的 " 字符rncpp.cpp:121: 错误:缺少结尾的 " 字符rncpp.cpp:122: 错误:缺少结尾的 " 字符rncpp.cpp:123: 错误:缺少结尾的 " 字符rncpp.cpp:124: 错误:缺少结尾的 " 字符rncpp.cpp:125: 错误:缺少结尾的 " 字符rncpp.cpp:126: 错误:缺少结尾的 " 字符rncpp.cpp:127: 错误:缺少结尾的 " 字符rncpp.cpp:128: 错误:缺少结尾的 " 字符rncpp.cpp:129: 错误:缺少结尾的 " 字符rncpp.cpp:130: 错误:缺少结尾的 " 字符rncpp.cpp:131: 错误:缺少结尾的 " 字符rncpp.cpp:132: 错误:缺少结尾的 " 字符rncpp.cpp:133: 错误:缺少结尾的 " 字符rncpp.cpp:134: 错误:缺少结尾的 " 字符rncpp.cpp:135: 错误:缺少结尾的 " 字符rncpp.cpp:136: 错误:缺少结尾的 " 字符rncpp.cpp:137: 错误:缺少结尾的 " 字符rncpp.cpp:138: 错误:缺少结尾的 " 字符rncpp.cpp:139: 错误:缺少结尾的 " 字符rncpp.cpp:140: 错误:缺少结尾的 " 字符rncpp.cpp:141: 错误:缺少结尾的 " 字符rncpp.cpp:142: 错误:缺少结尾的 " 字符rncpp.cpp:143: 错误:缺少结尾的 " 字符rncpp.cpp:144: 错误:缺少结尾的 " 字符rncpp.cpp:145: 错误:缺少结尾的 " 字符rncpp.cpp:146: 错误:缺少结尾的 " 字符rncpp.cpp:147: 错误:缺少结尾的 " 字符rncpp.cpp:148: 错误:缺少结尾的 " 字符rncpp.cpp:149: 错误:缺少结尾的 " 字符rncpp.cpp:150: 错误:缺少结尾的 " 字符rncpp.cpp:151: 错误:缺少结尾的 " 字符rncpp.cpp:152: 错误:缺少结尾的 " 字符rncpp.cpp:153: 错误:缺少结尾的 " 字符rncpp.cpp:154: 错误:缺少结尾的 " 字符rncpp.cpp:155: 错误:缺少结尾的 " 字符rncpp.cpp:156: 错误:缺少结尾的 " 字符rncpp.cpp:157: 错误:缺少结尾的 " 字符rncpp.cpp:158: 错误:缺少结尾的 " 字符rncpp.cpp:159: 错误:缺少结尾的 " 字符rncpp.cpp:160: 错误:缺少结尾的 " 字符rncpp.cpp:161: 错误:缺少结尾的 " 字符rncpp.cpp:162: 错误:缺少结尾的 " 字符rncpp.cpp:163: 错误:缺少结尾的 " 字符rncpp.cpp:164: 错误:缺少结尾的 " 字符rncpp.cpp:165: 错误:缺少结尾的 " 字符rncpp.cpp:166: 错误:缺少结尾的 " 字符rncpp.cpp:167: 错误:缺少结尾的 " 字符rncpp.cpp:168: 错误:缺少结尾的 " 字符rncpp.cpp:169: 错误:缺少结尾的 " 字符rncpp.cpp:170: 错误:缺少结尾的 " 字符rncpp.cpp:171: 错误:缺少结尾的 " 字符rncpp.cpp:172: 错误:缺少结尾的 " 字符rncpp.cpp:173: 错误:缺少结尾的 " 字符rncpp.cpp:174: 错误:缺少结尾的 " 字符rncpp.cpp:175: 错误:缺少结尾的 " 字符rncpp.cpp:176: 错误:缺少结尾的 " 字符rncpp.cpp:177: 错误:缺少结尾的 " 字符rncpp.cpp:178: 错误:缺少结尾的 " 字符rncpp.cpp:179: 错误:缺少结尾的 " 字符rncpp.cpp:180: 错误:缺少结尾的 " 字符rncpp.cpp:181: 错误:缺少结尾的 " 字符rncpp.cpp:182: 错误:缺少结尾的 " 字符rncpp.cpp:183: 错误:缺少结尾的 " 字符rncpp.cpp:184: 错误:缺少结尾的 " 字符rncpp.cpp:185: 错误:缺少结尾的 " 字符rncpp.cpp:186: 错误:缺少结尾的 " 字符rncpp.cpp:187: 错误:缺少结尾的 " 字符rnmake[1]: *** [.obj/cpp.o] 错误 1rnmake[1]: Leaving directory `/home/coreland/Desktop/ACE_wrappers/apps/gperf/tests'rnmake: *** [cppinset] 错误 2rnrnrnrnmakeACE_wrappers/apps/gperf'下文件总是失败,删除目录下cpp.cpp重新make也失败,libACE.so移动到usr/lib也没用,求大神帮忙解决...rnACE版本6.2.2,linux i386
ACE在linux上make一直出现错误
make[1]: Entering directory `/home/coreland/Desktop/ACE_wrappers/apps/gperf'rnrnGNUmakefile: /home/coreland/Desktop/ACE_wrappers/apps/gperf/GNUmakefile.gperf_docs MAKEFLAGS=wrnrnmake[1]: Leaving directory `/home/coreland/Desktop/ACE_wrappers/apps/gperf'rnmake[1]: Entering directory `/home/coreland/Desktop/ACE_wrappers/apps/gperf/src'rnrnGNUmakefile: /home/coreland/Desktop/ACE_wrappers/apps/gperf/src/GNUmakefile.gperf MAKEFLAGS=wrnrnmake[1]: Leaving directory `/home/coreland/Desktop/ACE_wrappers/apps/gperf/src'rnmake[1]: Entering directory `/home/coreland/Desktop/ACE_wrappers/apps/gperf/tests'rnrnGNUmakefile: /home/coreland/Desktop/ACE_wrappers/apps/gperf/tests/GNUmakefile.cppinset MAKEFLAGS=wrnrn../../../bin/ace_gperf -a -D cpp.gperf > cpp.cpprn17 input keysigs have identical hash values, examine output carefully...rnGPERF: Automatically changing to -S1 switch optionrng++ -fvisibility=hidden -fvisibility-inlines-hidden -DACE_GCC_HAS_TEMPLATE_INSTANTIATION_VISIBILITY_ATTRS=1 -O3 -ggdb -pthread -Wall -W -Wpointer-arith -pipe -D_GNU_SOURCE -I/home/coreland/Desktop/ACE_wrappers -D__ACE_INLINE__ -I../../.. -c -o .obj/cpp.o cpp.cpprncpp.cpp:42: 错误:缺少结尾的 " 字符rncpp.cpp:43: 错误:缺少结尾的 " 字符rncpp.cpp:44: 错误:缺少结尾的 " 字符rncpp.cpp:45: 错误:缺少结尾的 " 字符rncpp.cpp:46: 错误:缺少结尾的 " 字符rncpp.cpp:47: 错误:缺少结尾的 " 字符rncpp.cpp:48: 错误:缺少结尾的 " 字符rncpp.cpp:49: 错误:缺少结尾的 " 字符rncpp.cpp:50: 错误:缺少结尾的 " 字符rncpp.cpp:51: 错误:缺少结尾的 " 字符rncpp.cpp:52: 错误:缺少结尾的 " 字符rncpp.cpp:53: 错误:缺少结尾的 " 字符rncpp.cpp:54: 错误:缺少结尾的 " 字符rncpp.cpp:55: 错误:缺少结尾的 " 字符rncpp.cpp:56: 错误:缺少结尾的 " 字符rncpp.cpp:57: 错误:缺少结尾的 " 字符rncpp.cpp:58: 错误:缺少结尾的 " 字符rncpp.cpp:59: 错误:缺少结尾的 " 字符rncpp.cpp:60: 错误:缺少结尾的 " 字符rncpp.cpp:61: 错误:缺少结尾的 " 字符rncpp.cpp:62: 错误:缺少结尾的 " 字符rncpp.cpp:63: 错误:缺少结尾的 " 字符rncpp.cpp:64: 错误:缺少结尾的 " 字符rncpp.cpp:65: 错误:缺少结尾的 " 字符rncpp.cpp:66: 错误:缺少结尾的 " 字符rncpp.cpp:67: 错误:缺少结尾的 " 字符rncpp.cpp:68: 错误:缺少结尾的 " 字符rncpp.cpp:69: 错误:缺少结尾的 " 字符rncpp.cpp:70: 错误:缺少结尾的 " 字符rncpp.cpp:71: 错误:缺少结尾的 " 字符rncpp.cpp:72: 错误:缺少结尾的 " 字符rncpp.cpp:73: 错误:缺少结尾的 " 字符rncpp.cpp:74: 错误:缺少结尾的 " 字符rncpp.cpp:75: 错误:缺少结尾的 " 字符rncpp.cpp:76: 错误:缺少结尾的 " 字符rncpp.cpp:77: 错误:缺少结尾的 " 字符rncpp.cpp:78: 错误:缺少结尾的 " 字符rncpp.cpp:79: 错误:缺少结尾的 " 字符rncpp.cpp:80: 错误:缺少结尾的 " 字符rncpp.cpp:81: 错误:缺少结尾的 " 字符rncpp.cpp:82: 错误:缺少结尾的 " 字符rncpp.cpp:83: 错误:缺少结尾的 " 字符rncpp.cpp:84: 错误:缺少结尾的 " 字符rncpp.cpp:85: 错误:缺少结尾的 " 字符rncpp.cpp:86: 错误:缺少结尾的 " 字符rncpp.cpp:87: 错误:缺少结尾的 " 字符rncpp.cpp:88: 错误:缺少结尾的 " 字符rncpp.cpp:89: 错误:缺少结尾的 " 字符rncpp.cpp:90: 错误:缺少结尾的 " 字符rncpp.cpp:91: 错误:缺少结尾的 " 字符rncpp.cpp:92: 错误:缺少结尾的 " 字符rncpp.cpp:93: 错误:缺少结尾的 " 字符rncpp.cpp:94: 错误:缺少结尾的 " 字符rncpp.cpp:95: 错误:缺少结尾的 " 字符rncpp.cpp:96: 错误:缺少结尾的 " 字符rncpp.cpp:97: 错误:缺少结尾的 " 字符rncpp.cpp:98: 错误:缺少结尾的 " 字符rncpp.cpp:99: 错误:缺少结尾的 " 字符rncpp.cpp:100: 错误:缺少结尾的 " 字符rncpp.cpp:101: 错误:缺少结尾的 " 字符rncpp.cpp:102: 错误:缺少结尾的 " 字符rncpp.cpp:103: 错误:缺少结尾的 " 字符rncpp.cpp:104: 错误:缺少结尾的 " 字符rncpp.cpp:105: 错误:缺少结尾的 " 字符rncpp.cpp:106: 错误:缺少结尾的 " 字符rncpp.cpp:107: 错误:缺少结尾的 " 字符rncpp.cpp:108: 错误:缺少结尾的 " 字符rncpp.cpp:109: 错误:缺少结尾的 " 字符rncpp.cpp:110: 错误:缺少结尾的 " 字符rncpp.cpp:111: 错误:缺少结尾的 " 字符rncpp.cpp:112: 错误:缺少结尾的 " 字符rncpp.cpp:113: 错误:缺少结尾的 " 字符rncpp.cpp:114: 错误:缺少结尾的 " 字符rncpp.cpp:115: 错误:缺少结尾的 " 字符rncpp.cpp:116: 错误:缺少结尾的 " 字符rncpp.cpp:117: 错误:缺少结尾的 " 字符rncpp.cpp:118: 错误:缺少结尾的 " 字符rncpp.cpp:119: 错误:缺少结尾的 " 字符rncpp.cpp:120: 错误:缺少结尾的 " 字符rncpp.cpp:121: 错误:缺少结尾的 " 字符rncpp.cpp:122: 错误:缺少结尾的 " 字符rncpp.cpp:123: 错误:缺少结尾的 " 字符rncpp.cpp:124: 错误:缺少结尾的 " 字符rncpp.cpp:125: 错误:缺少结尾的 " 字符rncpp.cpp:126: 错误:缺少结尾的 " 字符rncpp.cpp:127: 错误:缺少结尾的 " 字符rncpp.cpp:128: 错误:缺少结尾的 " 字符rncpp.cpp:129: 错误:缺少结尾的 " 字符rncpp.cpp:130: 错误:缺少结尾的 " 字符rncpp.cpp:131: 错误:缺少结尾的 " 字符rncpp.cpp:132: 错误:缺少结尾的 " 字符rncpp.cpp:133: 错误:缺少结尾的 " 字符rncpp.cpp:134: 错误:缺少结尾的 " 字符rncpp.cpp:135: 错误:缺少结尾的 " 字符rncpp.cpp:136: 错误:缺少结尾的 " 字符rncpp.cpp:137: 错误:缺少结尾的 " 字符rncpp.cpp:138: 错误:缺少结尾的 " 字符rncpp.cpp:139: 错误:缺少结尾的 " 字符rncpp.cpp:140: 错误:缺少结尾的 " 字符rncpp.cpp:141: 错误:缺少结尾的 " 字符rncpp.cpp:142: 错误:缺少结尾的 " 字符rncpp.cpp:143: 错误:缺少结尾的 " 字符rncpp.cpp:144: 错误:缺少结尾的 " 字符rncpp.cpp:145: 错误:缺少结尾的 " 字符rncpp.cpp:146: 错误:缺少结尾的 " 字符rncpp.cpp:147: 错误:缺少结尾的 " 字符rncpp.cpp:148: 错误:缺少结尾的 " 字符rncpp.cpp:149: 错误:缺少结尾的 " 字符rncpp.cpp:150: 错误:缺少结尾的 " 字符rncpp.cpp:151: 错误:缺少结尾的 " 字符rncpp.cpp:152: 错误:缺少结尾的 " 字符rncpp.cpp:153: 错误:缺少结尾的 " 字符rncpp.cpp:154: 错误:缺少结尾的 " 字符rncpp.cpp:155: 错误:缺少结尾的 " 字符rncpp.cpp:156: 错误:缺少结尾的 " 字符rncpp.cpp:157: 错误:缺少结尾的 " 字符rncpp.cpp:158: 错误:缺少结尾的 " 字符rncpp.cpp:159: 错误:缺少结尾的 " 字符rncpp.cpp:160: 错误:缺少结尾的 " 字符rncpp.cpp:161: 错误:缺少结尾的 " 字符rncpp.cpp:162: 错误:缺少结尾的 " 字符rncpp.cpp:163: 错误:缺少结尾的 " 字符rncpp.cpp:164: 错误:缺少结尾的 " 字符rncpp.cpp:165: 错误:缺少结尾的 " 字符rncpp.cpp:166: 错误:缺少结尾的 " 字符rncpp.cpp:167: 错误:缺少结尾的 " 字符rncpp.cpp:168: 错误:缺少结尾的 " 字符rncpp.cpp:169: 错误:缺少结尾的 " 字符rncpp.cpp:170: 错误:缺少结尾的 " 字符rncpp.cpp:171: 错误:缺少结尾的 " 字符rncpp.cpp:172: 错误:缺少结尾的 " 字符rncpp.cpp:173: 错误:缺少结尾的 " 字符rncpp.cpp:174: 错误:缺少结尾的 " 字符rncpp.cpp:175: 错误:缺少结尾的 " 字符rncpp.cpp:176: 错误:缺少结尾的 " 字符rncpp.cpp:177: 错误:缺少结尾的 " 字符rncpp.cpp:178: 错误:缺少结尾的 " 字符rncpp.cpp:179: 错误:缺少结尾的 " 字符rncpp.cpp:180: 错误:缺少结尾的 " 字符rncpp.cpp:181: 错误:缺少结尾的 " 字符rncpp.cpp:182: 错误:缺少结尾的 " 字符rncpp.cpp:183: 错误:缺少结尾的 " 字符rncpp.cpp:184: 错误:缺少结尾的 " 字符rncpp.cpp:185: 错误:缺少结尾的 " 字符rncpp.cpp:186: 错误:缺少结尾的 " 字符rncpp.cpp:187: 错误:缺少结尾的 " 字符rnmake[1]: *** [.obj/cpp.o] 错误 1rnmake[1]: Leaving directory `/home/coreland/Desktop/ACE_wrappers/apps/gperf/tests'rnmake: *** [cppinset] 错误 2rnrnrnrnmakeACE_wrappers/apps/gperf'下文件总是失败,删除目录下cpp.cpp重新make也失败,libACE.so移动到usr/lib也没用,求大神帮忙解决...
Linux 上安装 gcc 出现错误
Linux 上安装 gcc 出现错误 如下:rnrn 安装命令:rnrn[root@localhost gcc-4.4.3]# /usr/local/src/gcc-4.4.3/configure --prefix=/usr/local/gcc-4.4.3 --enable-threads=posix --disable-checking --enable--long-long --host=i386-redhat-linux --with-system-zlib --enable-languages=c,c++,javarnrnrnrnrnrn错误提示:rnrnrnconfigure: WARNING: If you wanted to set the --build type, don't use --host.rn If a cross compiler is detected then cross compile mode will be used.rnchecking build system type... i686-pc-linux-gnurnchecking host system type... i386-redhat-linux-gnurnchecking target system type... i386-redhat-linux-gnurnchecking for a BSD-compatible install... /usr/bin/install -crnchecking whether ln works... yesrnchecking whether ln -s works... yesrnchecking for i386-redhat-linux-gcc... nornchecking for gcc... nornchecking for i386-redhat-linux-cc... nornchecking for cc... nornchecking for cc... nornchecking for i386-redhat-linux-cl... nornchecking for cl... nornconfigure: error: in `/usr/local/gcc-4.4.3':rnconfigure: error: no acceptable C compiler found in $PATHrnSee `config.log' for more details.rnrn请大家看看 错误在哪里 谢谢~~
proxool移植到linux上出现的错误(1)
proxool 和spring 在linux下的问题
对刷机包的system.img修改,然后重新打包
HowToModifySystemImage 对刷机包的system.img修改,然后重新打包 资源链接:https://gitee.com/chenjimcom/HowToModifySystemImage 1. 准备工作: 2. 转换源文件为"*.img.ext4"格式 3. 挂载镜像 4. 修改镜像内容 5. 重新打包
android源码编译system.img文件重打包
替换了out/target/product里面system里面的很多文件,本来想make snod重打包img error: ext4_allocate_best_fit_partial: failed to allocate 302 blocks, out of space? error: failed to build out/target/product/generic_x86/system...
vue-cli 打包时出现的错误
building for production...Error processing file: static/css/app.36864bcdcb0e1117ee302ffebb939a36.css(node:15116) UnhandledPromiseRejectionWarning: Unhandled promise rejection (rejection id: 3): postcs...
------------------求助:打包时候出现的错误------------
我是参照http://expert.csdn.net/Expert/topic/1400/1400909.xmlrn进行打包的,不过在执行下面步骤时候出现初错误:rn执行步骤:9.选中你的yousetupname工程,按右键,选中"生成";或在主菜单的"生成"中选中"生成yourSetupFileName";rn错误:rn重新生成的时候还是失败了,不可恢复的生成错误C:\...\WebSetup1.vdprojrnrn将bin目录下的都删除了,重新编译,再打包一次还是同样的错误,大家给看看吧rn谢了rnrn
打包安装时出现的错误
我在制作VB安装程序的时候经常会出现这样的错误,今天它又出现了,很是令我烦恼,很希望各位网友可以帮我解决一下。我的问题是这样的:我在安装程序快要结束的时候就出现这样的错误rn注册文件c:\winnt\system32\msado20.tlb时出错rn不知道其它的网友是否遇到过这类的问题,总之我有许多的朋友和同事都遇到过这样的问题,如果有哪位高手可以帮助解决一下,那本人将万分的感激!!!
android studio 打包出现的错误
Error: Suspicious namespace and prefix combination [NamespaceTypo] when I try create Signed APK解决办法: 也就是说改一下布局文件的xmlns:app="http://schemas.android.com/tools" with this: 改成 xmlns:app="http://schemas.and
AndroidStudio在打包时出现的错误
如果报错:(Unsupported class version number [52.0] (maximum 51.0, Java 1.7)) 说明:主要原因是proguard版本只支持到jdk1.7(java7),而现在使用的是jdk1.8(java8). 解决办法:下载最新的支持jdk1.8的proguard,下载地址:http://proguard.sourceforge.net/
打包出现错误,请指教
cmd下错误:rnF:\test>java -jar Test.jarrnException in thread "main" java.lang.NullPointerExceptionrn at sun.launcher.LauncherHelper.getMainClassFromJar(Unknown Sourcern at sun.launcher.LauncherHelper.checkAndLoadMain(Unknown Source)rnrn原过程:到了第四步java -jar hello.jar就出现上述错误。前三部都可以。。而且在eclipse都能运行rnpublic class HelloWorld rn public static void main(String[] args) rn System.out.println(\"Hello World!\"); rn rn rn2.编译rnjavac HelloWorldrnrn3.打包rn1)新建文件夹,把HelloWorld.java HelloWorld.class复制到该文件夹下rn2)新建 文本文档,在文档中写入rn Manifest-Version: 1.0 rn Created-By: 1.5.0 (Sun Microsystems Inc.) rn Main-Class: HelloWorldrnrn保存为MANIFEST.MFrn3)在dos下进入新建文件夹,使用命令jar cvf hello.jar *.* 打包,如果看到各个文件的压缩比率就是打rnrn包成功rnrn4.运行rn在dos下使用命令java -jar hello.jar运行jar包rnrn
打包后安装出现的错误
rnACTION: DllSelfRegister: "C:\WINNT\System32\etCell.ocx"rnrnACTION: DllSelfRegister: "C:\WINNT\System32\RICHTX32.OCX"rnrnACTION: DllSelfRegister: "C:\WINNT\System32\TABCTL32.OCX"rnrn*** 错误: 由于未找到文件 'C:\DOCUME~1\ADMINI~1.000\LOCALS~1\Temp\msftqws.pdw\$(DLLSelfRegisterEx)',它不能被注册。rn*** 错误: (用户响应 '确定')rnrn*** 错误: 工程1 安装不成功。rn*** 错误: (用户响应 '确定')rnrn当我打包完安装的时候就在错误文档中出现下面的错误提示,不知道是什么原因啊???rnrn我还想问一下,当我在程序中的数据库放在局域网中,而且在程序中的路径也是指向该数据库的,这对我打包和安装应该没有影响吧???
打包后出现错误,急!!!!
在自己机器上运行正常,在别的机器上安装完后出现这个错误rnrn运行时错误‘91’:rn未设置对象或with block变量rnrn请问怎么解决rnrn程序是在win2k操作系统上做的rn测试机器也是win2krn
AndroidStudio打包的时候出现错误
打包的时候出现错误; 在网上查找各种资料后解决,需要在module的build.gradle中添加 lintOptions { checkReleaseBuilds false abortOnError false }放在android下;忽略某些错误,原因不明白;
打包后出现错误,急!!!!!
在自己机器上运行正常,在别的机器上安装完后出现这个错误rnrn运行时错误‘91’:rn未设置对象或with block变量rnrn请问怎么解决rnrn程序是在win2k操作系统上做的rn测试机器也是win2krn
webpack打包时出现的错误
问题是这个样子: 因为git部署代码改变了远程仓库;所以重新克隆了一下git项目,其实不用这么麻烦!‘ 克隆完毕之后npm intall所有依赖和插件! webpack项目的时候出现了问题。报错,webpack has been Installed; 解决: 1,这是因为项目所需要的版本跟安装的版本不同,npm install 默认安装最新版本; 2,卸载nam uninstall n
安装linux出现了错误
unable to align partition properly .this peobably means that another partitianing tool generated an incorrect partition table,because is didnt have the correct BIOS geometry,it is safe to ignore,but igoring may cause(fixable)problems with some boot loaders.rnrn安装linux出现了错误这个是在出现错误时候的提示。。rn 哪位大虾能帮我解决下吗rn 这个是在那个选择 手动分区的时候出现的。。。。。
LINUX突然出现错误
我的LINUX FEDORA9一直好好的,今天突然发现,启动时出现下面的消息,然后就停止在那里,在网上找了很多的方法,但都不尽人意。rnkernel panic-not syncing:IO-APIC+timer doesn't work!kernel panic-not syncing:IO-APIC+timer doesn't work! boot with apic=debug and send a report. then try booting with the 'noapic' option rnrnrn需要注意的是,我的机器一直是好的,使用了大约有三个月了,LINUX也安装了有两个月了一直在上面做QT的开发,没遇到过这种现象。rn请大家帮忙。rn
Linux内核升级出现错误!!
各位大哥rn小弟在Vmware虚拟机下想把redhat9.0下rn内核版本为2.4升级到2.6.20.2rn在编译内核时不幸出现错误rn具体见下描述!!rn rnrn初始内核为:2.4.18.2 rnrn升级如下几个程序: rnrndevice-mapper version 1.01.04 rnLVM2 version 2.01.14 rnmkinitrd version 2.4.27 rnmodutils version 2.4.27 rnmodule-init-tools version 3.2-pre9 rnrn下载内核 rnrnmake mrproper rnmake menuconfig rnrn#make dep rnrn出现如下错误: rnrn[root@localhost linux-2.6.20.2]#make dep rn*** Warning: make dep is unnecessary now. rnrn#make zImage rn出现如下错误: rnBFD: Warning: Writing section '.bss' to huge ( ie nega:ive ) file offset 0xco28f000. rnobjcopy: arch/i386/boot/compressed/vmlinux.bin: File truncated rnrnmake[2]: *** [arch/i386/boot/compressed/vmlinux.bin] Error 1 rnmake[1]: *** [arch/i386/boot/compressed/vmlinux] Error 2 rnmake: *** [zImage] Error 2 rnrnmake rnmake install rnrn*** Missing file: arch/i386/boot/bzImage rn*** You need to run "make" before "make install" rnrnmake[1]: *** [install] Error 1 rnmake: *** [install] Error 2rnrn从网上也找过相关的资料,都没有提到解决的方法!!rn小弟很迷茫!!望各位高人能指点一下!!谢谢!!!rn
linux在解压出现错误
一般我们在linux建立共享文件夹解压时,因为会有软连接问题,可能会在tar -xvf的时候出现错误无法完全解压,并且解压速度很慢。 解决办法:将文件cp复制到linux原生目录底下进行解压即可,并且在这里解压速度很快。 可以看出linux与windows建立共享文件夹还是有一定的缺陷。...
linux启动时出现错误 ??????????????????
用GRUB引导后,出现rn<0>kernel panic:attempted to kill initrn同时键盘的灯不停的闪rnrn
system.img 解压
system.img 解压system.img 解压system.img 解压system.img 解压system.img 解压system.img 解压
linux上打包iso的工具
非常好用的打包工具,rpm包形式意见安装,里面包含各个版本的额按转包
system.img读取
打开system.img文件,读取其中apk及其他资源,试了其他工具都不行,就这个有用
关于打包后的程序在别的机器上用时出现的错误!!
偶在别的机器上,别的都行,就是在打开预揽报表的时候谈出一个form是让偶重新设置服务器名,数据源什么的,但是在自己机器上都米有这种情况,这是怎么回事呢,请大家帮忙
程序打包后在其他电脑上运行出现错误
程序打包后,在自己电脑上安装运行可以。用到其他电脑上就出现错误,错误代码是:rnFile f:/dd/vctools/vc7libs/ship/atlmfc/src/mfc/viewscrl.cpp, Line 385rn这是什么原因?(电脑上没装VC编程软件)
linux最小系统(包括ramdisk-uboot.img system.img zImage)
linux最小系统 (包括ramdisk-uboot.img system.img zImage) 适用于itop4412
相关热词 c#异步发送kafka c#窗体编号 c# 操作二进制文件 c# 反射 机制 c#线程 窗体失去响应 c#角度转弧度 c# 解析gps数据 c# vs设置 语法版本 c# json含回车 c#多线程demo