One or more Filters failed to start.

only use struts,but always show One or more Filters failed to start. how can i solve the problem?

1

4个回答

当我苦苦等待的项目在8天后,收到了一个苹果的的“ Rejected”!太纠结了......太苦逼了......
首先说明,这个项目是有内置购买的。
苹果的反馈信息是:

Missing IAPs

We are unable to complete the review of your app since one or more of your In App Purchases have......
答案就在这里:We are unable to complete the review of your app since one or more of your In App Purchases have not
----------------------Hi,地球人,我是问答机器人小S,上面的内容就是我狂拽酷炫叼炸天的答案,除了赞同,你还有别的选择吗?

0

老外hello,welcome to china

0

Can you show the error message

0

额 为什么提个问还用英文,我可以认为你是在装逼吗?

还有你提问连错误截图也没有,你的配置也没有,别人怎么回答?

-3
Csdn user default icon
上传中...
上传图片
插入图片
抄袭、复制答案,以达到刷声望分或其他目的的行为,在CSDN问答是严格禁止的,一经发现立刻封号。是时候展现真正的技术了!
其他相关推荐
IDEA报错one or more listeners failed to start(五个检查步骤,包圆你)
总结问题,肯定是 vml 配置文件没发布成功 1、看看 web.xml, 把 /* 改成 / 试试 web.xml 里面的标签也是有讲究的, <listener>放最前面 web.xml标签加载顺序:https://www.cnblogs.com/daimajun/p/7411071.html 2、看看 dispatcher-servlet.xml 里面的 <mvc:de...
solr配置 相关问题
  catalina.out中报错 严重: One or more Filters failed to start. Full details will be found in the appropriate container log file 三月 04, 2017 12:52:21 上午 org.apache.catalina.core.StandardContext startIn...
【Tomcat】Tomcat部署Web应用时出现异常
Tomcat部署Web应用时出现异常 IntelliJ IDEA One or more listeners failed to start. java.lang.ClassNotFoundException: org.springframework.web.context.ContextLoaderListener
【报错】Tomcat 能启动但是项目没有部署,One or more listeners failed to start.
tomcat能够启动,但是不能部署项目,仅仅报错如下 ,而且没有相关的log文件。 One or more listeners failed to start. Full details will be found in the appropriate container log file。   解决方案: 在classpath:下新建一个logging.properties文件【cl...
严重: One or more Filters failed to start. Full details will be found in the appro
2017-5-4 0:29:17 org.apache.catalina.startup.HostConfig deployDirectoryrn信息: Deploying web application directory C:\apache-tomcat-7.0.77-windows-x64\apache-tomcat-7.0.77\webapps\ROOTrn2017-5-4 0:29:18 org.apache.catalina.startup.TldConfig executern信息: At least one JAR was scanned for TLDs yet contained no TLDs. Enable debug logging for this logger for a complete list of JARs that were scanned but no TLDs were found in them. Skipping unneeded JARs during scanning can improve startup time and JSP compilation time.rn2017-5-4 0:29:18 org.apache.catalina.startup.HostConfig deployDirectoryrn信息: Deployment of web application directory C:\apache-tomcat-7.0.77-windows-x64\apache-tomcat-7.0.77\webapps\ROOT has finished in 92 msrn2017-5-4 0:29:18 org.apache.catalina.startup.HostConfig deployDirectoryrn信息: Deploying web application directory C:\apache-tomcat-7.0.77-windows-x64\apache-tomcat-7.0.77\webapps\storern2017-5-4 0:29:18 org.apache.catalina.startup.TldConfig executern信息: At least one JAR was scanned for TLDs yet contained no TLDs. Enable debug logging for this logger for a complete list of JARs that were scanned but no TLDs were found in them. Skipping unneeded JARs during scanning can improve startup time and JSP compilation time.rn2017-5-4 0:29:18 org.apache.catalina.core.StandardContext filterStartrn严重: Exception starting filter EncodingFilterrnjava.lang.UnsupportedClassVersionError: com/itheima/web/filter/EncodingFilter : Unsupported major.minor version 51.0 (unable to load class com.itheima.web.filter.EncodingFilter)rn at org.apache.catalina.loader.WebappClassLoaderBase.findClassInternal(WebappClassLoaderBase.java:3209)rn at org.apache.catalina.loader.WebappClassLoaderBase.findClass(WebappClassLoaderBase.java:1373)rn at org.apache.catalina.loader.WebappClassLoaderBase.loadClass(WebappClassLoaderBase.java:1861)rn at org.apache.catalina.loader.WebappClassLoaderBase.loadClass(WebappClassLoaderBase.java:1735)rn at org.apache.catalina.core.DefaultInstanceManager.loadClass(DefaultInstanceManager.java:495)rn at org.apache.catalina.core.DefaultInstanceManager.loadClassMaybePrivileged(DefaultInstanceManager.java:477)rn at org.apache.catalina.core.DefaultInstanceManager.newInstance(DefaultInstanceManager.java:113)rn at org.apache.catalina.core.ApplicationFilterConfig.getFilter(ApplicationFilterConfig.java:258)rn at org.apache.catalina.core.ApplicationFilterConfig.(ApplicationFilterConfig.java:105)rn at org.apache.catalina.core.StandardContext.filterStart(StandardContext.java:4958)rn at org.apache.catalina.core.StandardContext.startInternal(StandardContext.java:5652)rn at org.apache.catalina.util.LifecycleBase.start(LifecycleBase.java:145)rn at org.apache.catalina.core.ContainerBase.addChildInternal(ContainerBase.java:899)rn at org.apache.catalina.core.ContainerBase.addChild(ContainerBase.java:875)rn at org.apache.catalina.core.StandardHost.addChild(StandardHost.java:652)rn at org.apache.catalina.startup.HostConfig.deployDirectory(HostConfig.java:1260)rn at org.apache.catalina.startup.HostConfig$DeployDirectory.run(HostConfig.java:2002)rn at java.util.concurrent.Executors$RunnableAdapter.call(Executors.java:441)rn at java.util.concurrent.FutureTask$Sync.innerRun(FutureTask.java:303)rn at java.util.concurrent.FutureTask.run(FutureTask.java:138)rn at java.util.concurrent.ThreadPoolExecutor$Worker.runTask(ThreadPoolExecutor.java:886)rn at java.util.concurrent.ThreadPoolExecutor$Worker.run(ThreadPoolExecutor.java:908)rn at java.lang.Thread.run(Thread.java:619)rn2017-5-4 0:29:18 org.apache.catalina.core.StandardContext startInternalrn严重: One or more Filters failed to start. Full details will be found in the appropriate container log filern2017-5-4 0:29:18 org.apache.catalina.core.StandardContext startInternalrn严重: Context [/store] startup failed due to previous errorsrn2017-5-4 0:29:18 org.apache.catalina.startup.HostConfig deployDirectoryrn信息: Deployment of web application directory C:\apache-tomcat-7.0.77-windows-x64\apache-tomcat-7.0.77\webapps\store has finished in 449 msrn2017-5-4 0:29:18 org.apache.coyote.AbstractProtocol startrn信息: Starting ProtocolHandler ["http-apr-8080"]rn2017-5-4 0:29:18 org.apache.coyote.AbstractProtocol startrn信息: Starting ProtocolHandler ["ajp-apr-8009"]rn2017-5-4 0:29:18 org.apache.catalina.startup.Catalina startrn信息: Server startup in 7025 ms
记一次SpringBoot 配置文件未生效和war包运行失败one or more listener(filter)。。。
从SVN上扒下来的项目,上传者正常启动正常使用,配置文件port修改为80 但自己本机拿下来以后未生效 还是只能以8080访问  还报了模版解析错误等等...  按如上修改  手动映射一下就可以了 未加载properties是因为未指定resource 打war包成功,但运行报错,说one or more listener的.... 把@WebListener替换成@Componen...
solr启动失败404的原因
我复制了官方文档下面的solr实例 放到 webapps目录下更改端口后启动,发现404 查看tomcat控制台的报出有如下12-Jun-2017 11:03:13.606 信息 [localhost-startStop-1] org.apache.catalina.startup.HostConfig.deployDirectory Deployment of web application d
edas提交论文因字体没有内嵌(fonts are not embedded)被拒接提交
上传Camera-Ready版本的时候,遇到EDAS阻止提交,提示一些字体未嵌入。  Publishers require that PDF font are embedded so that documents can be printed everywhere; one or more of your document fonts are not embedded. 貌似刚开始提交
如何解决 EDAS 上传论文时 PDF fonts 问题
如何解决 EDAS 上传论文时 PDF fonts 问题 问题描述 今天在上传 IEEE xplore 论文时遇到上传字体出错的问题 upload failed: One or more fonts are not embedded. See EDAS FAQ 解决办法 检查字体子集 在 EDAS 上传 Latex 输出的 PDF 文档时,需要检查 PDF 文...
SQL Server中对应默认约束的删除方法
在SQL Server 中,如果给表的一个字段设置了默认值,就会在系统表sysobjects中生成一个默认约束。 如果想删除这个设置了默认值的字段(假设此字段名column1), 执行“ALTER TABLE table1 DROP COLUMN column1”时就会报错: The object 'DF__xxxxxxxxxxx' is dependent on column 'colum
方法 | Elasticsearch Jest 批量操作bug 根因定位排查
1、背景 使用Jest进行批量插入数据的时候,偶尔会出现如下的bug One or more of the items in the Bulk request failed, check BulkResult.getItems() for more information. 起初认为是偶发,就把并发数调小,就再没有关注。 2、出了事了,才找到根因。 当今天调试的时候,把批量...
上传EDAS出现的fonts are not embedded以及各种margin错误的解决办法
往EDAS投论文的过程中,经常会出现各种bug,让我苦不堪言,高兴的是,最后都解决了。 1首先对于各种margin错误的解决办法         首先,这个可能是 你图片或者公式超了 其次,我用了一个包来调整文章的页边距,你先用第一个进行调整,公式或者图片实在改不了了,再用这个包,因为这个包加上去会立马改变全文的页边距, 我的包以及相应页边距的设置为: \usepackage{ge...
EDAS上传字体嵌入问题及解决办法
IEEE会议需要上传PDF格式的稿子,一般的会议不会要求严格,这次在ICCT会议这里着实的郁闷了一把,折腾了半天才发现并解决了问题。word转成PDF后,EDAS网站提示PDF格式错误,我这里分别遇到了两个错误,最后都解决了,希望对大家有帮助。   一、"One or more fonts are not embedded”     这个的意思是这篇PDF里的字体不能全部嵌入,这
hivesql语法经验
在写及测的过程中发现的,有一些可能需要进一步验证。 1 FAILED: NullPointerException null   不能用视图作为left outer join的右表 2 FAILED: UDFArgumentTypeException Only numeric or string type arguments are accepted but decimal is
greenplum常见问题及解决方法
文章目录1、错误:数据库初始化:gpinitsystem -c gpconfigs/gpinitsystem_config -h list2、错误 :执行检查:gpcheck -f list3、错误:gpadmin-[CRITICAL]:-gpstate failed. (Reason='Environment Variable MASTER_DATA_DIRECTORY not set!') e...
android studio 编译的时候出现的错误和解决方法
遇到一个添加一个 1、android()方法找不到了  Gradle sync failed: Gradle DSL method not found: 'android()' 解决方法:删掉android()方法,原因好像是新版的gradle中没有这个方法了 2、Error:Module 'com.github.lecho:hellocharts-library:
Flask-SqlAlchemy 常见问题汇集
使用SQLALCHEMY 出现warning 的问题解决出现错误:D:\Python27\lib\site-packages\flask_sqlalchemy\__init__.py:794: FSADeprecationWarning: SQLALCHEMY_TRACK_MODIFICATIONS adds significant overhead and will be disabled by...
Linux下重新安装MySql后出现'MySQL Daemon failed to start‘解决方法
在 CentOS 6.4上之前安装过Mysql数据库,想升级到较新的版本所以就重新升级了一下数据库。可是重新安装后运行:service mysqld start 重启数据库总是会出现如下提示: MySQL Daemon failed to start.  Starting mysqld: [FAILED] 的提示。如果直接输入 mysql -root -p登陆会出现[mysql]ERROR
SQL2428N 归档日志缺失导致在线备份失败
Issue "SQL2428N  The BACKUP did not complete because one or more of the requested log files could not be retrieved" Solution Excluding the log backup from the database backup is the
WebLogic错误 java.lang.AssertionError: Registered more than one
weblogic日志报如下错误原因及解决方法: WebLogic Server 9.2 Repeatedly Throws: java.lang.AssertionError: Registered more than one instance with the same objectName
MySQL之——提示"mysql deamon failed to start"错误的解决方法
网站突然连接不上数据库,于是直接重启了一下服务器。进到cli模式下,执行 service myqsld start 发现还是提示"mysql deamon failed to start"错误信息 # /etc/init.d/mysqld start MySQL Daemon failed to start. Starting mysqld: [FAILED] 查看mysqld的log文件
Elasticsearch学习笔记(五)批量操作
一次性检索多个文档【多个查询条件】mget 结果中可以看到:第二个文档不存在,但是mget请求返回码是200,即使一个都不存在也是返回200,所以要判断found是否为TRUE来判断是否真正查询出数据。.上面的_index,_type都是同一个,可以将查询简写为:
Jmeter分布式压测布署
Q../jmeter_server 在linux中出现 “Server failed to start: java.rmi.RemoteException:cannot start. linux-lizn is a loopback address. 或者出现 "Server failed to start: java.rmi.RemoteException:cannot start.unable
HiveQL整理总结
下面是一些常用操作的语句,其他的可以去hive官网查看。 grant create to user aaa;//create不需要on database 或者table grant drop on database test to user aaa;//drop需要指定database或者table show grant user datajingdo_m
Android自定义属性需要注意的细节
文章已经迁移到简书, 请移步简书进行查看关于Android自定义属性你可能不知道的细节 关于Android自定义属性网上已经有很多大神都已经详细的讲解过了. 关于如何使用自定义属性大家可以参考 鸿洋_大神的这篇文章Android自定义属性Android 深入理解Android中的自定义属性 , 在此小弟再补充一些在自定义属性时候应该注意的一些细节. 如何定义可被多个自定义控件使用的属性 如何使
Android gradle 构建异常小全(一)
此为开发中,所遇到的gradle 构建异常/错误,仅供参考 Error:Unsupported method: BaseConfig.getApplicationIdSuffix() 导入项目问题,需要更改project 下gradle 工具版本 https://blog.csdn.net/rjc_lihui/article/details/78434864 Unable to find...
centos 搭建K8S集群
1.安装docker-ce 2.yum报错  One of the configured repositories failed (Kubernetes),  and yum doesn't have enough cached data to continue. At this point the only  safe thing yum can do is fail. There are ...
解决本地端口占用问题
近几天启动本地服务器老是提示端口被占用问题,如下所示:Description:The Tomcat connector configured to listen on port 8082 failed to start. The port may already be in use or the connector may be misconfigured.Action:Verify the co...
dubbo rest 服务学习笔记(三)【原创】
在配置过程中遇到两个问题: 1. 报错: object is not an instance of declaring class 这是因为接口类没有暴露方法,导致服务没有实例化 2. 报错:java.lang.RuntimeException: You must use at least one, but no more than one http method annota...
The required Server component failed to start so Tomcat is unable to start问题解决
亲测解决tomcat9.08搭配jkd9,搭建servlet环境。常见问题是,The required Server component failed to start so Tomcat is unable to start。这个问题,直接通过配置eclipse来解决这个问题。
autowire异常的三个情况
Java代码   2010-3-11 16:06:00 net.sf.ehcache.config.ConfigurationFactory parseConfiguration   警告: No configuration found. Configuring ehcache from ehcache-failsafe.xml  found in the classpath: j
关于EF4里的 “关系”删除行为的解释
关于EF4里,对于拥有外键约束的实体,删除操作的行为及解释!(因为是翻墙找到的文章,所以复制过来方便大家查阅。) [ 自己的总结:在master-detail结构的表处理时,例如下面例3的Order-OrderDetail,如果从某一个Order实体的OrderDetail集合
Tomcat启动失败的解决办法
Tomcat启动失败的解决办法Windox7 在win7上已经安装了JDK1.7并设置好了JAVA_HOME,可偏偏Tomcat在启动过程中找不到。报错信息 The JRE_HOME environment variable is not defined correctly This environment variable is needed to run this program 翻译
快速EDAS字体嵌入问题
在用edas向国际会议投稿的时候,往往要检查pdf稿件的格式,例如页边距、行距、字体等。经常碰到的一个问题就是字体未嵌入到文件中。因为大家一般用CTex里面的ps2pdf生成pdf文件,图片中的字往往会导致这个问题的出现。edas上提供了一些解决的方法。这里我给出一种很简单的解决方法(推荐使用这种方法):        1.用acrobat打开不满足要求的pdf文档        2.菜单
one or more multiply defined symbols found终极解决.doc
1.Linker Tools Error LNK1169 one or more multiply defined symbols found The build failed due to multiple definitions of one or more symbols. This error is preceded by error LNK2005. The /FORCE or /FORCE:MULTIPLE option overrides this error. 也就是"在 Project/Setting/Link/General中的 Project Options: 加入 /FORCE:MULTIPLE即可"
调试经验——ORA-01427(单行查询返回多行结果,single-row subquery returns more than one row)的解决办法
问题: 手动向数据库插入一条之前被遗漏的数据时,不小心插入了一条重复数据。导致在随后更新数据库时,出现了ORA-01427(单行查询返回多行结果)错误。 解决方法: 查询出完整结果集,导出到Excel,使用格式化条件标记出重复数据。然后,在数据中删除该重复数据,问题解决。...
项目集成高德地图SDK后出现的错误
项目集成高德地图SDK后出现下面错误:Error:Execution failed for task ':app:transformResourcesWithMergeJavaResForDebug'.> More than one file was found with OS independent path 'assets/map_assets/icons_6_14_1510107235...
mysql安装提示:one more product requirements have not been satisified. Those product
安装mysql的时候提示one more product requirements have not been satisified. Those product。。。。 找不到组件,到已安装程序的目录下查找, 1、缺失C++ 依赖包 去MS下一个,地址:https://support.microsoft.com/en-us/help/3179560/update-for-visual-c-2013-and-visual-c-redistributable-package; 2、最大可能是visual c++ 2013中32位的没安装,附件为32位visual c++ 2013。
Mysql5.7.22 踩坑安装
隔了很久,今天又一次安装mysql,突然发现有点不熟悉了,踩了好多坑终于填好了坑,这里尝试了两种方法进行安装,并且全部安装成功! mysql官网:https://dev.mysql.com/downloads/installer/ 首先是mysql-installer-community-xxxx.msi进行安装,网上有很多博客教程,我觉得还是这篇博客点击打开靠谱。一般情况下直接选择servi...
VC 6.0 写完的程序程编译链接通过后,点运行的时候出现one or more files out of date or not exist
    遇到的问题如题,查找原因,是因为我测试功能的需要改变了PC系统时间(改成了2009年)。然后编译,链接,测试完成以后把系统时间改正回来(2008),进入MFC工程文件夹目录下发现,有几个被我修改过的文件的修改日期为2009-11-13。   原因找到了,问题的解决就变得简单了,把所有日期大于当前系统日期的文件,打开后,添加一个空格,然后保存,即可。
文章热词 设计制作学习 机器学习教程 Objective-C培训 交互设计视频教程 颜色模型
相关热词 mysql关联查询两次本表 native底部 react extjs glyph 图标 one区块链价格 长江师范学院大数据