android studio gradle 报错

我在用android studio导入从GITHUB上下的程序时出现下面的问题
图片说明
并且上面运行的图标是灰色的图片说明
不知道怎么解决了,在这里请教大家了,望赐教

3个回答

项目配置的gradle版本和你的版本不一样,对照自己项目,修改项目根目录下边的build.gradle,和\gradle\wrapper目录下的gradle-wrapper.properties

mxsl_2012
猫啸山林 回复zk5376: 是没有显示app吗?settings.gradle要加进去,要是有app,run是灰色的是编译问题,看log了
接近 4 年之前 回复
zk5376
zk5376 我觉得你说的有道理,我按照这篇文章http://my.oschina.net/lifj/blog/551707面的方法修改之后,gradle不再报错,但是上面的run还是灰色的
接近 4 年之前 回复

今天android studio跑项目,build了一下,始终跑不起,把gradle和android studio都更新了一下,还是不行,
一直报这个错误
UnsupportedMethodException
Failed to set up Android modules in project 'Project': Unsupported method:......
答案就在这里:关于android studio Gradle报错
----------------------你好,人类,我是来自CSDN星球的问答机器人小C,以上是依据我对问题的理解给出的答案,如果解决了你的问题,望采纳。

Csdn user default icon
上传中...
上传图片
插入图片
抄袭、复制答案,以达到刷声望分或其他目的的行为,在CSDN问答是严格禁止的,一经发现立刻封号。是时候展现真正的技术了!
其他相关推荐
androidStudio gradle突然报错 文件上有红色小G的图标,里面的代码全变成自动生成的,请问如何解决?

![图片说明](https://img-ask.csdn.net/upload/201907/25/1564022583_754118.png)

下载新的androidStudio3.6.2的版本后 Gradle下载时提示这个问题,请问是什么原因导致的?如何解决?

ERROR: Unable to resolve dependency for ':titlebar@debug/compileClasspath': Could not download BaseRecyclerViewAdapterHelper.aar (com.github.CymChad:BaseRecyclerViewAdapterHelper:2.9.35): Skipped due to earlier error Show Details Affected Modules: titlebar

eclipse 项目迁移到androidStudio ,gradle运行报错

F:\Program Files\examples\ezviz\app\src\main\java\com\dian\tyisa\main\MainActivity.java Error:(64, 8) 错误: 涉及MainActivity的循环继承 F:\Program Files\examples\ezviz\app\src\main\java\com\dian\tyisa\main\LoginActivity.java Error:(16, 36) 错误: 找不到符号 符号: 类 BaseActivity F:\Program Files\examples\ezviz\app\src\main\java\com\dian\tyisa\main\PushedMessageActivity.java Error:(23, 44) 错误: 找不到符号 符号: 类 BaseActivity F:\Program Files\examples\ezviz\app\src\main\java\com\dian\tyisa\main\RegisterActivity.java Error:(26, 39) 错误: 找不到符号 符号: 类 BaseActivity F:\Program Files\examples\ezviz\app\src\main\java\com\dian\tyisa\mine\AccountActivity.java Error:(34, 38) 错误: 找不到符号 符号: 类 BaseActivity F:\Program Files\examples\ezviz\app\src\main\java\com\dian\tyisa\mine\ModifyPasswordActivity.java Error:(21, 45) 错误: 找不到符号 符号: 类 BaseActivity F:\Program Files\examples\ezviz\app\src\main\java\com\dian\tyisa\mine\PictureActivity.java Error:(27, 38) 错误: 找不到符号 符号: 类 BaseActivity F:\Program Files\examples\ezviz\app\src\main\java\com\dian\tyisa\mine\SeePictures.java Error:(12, 34) 错误: 找不到符号 符号: 类 BaseActivity F:\Program Files\examples\ezviz\app\src\main\java\com\dian\tyisa\mine\ShareActivity.java Error:(8, 36) 错误: 找不到符号 符号: 类 BaseActivity 循环引用是什么意思?为什么找不到BaseActivity

Android Studio 手动搭建LibGDX for Android环境

想用AS开发LibGdx,因为官方自带的Gdx-setup创建的工程实在太难导入,于是自己动手建一个工程。 工程目录如下:![图片说明](https://img-ask.csdn.net/upload/202002/27/1582782883_220472.png) 整个工程的build.gradle ``` // Top-level build file where you can add configuration options common to all sub-projects/modules. buildscript { repositories { google() jcenter() } dependencies { classpath 'com.android.tools.build:gradle:3.6.0' // NOTE: Do not place your application dependencies here; they belong // in the individual module build.gradle files } } allprojects { repositories { google() jcenter() } } task clean(type: Delete) { delete rootProject.buildDir } ``` Android的build.gradle ``` apply plugin: 'com.android.application' android { compileSdkVersion 29 buildToolsVersion "29.0.3" defaultConfig { applicationId "com.end.of.sea" minSdkVersion 21 targetSdkVersion 29 versionCode 1 versionName "1.0" testInstrumentationRunner "androidx.test.runner.AndroidJUnitRunner" } buildTypes { release { minifyEnabled false proguardFiles getDefaultProguardFile('proguard-android-optimize.txt'), 'proguard-rules.pro' } } } dependencies { implementation 'androidx.appcompat:appcompat:1.1.0' implementation 'androidx.constraintlayout:constraintlayout:1.1.3' testImplementation 'junit:junit:4.12' androidTestImplementation 'androidx.test.ext:junit:1.1.1' androidTestImplementation 'androidx.test.espresso:espresso-core:3.2.0' implementation files('libs/gdx-backend-android.jar') implementation project(path: ':gdx-game') } ``` gdx-game ``` apply plugin: 'java-library' dependencies { implementation files('libs/gdx.jar') implementation files('libs/gdx-backend-gwt.jar') implementation files('libs/gdx-backend-lwjgl.jar') implementation files('libs/gdx-backend-lwjgl-natives.jar') implementation files('libs/gdx-natives.jar') implementation files('libs/gdx-freetype.jar') implementation files('libs/gdx-freetype-natives.jar') } sourceCompatibility = "7" targetCompatibility = "7" ``` 如果将MainActivity继承AndroidApplication启动游戏的话,就会出现下面的错误。 ![图片说明](https://img-ask.csdn.net/upload/202002/27/1582783351_533406.png) 网上那些换字体和编码试过都没用。

android studio插件jrebel for android报错

报错信息,请问怎么解决,或者提供思路 ``` :app:processDebugResources FAILED Error:failed to create directory 'C:\Users\Administrator\.jrebel-android\gradle\0\debug\build-dir\WAvatar\app\build\generated\source\r\debug\android\support\v7\appcompat', error: 13 Permission denied. Error:Execution failed for task ':app:processDebugResources'. > Process 'C:\Users\Administrator\.jrebel-android\distributions\2.5.14_20171220124024\bin\win32\aapt2.exe' finished with non-zero exit value 1 ```

android studio 导入本地gradle包出错

网上的方法用了好几个,一直无法解决问题,配置了GRADLE-HOME,Path。就是会报以下错误。希望大神指点一二。是windows8.1系统。 ![图片说明](https://img-ask.csdn.net/upload/201503/11/1426037066_673723.jpg)

关于android studio运行项目报错

我的android studio是新装的,装上之后运行一个新创建的项目就出现这种错误C:\Program Files\Java\jdk1.8.0_05\bin\java.exe'' finished with non-zero exit value 1, 有人说是内存不过,让我build.gradle里面 的javaMaxHeapSize 。可是 我build.gradle这个文件添加代码就是报错,就算把这个写进去也是不行,怎么办呢,刚装的软件就这样了,求大神解答

Andriod Studio 出现Gradle sync failed

Android studio 启动出现Gradle sync failed: Plugin is too old, please update to a more recent version, or set ANDROID_DAILY_OVERRIDE environment variable to "358d78636eb2134e9cd5c11fea4fbdaa703d0ad6" 怎么去更新插件呢?

Android studio 创建项目编译通过后Oncreate显示重构,Activity有几百个报错

Android studio 是最新版本 sdk也是刚下载的 1创建一个新的项目之后,onCreate函数旁边有一个蓝色图标: ![图片说明](https://img-ask.csdn.net/upload/201811/15/1542265066_375349.png) 2然后一路跟上去 ![图片说明](https://img-ask.csdn.net/upload/201811/15/1542265186_122596.png) ![图片说明](https://img-ask.csdn.net/upload/201811/15/1542265210_676111.png) ![图片说明](https://img-ask.csdn.net/upload/201811/15/1542265255_174125.png) ![图片说明](https://img-ask.csdn.net/upload/201811/15/1542265283_535577.png) 3而且只有这个地方有download sources ![图片说明](https://img-ask.csdn.net/upload/201811/15/1542265440_628350.png) 开代理和不开代理点都一样 ![图片说明](https://img-ask.csdn.net/upload/201811/15/1542265541_329852.png) ![图片说明](https://img-ask.csdn.net/upload/201811/15/1542265599_251257.png) 点右上角的disable plugin 和 disable and restart ![图片说明](https://img-ask.csdn.net/upload/201811/15/1542265738_567357.png) 重开之后就会有 ![图片说明](https://img-ask.csdn.net/upload/201811/15/1542265845_850122.png) 重新启动插件又提示restart ![图片说明](https://img-ask.csdn.net/upload/201811/15/1542265987_145500.png) 重开之后,回到第二步的情况。 试过很多种网上的方法,比如删除.gradle ,比如删除.Androidstudio3.2除了config以外的文件,比如删除项目下的ideal 和 .gradle,比如重装androidstudio 和sdk。但是新建一个项目后,编译通过还是这个情况,带带孩子

初次安装android studio,新建项目后gradle失败

![图片说明](https://img-ask.csdn.net/upload/202003/31/1585628598_83298.png) 被这个问题困惑好几天了,因为刚开始学,对这个一点都不了解,不知道问题到底处在哪里,只能在网上找了很多方法,得到的一般结论大概是因为是下载的国外的资源所以下载会慢,甚至失败。因此尝试过翻墙,修改build.gradle改用阿里的库等方法,结果无效。我想是不是我的问题有点特殊呢,但我又看不懂错误提示(无奈),我是实在束手无测了,抱着最后的希望来此提问。

刚安装好android studio 后新建第一个项目报错 Gradle sync failed

android studio 新建项目 Gradle sync failed: The first result from the daemon was empty. Most likely the process died immediately after connection. ![图片说明](https://img-ask.csdn.net/upload/201701/24/1485259415_875463.png) 关闭了杀毒软件,但还是报错; File->Invalidate Caches/Restart仍然出现这样的错误 ![图片说明](https://img-ask.csdn.net/upload/201701/24/1485259599_139647.png) 电脑没有连接任何其他设备 关于gradle的设置和文件是这样的:![图片说明](https://img-ask.csdn.net/upload/201701/24/1485259902_92537.png) ![图片说明](https://img-ask.csdn.net/upload/201701/24/1485259913_196525.png) ![图片说明](https://img-ask.csdn.net/upload/201701/24/1485261039_326185.png) 打开后看到: Caused by: org.gradle.launcher.daemon.client.NoUsableDaemonFoundException: Unable to find a usable idle daemon. I have connected to 100 different daemons but I could not use any of them to run the build. BuildActionParameters were DefaultBuildActionParameters {, currentDir=F:\Android_studio_projects\MyApplication, systemProperties size=91, envVariables size=43, logLevel=LIFECYCLE, daemonUsage=IMPLICITLY_DISABLED, continuous=false, interactive=false, injectedPluginClasspath=[]}.

Android studio报错build failed怎么解决?急,求大神指教

![图片说明](https://img-ask.csdn.net/upload/201901/15/1547525981_815757.jpg) 项目所有代码没有显示错误,但是运行的时候就显示这样 我快奔溃了,大神救救我。。。

android studio 安装完后报错

![图片说明](https://img-ask.csdn.net/upload/201703/08/1488935358_961100.png) 求助,百度出来的都是其他的软件的问题,不是android的问题 Error:Cause: unable to find valid certification path to requested target

新电脑第一次安装Android studio 报错 gradle project

下面是IDEA里的最后一段 ``` 2017-11-22 00:35:54,284 [ thread 14] WARN - ect.sync.idea.ProjectSetUpTask - Failed to find target with hash string 'android-26' in: C:\Users\Lan\AppData\Local\Android\Sdk Consult IDE log for more details (Help | Show Log) 2017-11-22 00:35:54,285 [ thread 14] INFO - e.project.sync.GradleSyncState - Gradle sync failed: Failed to find target with hash string 'android-26' in: C:\Users\Lan\AppData\Local\Android\Sdk Consult IDE log for more details (Help | Show Log) (924ms) 2017-11-22 00:35:54,501 [ thread 18] INFO - #com.jetbrains.cidr.lang - Clearing symbols finished in 0 s. 2017-11-22 00:35:54,524 [ thread 18] INFO - #com.jetbrains.cidr.lang - Loading symbols finished in 0 s. 2017-11-22 00:35:54,529 [ thread 18] INFO - #com.jetbrains.cidr.lang - Building symbols finished in 0 s. 2017-11-22 00:35:54,541 [ thread 18] INFO - #com.jetbrains.cidr.lang - Saving symbols finished in 0 s. 2017-11-22 00:36:14,763 [se-915-b01] INFO - ide.actions.ShowFilePathAction - Exit code 1 ```

AndroidStudio点击运行后报错

Error:Execution failed for task ':app:transformClassesWithJarMergingForDebug'. > com.android.build.api.transform.TransformException: java.util.zip.ZipException: duplicate entry: com/baidu/location/Address$1.class

android studio里配置C++报错?

org.gradle.api.tasks.TaskExecutionException: Execution failed for task ':app:transformNativeLibsWithMergeJniLibsForDebug'. at org.gradle.api.internal.tasks.execution.ExecuteActionsTaskExecuter.executeActions(ExecuteActionsTaskExecuter.java:103) at org.gradle.api.internal.tasks.execution.ExecuteActionsTaskExecuter.execute(ExecuteActionsTaskExecuter.java:73) at org.gradle.api.internal.tasks.execution.OutputDirectoryCreatingTaskExecuter.execute(OutputDirectoryCreatingTaskExecuter.java:51) at org.gradle.api.internal.tasks.execution.SkipUpToDateTaskExecuter.execute(SkipUpToDateTaskExecuter.java:59) at org.gradle.api.internal.tasks.execution.ResolveTaskOutputCachingStateExecuter.execute(ResolveTaskOutputCachingStateExecuter.java:54) at org.gradle.api.internal.tasks.execution.ValidatingTaskExecuter.execute(ValidatingTaskExecuter.java:59) at org.gradle.api.internal.tasks.execution.SkipEmptySourceFilesTaskExecuter.execute(SkipEmptySourceFilesTaskExecuter.java:101) at org.gradle.api.internal.tasks.execution.FinalizeInputFilePropertiesTaskExecuter.execute(FinalizeInputFilePropertiesTaskExecuter.java:44) at org.gradle.api.internal.tasks.execution.CleanupStaleOutputsExecuter.execute(CleanupStaleOutputsExecuter.java:91) at org.gradle.api.internal.tasks.execution.ResolveTaskArtifactStateTaskExecuter.execute(ResolveTaskArtifactStateTaskExecuter.java:62) at org.gradle.api.internal.tasks.execution.SkipTaskWithNoActionsExecuter.execute(SkipTaskWithNoActionsExecuter.java:59) at org.gradle.api.internal.tasks.execution.SkipOnlyIfTaskExecuter.execute(SkipOnlyIfTaskExecuter.java:54) at org.gradle.api.internal.tasks.execution.ExecuteAtMostOnceTaskExecuter.execute(ExecuteAtMostOnceTaskExecuter.java:43) at org.gradle.api.internal.tasks.execution.CatchExceptionTaskExecuter.execute(CatchExceptionTaskExecuter.java:34) at org.gradle.execution.taskgraph.DefaultTaskGraphExecuter$EventFiringTaskWorker$1.run(DefaultTaskGraphExecuter.java:256) at org.gradle.internal.progress.DefaultBuildOperationExecutor$RunnableBuildOperationWorker.execute(DefaultBuildOperationExecutor.java:336) at org.gradle.internal.progress.DefaultBuildOperationExecutor$RunnableBuildOperationWorker.execute(DefaultBuildOperationExecutor.java:328) at org.gradle.internal.progress.DefaultBuildOperationExecutor.execute(DefaultBuildOperationExecutor.java:199) at org.gradle.internal.progress.DefaultBuildOperationExecutor.run(DefaultBuildOperationExecutor.java:110) at org.gradle.execution.taskgraph.DefaultTaskGraphExecuter$EventFiringTaskWorker.execute(DefaultTaskGraphExecuter.java:249) at org.gradle.execution.taskgraph.DefaultTaskGraphExecuter$EventFiringTaskWorker.execute(DefaultTaskGraphExecuter.java:238) at org.gradle.execution.taskgraph.DefaultTaskPlanExecutor$TaskExecutorWorker.processTask(DefaultTaskPlanExecutor.java:123) at org.gradle.execution.taskgraph.DefaultTaskPlanExecutor$TaskExecutorWorker.access$200(DefaultTaskPlanExecutor.java:79) at org.gradle.execution.taskgraph.DefaultTaskPlanExecutor$TaskExecutorWorker$1.execute(DefaultTaskPlanExecutor.java:104) at org.gradle.execution.taskgraph.DefaultTaskPlanExecutor$TaskExecutorWorker$1.execute(DefaultTaskPlanExecutor.java:98) at org.gradle.execution.taskgraph.DefaultTaskExecutionPlan.execute(DefaultTaskExecutionPlan.java:663) at org.gradle.execution.taskgraph.DefaultTaskExecutionPlan.executeWithTask(DefaultTaskExecutionPlan.java:597) at org.gradle.execution.taskgraph.DefaultTaskPlanExecutor$TaskExecutorWorker.run(DefaultTaskPlanExecutor.java:98) at org.gradle.internal.concurrent.ExecutorPolicy$CatchAndRecordFailures.onExecute(ExecutorPolicy.java:63) at org.gradle.internal.concurrent.ManagedExecutorImpl$1.run(ManagedExecutorImpl.java:46) at java.util.concurrent.ThreadPoolExecutor.runWorker(ThreadPoolExecutor.java:1142) at java.util.concurrent.ThreadPoolExecutor$Worker.run(ThreadPoolExecutor.java:617) at org.gradle.internal.concurrent.ThreadFactoryImpl$ManagedThreadRunnable.run(ThreadFactoryImpl.java:55) at java.lang.Thread.run(Thread.java:745) Caused by: java.io.UncheckedIOException: java.nio.file.AccessDeniedException: C:\WINDOWS\Temp at com.android.builder.merge.LazyIncrementalFileMergerInputs.load(LazyIncrementalFileMergerInputs.java:88) at com.android.builder.merge.LazyIncrementalFileMergerInputs.lambda$fromNew$0(LazyIncrementalFileMergerInputs.java:59) at com.android.tools.build.apkzlib.utils.CachedSupplier.get(CachedSupplier.java:72) at com.android.builder.merge.LazyIncrementalFileMergerInput.lambda$new$2(LazyIncrementalFileMergerInput.java:138) at com.android.tools.build.apkzlib.utils.CachedSupplier.get(CachedSupplier.java:72) at com.android.builder.merge.LazyIncrementalFileMergerInput.open(LazyIncrementalFileMergerInput.java:225) at com.android.builder.merge.DelegateIncrementalFileMergerInput.open(DelegateIncrementalFileMergerInput.java:49) at com.google.common.collect.ImmutableList.forEach(ImmutableList.java:406) at com.android.builder.merge.IncrementalFileMerger.merge(IncrementalFileMerger.java:73) at com.android.build.gradle.internal.transforms.MergeJavaResourcesTransform.transform(MergeJavaResourcesTransform.java:411) at com.android.build.gradle.internal.pipeline.TransformTask$2.call(TransformTask.java:239) at com.android.build.gradle.internal.pipeline.TransformTask$2.call(TransformTask.java:235) at com.android.builder.profile.ThreadRecorder.record(ThreadRecorder.java:102) at com.android.build.gradle.internal.pipeline.TransformTask.transform(TransformTask.java:230) at sun.reflect.NativeMethodAccessorImpl.invoke0(Native Method) at sun.reflect.NativeMethodAccessorImpl.invoke(NativeMethodAccessorImpl.java:62) at sun.reflect.DelegatingMethodAccessorImpl.invoke(DelegatingMethodAccessorImpl.java:43) at java.lang.reflect.Method.invoke(Method.java:498) at org.gradle.internal.reflect.JavaMethod.invoke(JavaMethod.java:73) at org.gradle.api.internal.project.taskfactory.IncrementalTaskAction.doExecute(IncrementalTaskAction.java:50) at org.gradle.api.internal.project.taskfactory.StandardTaskAction.execute(StandardTaskAction.java:39) at org.gradle.api.internal.project.taskfactory.StandardTaskAction.execute(StandardTaskAction.java:26) at org.gradle.api.internal.tasks.execution.ExecuteActionsTaskExecuter$1.run(ExecuteActionsTaskExecuter.java:124) at org.gradle.internal.progress.DefaultBuildOperationExecutor$RunnableBuildOperationWorker.execute(DefaultBuildOperationExecutor.java:336) at org.gradle.internal.progress.DefaultBuildOperationExecutor$RunnableBuildOperationWorker.execute(DefaultBuildOperationExecutor.java:328) at org.gradle.internal.progress.DefaultBuildOperationExecutor.execute(DefaultBuildOperationExecutor.java:199) at org.gradle.internal.progress.DefaultBuildOperationExecutor.run(DefaultBuildOperationExecutor.java:110) at org.gradle.api.internal.tasks.execution.ExecuteActionsTaskExecuter.executeAction(ExecuteActionsTaskExecuter.java:113) at org.gradle.api.internal.tasks.execution.ExecuteActionsTaskExecuter.executeActions(ExecuteActionsTaskExecuter.java:95) ... 33 more Caused by: java.nio.file.AccessDeniedException: C:\WINDOWS\Temp at sun.nio.fs.WindowsException.translateToIOException(WindowsException.java:83) at sun.nio.fs.WindowsException.rethrowAsIOException(WindowsException.java:97) at sun.nio.fs.WindowsException.rethrowAsIOException(WindowsException.java:102) at sun.nio.fs.WindowsDirectoryStream.<init>(WindowsDirectoryStream.java:86) at sun.nio.fs.WindowsFileSystemProvider.newDirectoryStream(WindowsFileSystemProvider.java:518) at java.nio.file.Files.newDirectoryStream(Files.java:457) at com.google.common.io.MoreFiles.deleteRecursively(MoreFiles.java:516) at com.android.tools.build.apkzlib.bytestorage.TemporaryFile.deleteFile(TemporaryFile.java:57) at com.android.tools.build.apkzlib.bytestorage.TemporaryFile.close(TemporaryFile.java:48) at com.android.tools.build.apkzlib.bytestorage.TemporaryDirectory$1.close(TemporaryDirectory.java:50) at com.android.tools.build.apkzlib.bytestorage.TemporaryDirectoryStorage.close(TemporaryDirectoryStorage.java:101) at com.android.tools.build.apkzlib.bytestorage.OverflowToDiskByteStorage.close(OverflowToDiskByteStorage.java:167) at com.android.tools.build.apkzlib.bytestorage.ChunkBasedByteStorage.close(ChunkBasedByteStorage.java:142) at com.android.tools.build.apkzlib.zip.ZFile.close(ZFile.java:1210) at com.android.builder.files.RelativeFiles.fromZip(RelativeFiles.java:125) at com.android.builder.merge.LazyIncrementalFileMergerInputs.load(LazyIncrementalFileMergerInputs.java:86) ... 61 more

Android Studio打包apk报错

打包后报错: Error:(4, 5) No resource found that matches the given name: attr 'colorAccent'. Error:(4, 5) No resource found that matches the given name: attr 'colorPrimary'. Error:(4, 5) No resource found that matches the given name: attr 'colorPrimaryDark'. Error:Execution failed for task ':processDebugResources'. > com.android.ide.common.process.ProcessException: org.gradle.process.internal.ExecException: Process 'command 'D:\ADT\sdk\build-tools\26.0.0\aapt.exe'' finished with non-zero exit value 1 之前修改了style标签的parent,还是不行。原代码: ``` <style name="AppTheme" parent="Theme.AppCompat.Light.DarkActionBar"> <!-- Customize your theme here. --> <item name="colorPrimary">@color/colorPrimary</item> <item name="colorPrimaryDark">@color/colorPrimaryDark</item> <item name="colorAccent">@color/colorAccent</item> </style> ``` 丢改后: ![图片说明](https://img-ask.csdn.net/upload/201706/30/1498795064_254806.png) ![图片说明](https://img-ask.csdn.net/upload/201706/30/1498795083_743548.png)

Android studio R文件丢失,有两个报错

Execution failed for task ':app:mergeDebugResources'. > Error: org.gradle.process.internal.ExecException: A problem occurred starting process 'command '/opt/sdk/build-tools/19.1.0/aapt'' Error:Execution failed for task ':app:mergeDebugResources'. > Error: org.gradle.process.internal.ExecException: A problem occurred starting process 'command '/opt/sdk/build-tools/19.1.0/aapt'' 我用的是1.5版本的android studio ,出现这样的问题我应该怎么修复他

Android Studio编译程序报错

Android Studio今天突然在编译项目的时候报错,以下是报错的信息: ``` Information:Gradle tasks [:app:generateDebugSources, :app:mockableAndroidJar, :app:prepareDebugUnitTestDependencies, :app:generateDebugAndroidTestSources, :easelibrary:generateDebugSources, :easelibrary:generateDebugAndroidTestSources, :easelibrary:mockableAndroidJar, :easelibrary:prepareDebugUnitTestDependencies, :easeui:generateDebugSources, :easeui:generateDebugAndroidTestSources, :easeui:mockableAndroidJar, :easeui:prepareDebugUnitTestDependencies, :http:generateDebugSources, :http:generateDebugAndroidTestSources, :http:mockableAndroidJar, :http:prepareDebugUnitTestDependencies, :more:generateDebugSources, :more:generateDebugAndroidTestSources, :more:mockableAndroidJar, :more:prepareDebugUnitTestDependencies] Error:Execution failed for task ':app:processDebugManifest'. > Manifest merger failed with multiple errors, see logs ``` 工程结构如下图: ![图片说明](https://img-ask.csdn.net/upload/201702/14/1487063530_210021.png) build.gradle中的信息如下:其中主工程的targetSdkVersion是19,其他的是23. ![图片说明](https://img-ask.csdn.net/upload/201702/14/1487063660_15074.png) 有没有遇到此类问题的朋友,该如何解决呢?

大学四年自学走来,这些私藏的实用工具/学习网站我贡献出来了

大学四年,看课本是不可能一直看课本的了,对于学习,特别是自学,善于搜索网上的一些资源来辅助,还是非常有必要的,下面我就把这几年私藏的各种资源,网站贡献出来给你们。主要有:电子书搜索、实用工具、在线视频学习网站、非视频学习网站、软件下载、面试/求职必备网站。 注意:文中提到的所有资源,文末我都给你整理好了,你们只管拿去,如果觉得不错,转发、分享就是最大的支持了。 一、电子书搜索 对于大部分程序员...

在中国程序员是青春饭吗?

今年,我也32了 ,为了不给大家误导,咨询了猎头、圈内好友,以及年过35岁的几位老程序员……舍了老脸去揭人家伤疤……希望能给大家以帮助,记得帮我点赞哦。 目录: 你以为的人生 一次又一次的伤害 猎头界的真相 如何应对互联网行业的「中年危机」 一、你以为的人生 刚入行时,拿着傲人的工资,想着好好干,以为我们的人生是这样的: 等真到了那一天,你会发现,你的人生很可能是这样的: ...

程序员请照顾好自己,周末病魔差点一套带走我。

程序员在一个周末的时间,得了重病,差点当场去世,还好及时挽救回来了。

技术大佬:我去,你写的 switch 语句也太老土了吧

昨天早上通过远程的方式 review 了两名新来同事的代码,大部分代码都写得很漂亮,严谨的同时注释也很到位,这令我非常满意。但当我看到他们当中有一个人写的 switch 语句时,还是忍不住破口大骂:“我擦,小王,你丫写的 switch 语句也太老土了吧!” 来看看小王写的代码吧,看完不要骂我装逼啊。 private static String createPlayer(PlayerTypes p...

和黑客斗争的 6 天!

互联网公司工作,很难避免不和黑客们打交道,我呆过的两家互联网公司,几乎每月每天每分钟都有黑客在公司网站上扫描。有的是寻找 Sql 注入的缺口,有的是寻找线上服务器可能存在的漏洞,大部分都...

点沙成金:英特尔芯片制造全过程揭密

“亚马逊丛林里的蝴蝶扇动几下翅膀就可能引起两周后美国德州的一次飓风……” 这句人人皆知的话最初用来描述非线性系统中微小参数的变化所引起的系统极大变化。 而在更长的时间尺度内,我们所生活的这个世界就是这样一个异常复杂的非线性系统…… 水泥、穹顶、透视——关于时间与技艺的蝴蝶效应 公元前3000年,古埃及人将尼罗河中挖出的泥浆与纳特龙盐湖中的矿物盐混合,再掺入煅烧石灰石制成的石灰,由此得来了人...

讲一个程序员如何副业月赚三万的真实故事

loonggg读完需要3分钟速读仅需 1 分钟大家好,我是你们的校长。我之前讲过,这年头,只要肯动脑,肯行动,程序员凭借自己的技术,赚钱的方式还是有很多种的。仅仅靠在公司出卖自己的劳动时...

上班一个月,后悔当初着急入职的选择了

最近有个老铁,告诉我说,上班一个月,后悔当初着急入职现在公司了。他之前在美图做手机研发,今年美图那边今年也有一波组织优化调整,他是其中一个,在协商离职后,当时捉急找工作上班,因为有房贷供着,不能没有收入来源。所以匆忙选了一家公司,实际上是一个大型外包公司,主要派遣给其他手机厂商做外包项目。**当时承诺待遇还不错,所以就立马入职去上班了。但是后面入职后,发现薪酬待遇这块并不是HR所说那样,那个HR自...

女程序员,为什么比男程序员少???

昨天看到一档综艺节目,讨论了两个话题:(1)中国学生的数学成绩,平均下来看,会比国外好?为什么?(2)男生的数学成绩,平均下来看,会比女生好?为什么?同时,我又联想到了一个技术圈经常讨...

副业收入是我做程序媛的3倍,工作外的B面人生是怎样的?

提到“程序员”,多数人脑海里首先想到的大约是:为人木讷、薪水超高、工作枯燥…… 然而,当离开工作岗位,撕去层层标签,脱下“程序员”这身外套,有的人生动又有趣,马上展现出了完全不同的A/B面人生! 不论是简单的爱好,还是正经的副业,他们都干得同样出色。偶尔,还能和程序员的特质结合,产生奇妙的“化学反应”。 @Charlotte:平日素颜示人,周末美妆博主 大家都以为程序媛也个个不修边幅,但我们也许...

MySQL数据库面试题(2020最新版)

文章目录数据库基础知识为什么要使用数据库什么是SQL?什么是MySQL?数据库三大范式是什么mysql有关权限的表都有哪几个MySQL的binlog有有几种录入格式?分别有什么区别?数据类型mysql有哪些数据类型引擎MySQL存储引擎MyISAM与InnoDB区别MyISAM索引与InnoDB索引的区别?InnoDB引擎的4大特性存储引擎选择索引什么是索引?索引有哪些优缺点?索引使用场景(重点)...

如果你是老板,你会不会踢了这样的员工?

有个好朋友ZS,是技术总监,昨天问我:“有一个老下属,跟了我很多年,做事勤勤恳恳,主动性也很好。但随着公司的发展,他的进步速度,跟不上团队的步伐了,有点...

我入职阿里后,才知道原来简历这么写

私下里,有不少读者问我:“二哥,如何才能写出一份专业的技术简历呢?我总感觉自己写的简历太烂了,所以投了无数份,都石沉大海了。”说实话,我自己好多年没有写过简历了,但我认识的一个同行,他在阿里,给我说了一些他当年写简历的方法论,我感觉太牛逼了,实在是忍不住,就分享了出来,希望能够帮助到你。 01、简历的本质 作为简历的撰写者,你必须要搞清楚一点,简历的本质是什么,它就是为了来销售你的价值主张的。往深...

我说我不会算法,阿里把我挂了。

不说了,字节跳动也反手把我挂了。

优雅的替换if-else语句

场景 日常开发,if-else语句写的不少吧??当逻辑分支非常多的时候,if-else套了一层又一层,虽然业务功能倒是实现了,但是看起来是真的很不优雅,尤其是对于我这种有强迫症的程序"猿",看到这么多if-else,脑袋瓜子就嗡嗡的,总想着解锁新姿势:干掉过多的if-else!!!本文将介绍三板斧手段: 优先判断条件,条件不满足的,逻辑及时中断返回; 采用策略模式+工厂模式; 结合注解,锦...

离职半年了,老东家又发 offer,回不回?

有小伙伴问松哥这个问题,他在上海某公司,在离职了几个月后,前公司的领导联系到他,希望他能够返聘回去,他很纠结要不要回去? 俗话说好马不吃回头草,但是这个小伙伴既然感到纠结了,我觉得至少说明了两个问题:1.曾经的公司还不错;2.现在的日子也不是很如意。否则应该就不会纠结了。 老实说,松哥之前也有过类似的经历,今天就来和小伙伴们聊聊回头草到底吃不吃。 首先一个基本观点,就是离职了也没必要和老东家弄的苦...

为什么你不想学习?只想玩?人是如何一步一步废掉的

不知道是不是只有我这样子,还是你们也有过类似的经历。 上学的时候总有很多光辉历史,学年名列前茅,或者单科目大佬,但是虽然慢慢地长大了,你开始懈怠了,开始废掉了。。。 什么?你说不知道具体的情况是怎么样的? 我来告诉你: 你常常潜意识里或者心理觉得,自己真正的生活或者奋斗还没有开始。总是幻想着自己还拥有大把时间,还有无限的可能,自己还能逆风翻盘,只不是自己还没开始罢了,自己以后肯定会变得特别厉害...

男生更看重女生的身材脸蛋,还是思想?

往往,我们看不进去大段大段的逻辑。深刻的哲理,往往短而精悍,一阵见血。问:产品经理挺漂亮的,有点心动,但不知道合不合得来。男生更看重女生的身材脸蛋,还是...

为什么程序员做外包会被瞧不起?

二哥,有个事想询问下您的意见,您觉得应届生值得去外包吗?公司虽然挺大的,中xx,但待遇感觉挺低,马上要报到,挺纠结的。

当HR压你价,说你只值7K,你该怎么回答?

当HR压你价,说你只值7K时,你可以流畅地回答,记住,是流畅,不能犹豫。 礼貌地说:“7K是吗?了解了。嗯~其实我对贵司的面试官印象很好。只不过,现在我的手头上已经有一份11K的offer。来面试,主要也是自己对贵司挺有兴趣的,所以过来看看……”(未完) 这段话主要是陪HR互诈的同时,从公司兴趣,公司职员印象上,都给予对方正面的肯定,既能提升HR的好感度,又能让谈判气氛融洽,为后面的发挥留足空间。...

面试:第十六章:Java中级开发(16k)

HashMap底层实现原理,红黑树,B+树,B树的结构原理 Spring的AOP和IOC是什么?它们常见的使用场景有哪些?Spring事务,事务的属性,传播行为,数据库隔离级别 Spring和SpringMVC,MyBatis以及SpringBoot的注解分别有哪些?SpringMVC的工作原理,SpringBoot框架的优点,MyBatis框架的优点 SpringCould组件有哪些,他们...

面试阿里p7,被按在地上摩擦,鬼知道我经历了什么?

面试阿里p7被问到的问题(当时我只知道第一个):@Conditional是做什么的?@Conditional多个条件是什么逻辑关系?条件判断在什么时候执...

你打算用Java 8一辈子都不打算升级到Java 14,真香

我们程序员应该抱着尝鲜、猎奇的心态,否则就容易固步自封,技术停滞不前。

无代码时代来临,程序员如何保住饭碗?

编程语言层出不穷,从最初的机器语言到如今2500种以上的高级语言,程序员们大呼“学到头秃”。程序员一边面临编程语言不断推陈出新,一边面临由于许多代码已存在,程序员编写新应用程序时存在重复“搬砖”的现象。 无代码/低代码编程应运而生。无代码/低代码是一种创建应用的方法,它可以让开发者使用最少的编码知识来快速开发应用程序。开发者通过图形界面中,可视化建模来组装和配置应用程序。这样一来,开发者直...

面试了一个 31 岁程序员,让我有所触动,30岁以上的程序员该何去何从?

最近面试了一个31岁8年经验的程序猿,让我有点感慨,大龄程序猿该何去何从。

大三实习生,字节跳动面经分享,已拿Offer

说实话,自己的算法,我一个不会,太难了吧

程序员垃圾简历长什么样?

已经连续五年参加大厂校招、社招的技术面试工作,简历看的不下于万份 这篇文章会用实例告诉你,什么是差的程序员简历! 疫情快要结束了,各个公司也都开始春招了,作为即将红遍大江南北的新晋UP主,那当然要为小伙伴们做点事(手动狗头)。 就在公众号里公开征简历,义务帮大家看,并一一点评。《启舰:春招在即,义务帮大家看看简历吧》 一石激起千层浪,三天收到两百多封简历。 花光了两个星期的所有空闲时...

《经典算法案例》01-08:如何使用质数设计扫雷(Minesweeper)游戏

我们都玩过Windows操作系统中的经典游戏扫雷(Minesweeper),如果把质数当作一颗雷,那么,表格中红色的数字哪些是雷(质数)?您能找出多少个呢?文中用列表的方式罗列了10000以内的自然数、质数(素数),6的倍数等,方便大家观察质数的分布规律及特性,以便对算法求解有指导意义。另外,判断质数是初学算法,理解算法重要性的一个非常好的案例。

《Oracle Java SE编程自学与面试指南》最佳学习路线图(2020最新版)

正确选择比瞎努力更重要!

一文带你入门Java Stream流,太强了

两个星期以前,就有读者强烈要求我写一篇 Java Stream 流的文章,我说市面上不是已经有很多了吗,结果你猜他怎么说:“就想看你写的啊!”你看你看,多么苍白的喜欢啊。那就“勉为其难”写一篇吧,嘻嘻。 单从“Stream”这个单词上来看,它似乎和 java.io 包下的 InputStream 和 OutputStream 有些关系。实际上呢,没毛关系。Java 8 新增的 Stream 是为...

立即提问
相关内容推荐