安装gtk+./configure时报错

configure:error: pangox Pango backend is required for x11 target

1个回答

Csdn user default icon
上传中...
上传图片
插入图片
抄袭、复制答案,以达到刷声望分或其他目的的行为,在CSDN问答是严格禁止的,一经发现立刻封号。是时候展现真正的技术了!
其他相关推荐
安装gtk+./configure时报错
configure:error: pangox Pango backend is required for x11 target
ubuntu编译./configure错误
configure: error: Library requirements (libgnome-2.0 >= 2.0.0 libgnomeui-2.0 >= 2.0.0 gtk+-2.0 >= 2.4.0 gnome-vfs-2.0 >= 2.6.0 libglade-2.0 >= 2.3.6) not met; consider adjusting the PKG_CONFIG_PATH environment variable if your libraries are in a nonstandard prefix so pkg-config can find them.
在ubuntu下编译一个开源软件,./configure时出现错误,求指教
显示的错误: checking for libgnome-2.0 >= 2.0.0 libgnomeui-2.0 >= 2.0.0 gtk+-2.0 >= 2.4.0 gnome-vfs-2.0 >= 2.6.0 libglade-2.0 >= 2.3.6... Package libgnome-2.0 was not found in the pkg-config search path. Perhaps you should add the directory containing `libgnome-2.0.pc' to the PKG_CONFIG_PATH environment variable No package 'libgnome-2.0' found Package libgnomeui-2.0 was not found in the pkg-config search path. Perhaps you should add the directory containing `libgnomeui-2.0.pc' to the PKG_CONFIG_PATH environment variable No package 'libgnomeui-2.0' found Package gnome-vfs-2.0 was not found in the pkg-config search path. Perhaps you should add the directory containing `gnome-vfs-2.0.pc' to the PKG_CONFIG_PATH environment variable No package 'gnome-vfs-2.0' found configure: error: Library requirements (libgnome-2.0 >= 2.0.0 libgnomeui-2.0 >= 2.0.0 gtk+-2.0 >= 2.4.0 gnome-vfs-2.0 >= 2.6.0 libglade-2.0 >= 2.3.6) not met; consider adjusting the PKG_CONFIG_PATH environment variable if your libraries are in a nonstandard prefix so pkg-config can find them. 可是找不到这些.pc文件,把缺少的.pc文件安装上去,在安装时会缺少其他文件。 不知道该怎么办
如何在Lubuntu下快速安装glade
刚安装的Lubuntu14.04系统,然后载好glade包,解包,安装,./configure的时候,提示错误,说是gtk之类的版本太低,然后载了最新版的gtk安装,./configure的时候,又提示别的什么版本太低。是不是我安装完系统之后,环境没有搭建好,所以很多库或者软件没有或者版本太低?求大神指点啊!
ubuntu下NS3使用“./test.py -c core”命令测试一直报错,求大神帮忙
Build failed -> task in 'test-runner' failed (exit status 1): {task 140009040312272: cxx test-runner.cc -> test-runner.cc.1.o} ['/usr/bin/g++', '-O3', '-g', '-Wall', '-Werror', '-march=native', '-fstrict-overflow', '-Wno-error=deprecated-declarations', '-fstrict-aliasing', '-Wstrict-aliasing', '-pthread', '-pthread', '-I.', '-I..', '-I/usr/include/gtk-2.0', '-I/usr/lib/x86_64-linux-gnu/gtk-2.0/include', '-I/usr/include/gio-unix-2.0', '-I/usr/include/cairo', '-I/usr/include/pango-1.0', '-I/usr/include/atk-1.0', '-I/usr/include/pixman-1', '-I/usr/include/libpng12', '-I/usr/include/gdk-pixbuf-2.0', '-I/usr/include/harfbuzz', '-I/usr/include/glib-2.0', '-I/usr/lib/x86_64-linux-gnu/glib-2.0/include', '-I/usr/include/freetype2', '-DNS3_BUILD_PROFILE_OPTIMIZED', '-DHAVE_SYS_IOCTL_H=1', '-DHAVE_IF_NETS_H=1', '-DHAVE_NET_ETHERNET_H=1', '-DHAVE_PACKET_H=1', '-DHAVE_IF_TUN_H=1', '-DHAVE_SQLITE3=1', '-DHAVE_GTK2=1', '../utils/test-runner.cc', '-c', '-o', '/home/chenhl/ns-allinone-3.25/ns-3.25/build/utils/test-runner.cc.1.o'] Waf died. Not running tests
关于 Mac 上用 Homebrew 更新软件后无效的问题求助
半年以前可以用的 gtk+3 发现现在不能用了,用 homebrew 把所有软件更新了一道之后再编译就显示如下问题: ``` $ gcc -o test1 test.c `pkg-config --libs --cflags gtk+-3.0` Package 'gdk-3.0' requires 'cairo >= 1.14.0' but version of cairo is 1.12.16 test.c:1:10: fatal error: 'gtk/gtk.h' file not found #include <gtk/gtk.h> ^ 1 error generated. ``` 但是我检查我的 cairo 版本发现已经是最新的 1.14.6 ``` e$ brew list cairo /usr/local/Cellar/cairo/1.14.6/bin/cairo-sphinx /usr/local/Cellar/cairo/1.14.6/bin/cairo-trace /usr/local/Cellar/cairo/1.14.6/include/cairo/ (14 files) /usr/local/Cellar/cairo/1.14.6/lib/libcairo-gobject.2.dylib /usr/local/Cellar/cairo/1.14.6/lib/libcairo-script-interpreter.2.dylib /usr/local/Cellar/cairo/1.14.6/lib/libcairo.2.dylib /usr/local/Cellar/cairo/1.14.6/lib/cairo/ (9 files) /usr/local/Cellar/cairo/1.14.6/lib/pkgconfig/ (13 files) /usr/local/Cellar/cairo/1.14.6/lib/ (6 other files) /usr/local/Cellar/cairo/1.14.6/share/gtk-doc/ (65 files) ``` 表示要疯了 XD
JNI 运行错误 symbol lookup error
```sh /usr/lib/jvm/java-6-openjdk-amd64/bin/java -Djava.library.path=../cef-swt-gtk-linux-x86_64-native/ -cp ./target/classes:./target/test-classes:$HOME/.m2/repository/org/eclipse/swt/org.eclipse.swt.gtk.linux.x86_64/3.7.2/org.eclipse.swt.gtk.linux.x86_64-3.7.2.jar com.zxg.cef.swt.test.TestWindow ``` 错误: /usr/lib/jvm/java-6-openjdk-amd64/bin/java: symbol lookup error: /home/xxx/code/workspace/eclipse_workspace/cef-swt-gtk-linux-x86_64-native/libcef-swt-gtk-linux-x86_64.so: undefined symbol: _Z13CefInitializeRK11CefMainArgsRK13CefStructBaseI17CefSettingsTraitsE9CefRefPtrI6CefAppE makefile: ```makefile OBJS = cef-swt-gtk-linux-x86_64.o JAVA_HOME = /usr/lib/jvm/java-6-openjdk-amd64 CXXFLAGS = -fPIC -Wall -fmessage-length=0 -I$(JAVA_HOME)/include -I/usr/local/include/cef3 `pkg-config --cflags gtk+-2.0` LIBS = -lcef -lffmpegsumo `pkg-config --libs gtk+-2.0` LDFLAGS := -shared -fpic -Wl,-rpath,/usr/local/lib CXX = g++ TARGET = libcef-swt-gtk-linux-x86_64.so $(TARGET): $(OBJS) $(CXX) $(LDFLAGS) -o $(TARGET) $(OBJS) $(LIBS) all: $(TARGET) ../cef-swt-gtk-linux-x86_64/target/classes/com/zxg/cef/swt/Cef.class: ../cef-swt-gtk-linux-x86_64/src/main/java/com/zxg/cef/swt/Cef.java mvn -f ../cef-swt-gtk-linux-x86_64/pom.xml compile com_zxg_cef_swt_Cef.h: ../cef-swt-gtk-linux-x86_64/target/classes/com/zxg/cef/swt/Cef.class $(JAVA_HOME)/bin/javah -classpath ../cef-swt-gtk-linux-x86_64/target/classes com.zxg.cef.swt.Cef cef-swt-gtk-linux-x86_64.o: cef-swt-gtk-linux-x86_64.cpp com_zxg_cef_swt_Cef.h $(CXX) $(CXXFLAGS) -c -o cef-swt-gtk-linux-x86_64.o cef-swt-gtk-linux-x86_64.cpp clean: rm -f $(OBJS) $(TARGET) ```
求问ubuntu 13.10下ns3.8安装遇到python2.7-config意外停止
运行./build.py时,报错说“对不起,应用程序i386-linux-gnu-python2.7-config意外停止” 所以就build failed,遇见错误的地方如下: # Build NS-3 Entering directory `./ns-3.8' Note: configuring ns-3 without NSC => python waf configure --with-regression-traces ../ns-3.8-ref-traces --with-pybindgen ../pybindgen-0.14.1 Checking for program gcc or cc : /usr/bin/gcc Checking for program cpp : /usr/bin/cpp Checking for program ar : /usr/bin/ar Checking for program ranlib : /usr/bin/ranlib Checking for gcc : ok Checking for program g++ or c++ : /usr/bin/g++ Checking for program ar : /usr/bin/ar Checking for program ranlib : /usr/bin/ranlib Checking for g++ : ok Checking for program pkg-config : /usr/bin/pkg-config Checking for regression traces location : ok ../ns-3.8-ref-traces (given) Checking for -Wl,--soname=foo support : yes Checking for header stdlib.h : yes Checking for header signal.h : yes Checking for header pthread.h : yes Checking for high precision time implementation : 128-bit integer Checking for header stdint.h : yes Checking for header inttypes.h : yes Checking for header sys/inttypes.h : not found Checking for library rt : yes Checking for header netpacket/packet.h : yes Checking for header linux/if_tun.h : yes Checking for pkg-config flags for GTK_CONFIG_STORE : ok Checking for pkg-config flags for LIBXML2 : ok Checking for library sqlite3 : yes Checking for NSC location : not found Checking for header sys/socket.h : yes Checking for header netinet/in.h : yes Checking for program python : /usr/bin/python Checking for Python version >= 2.3 : ok 2.7.5 Checking for library python2.7 : yes Checking for program python2.7-config : /usr/bin/python2.7-config File "/usr/bin/python2.7-config", line 5 echo "Usage: $0 --prefix|--exec-prefix|--includes|--libs|--cflags|--ldflags|--extension-suffix|--help|--configdir" ^ SyntaxError: invalid syntax Traceback (most recent call last): File "waf", line 158, in <module> Scripting.prepare(t, cwd, VERSION, wafdir) File "/home/daisy/workspace/eclipseWorkspace/ns3.8/ns-3.8/.waf-1.5.16-e6d03192b5ddfa5ef2c8d65308e48e42/wafadmin/Scripting.py", line 105, in prepare prepare_impl(t,cwd,ver,wafdir)
Ubuntu 16.04 编译 Ncurses 6.0 报错
### Ubuntu 16.04 LTS 编译 Ncurses 6.0 报错: ``` In file included from ./curses.priv.h:325:0, from ../ncurses/lib_gen.c:19: _24273.c:843:15: error: expected ‘)’ before ‘int’ ../include/curses.h:1631:56: note: in definition of macro ‘mouse_trafo’ #define mouse_trafo(y,x,to_screen) wmouse_trafo(stdscr,y,x,to_screen) ^ Makefile:962: recipe for target '../objects/lib_gen.o' failed make[1]: *** [../objects/lib_gen.o] Error 1 make[1]: Leaving directory '/home/netsamir/Sofware/Tmux/ncurses-6.0/ncurses' Makefile:113: recipe for target 'all' failed make: *** [all] Error 2 ``` ### 系统配置 ``` $ lsb_release -a No LSB modules are available. Distributor ID: Ubuntu Description: Ubuntu 16.04 LTS Release: 16.04 Codename: xenial $ gcc -v Using built-in specs. COLLECT_GCC=gcc COLLECT_LTO_WRAPPER=/usr/lib/gcc/x86_64-linux-gnu/5/lto-wrapper Target: x86_64-linux-gnu Configured with: ../src/configure -v --with-pkgversion='Ubuntu 5.4.0-6ubuntu1~16.04.4' --with-bugurl=file:///usr/share/doc/gcc-5/README.Bugs --enable-languages=c,ada,c++,java,go,d,fortran,objc,obj-c++ --prefix=/usr --program-suffix=-5 --enable-shared --enable-linker-build-id --libexecdir=/usr/lib --without-included-gettext --enable-threads=posix --libdir=/usr/lib --enable-nls --with-sysroot=/ --enable-clocale=gnu --enable-libstdcxx-debug --enable-libstdcxx-time=yes --with-default-libstdcxx-abi=new --enable-gnu-unique-object --disable-vtable-verify --enable-libmpx --enable-plugin --with-system-zlib --disable-browser-plugin --enable-java-awt=gtk --enable-gtk-cairo --with-java-home=/usr/lib/jvm/java-1.5.0-gcj-5-amd64/jre --enable-java-home --with-jvm-root-dir=/usr/lib/jvm/java-1.5.0-gcj-5-amd64 --with-jvm-jar-dir=/usr/lib/jvm-exports/java-1.5.0-gcj-5-amd64 --with-arch-directory=amd64 --with-ecj-jar=/usr/share/java/eclipse-ecj.jar --enable-objc-gc --enable-multiarch --disable-werror --with-arch-32=i686 --with-abi=m64 --with-multilib-list=m32,m64,mx32 --enable-multilib --with-tune=generic --enable-checking=release --build=x86_64-linux-gnu --host=x86_64-linux-gnu --target=x86_64-linux-gnu Thread model: posix gcc version 5.4.0 20160609 (Ubuntu 5.4.0-6ubuntu1~16.04.4) $ g++ -v Using built-in specs. COLLECT_GCC=g++ COLLECT_LTO_WRAPPER=/usr/lib/gcc/x86_64-linux-gnu/5/lto-wrapper Target: x86_64-linux-gnu Configured with: ../src/configure -v --with-pkgversion='Ubuntu 5.4.0-6ubuntu1~16.04.4' --with-bugurl=file:///usr/share/doc/gcc-5/README.Bugs --enable-languages=c,ada,c++,java,go,d,fortran,objc,obj-c++ --prefix=/usr --program-suffix=-5 --enable-shared --enable-linker-build-id --libexecdir=/usr/lib --without-included-gettext --enable-threads=posix --libdir=/usr/lib --enable-nls --with-sysroot=/ --enable-clocale=gnu --enable-libstdcxx-debug --enable-libstdcxx-time=yes --with-default-libstdcxx-abi=new --enable-gnu-unique-object --disable-vtable-verify --enable-libmpx --enable-plugin --with-system-zlib --disable-browser-plugin --enable-java-awt=gtk --enable-gtk-cairo --with-java-home=/usr/lib/jvm/java-1.5.0-gcj-5-amd64/jre --enable-java-home --with-jvm-root-dir=/usr/lib/jvm/java-1.5.0-gcj-5-amd64 --with-jvm-jar-dir=/usr/lib/jvm-exports/java-1.5.0-gcj-5-amd64 --with-arch-directory=amd64 --with-ecj-jar=/usr/share/java/eclipse-ecj.jar --enable-objc-gc --enable-multiarch --disable-werror --with-arch-32=i686 --with-abi=m64 --with-multilib-list=m32,m64,mx32 --enable-multilib --with-tune=generic --enable-checking=release --build=x86_64-linux-gnu --host=x86_64-linux-gnu --target=x86_64-linux-gnu Thread model: posix gcc version 5.4.0 20160609 (Ubuntu 5.4.0-6ubuntu1~16.04.4) ```
·Robotframework」运行ride.py 报错 麻烦大神们看一下!
环境:Ubuntu 16.04 折腾了好久pip install robotframework-ride 才成功 运行ride.py又又又报错了 心累 麻烦各位帮我看看 指点迷津 ``` pip install robotframework-ride 提示 Looking in indexes: https://pypi.tuna.tsinghua.edu.cn/simple Requirement already satisfied: robotframework-ride in /usr/local/lib/python2.7/dist-packages (1.7.4b1.dev1) Requirement already satisfied: wxPython in /usr/lib/python2.7/dist-packages/wx-2.8-gtk2-unicode (from robotframework-ride) (2.8.12.1) Requirement already satisfied: PyPubSub in /usr/local/lib/python2.7/dist-packages (from robotframework-ride) (3.3.0) Requirement already satisfied: Pygments in /usr/local/lib/python2.7/dist-packages (from robotframework-ride) (2.4.2 ``` ``` ride.py后 ``` ![图片说明](https://img-ask.csdn.net/upload/201907/18/1563447987_206124.png) 报错:Traceback (most recent call last): File "/usr/local/lib/python2.7/dist-packages/robotide/__init__.py", line 83, in main _run(inpath, not noupdatecheck, debug_console) File "/usr/local/lib/python2.7/dist-packages/robotide/__init__.py", line 112, in _run ride = RIDE(inpath, updatecheck) File "/usr/local/lib/python2.7/dist-packages/robotide/application/application.py", line 45, in __init__ wx.App.__init__(self, redirect=False) File "/usr/lib/python2.7/dist-packages/wx-2.8-gtk2-unicode/wx/_core.py", line 7981, in __init__ self._BootstrapApp() File "/usr/lib/python2.7/dist-packages/wx-2.8-gtk2-unicode/wx/_core.py", line 7555, in _BootstrapApp return _core_.PyApp__BootstrapApp(*args, **kwargs) File "/usr/local/lib/python2.7/dist-packages/robotide/application/application.py", line 55, in OnInit self.frame = RideFrame(self, self._controller) File "/usr/local/lib/python2.7/dist-packages/robotide/ui/mainframe.py", line 173, in __init__ self.Bind(wx.EVT_DIRCTRL_FILEACTIVATED, self.OnOpenFile) AttributeError: 'module' object has no attribute 'EVT_DIRCTRL_FILEACTIVATED' 麻烦各位了!!非常感谢!!
通过MakeFile文件了解项目目录结构,编写CMake的CMakelist.txt文件方法。
主项目: CC = gcc CFLAGS += -O3 BIN_DIR = ./bin SRC_DIR = ./src DOC_DIR = ./docs INC_DIR = ./include LIB_DIR = ./lib BIN = siftfeat match dspfeat all: $(BIN) libopensift.a docs docs: doxygen Doxyfile libopensift.a: make -C $(SRC_DIR) $@ $(BIN): make -C $(SRC_DIR) $@ clean: make -C $(SRC_DIR) $@; \ make -C $(INC_DIR) $@; \ distclean: clean rm -f $(LIB_DIR)/* rm -f $(BIN_DIR)/* docsclean: rm -rf $(DOC_DIR)/html/ .PHONY: docs clean docsclean libopensift.a scr文件: CC = gcc CFLAGS += BIN_DIR = ../bin INC_DIR = ../include LIB_DIR = ../lib INCL = -I$(INC_DIR) `pkg-config --cflags opencv gtk+-2.0` LIBS = -L$(LIB_DIR) -lopensift -lm `pkg-config --libs opencv gtk+-2.0` OBJ = imgfeatures.o utils.o sift.o kdtree.o minpq.o xform.o BIN = siftfeat match dspfeat all: $(BIN) libopensift.a libopensift.a: $(OBJ) ar rc $(LIB_DIR)/$@ $(OBJ) ranlib $(LIB_DIR)/$@ siftfeat: libopensift.a siftfeat.c $(CC) $(CFLAGS) $(INCL) siftfeat.c -o $(BIN_DIR)/$@ $(LIBS) match: libopensift.a match.c $(CC) $(CFLAGS) $(INCL) match.c -o $(BIN_DIR)/$@ $(LIBS) dspfeat: libopensift.a dspfeat.c $(CC) $(CFLAGS) $(INCL) dspfeat.c -o $(BIN_DIR)/$@ $(LIBS) imgfeatures.o: imgfeatures.c $(INC_DIR)/imgfeatures.h $(CC) $(CFLAGS) $(INCL) -c imgfeatures.c -o $@ utils.o: utils.c $(INC_DIR)/utils.h $(CC) $(CFLAGS) $(INCL) -c utils.c -o $@ sift.o: sift.c $(INC_DIR)/sift.h $(CC) $(CFLAGS) $(INCL) -c sift.c -o $@ kdtree.o: kdtree.c $(INC_DIR)/kdtree.h $(CC) $(CFLAGS) $(INCL) -c kdtree.c -o $@ minpq.o: minpq.c $(INC_DIR)/minpq.h $(CC) $(CFLAGS) $(INCL) -c minpq.c -o $@ xform.o: xform.c $(INC_DIR)/xform.h $(CC) $(CFLAGS) $(INCL) -c xform.c -o $@ clean: rm -f *~ *.o core .PHONY: clean include文件: clean: rm -f *~ .PHONY: clean
关于GTK问题,GtkGrid控件无法定义
![图片说明](https://img-ask.csdn.net/upload/201501/28/1422458623_601006.png) 上面的图上显示我的GTK版本是3.* 不过我也有安装2.* ![图片说明](https://img-ask.csdn.net/upload/201501/28/1422458689_43178.png) 这张图是我code::blocks的设置 ![图片说明](https://img-ask.csdn.net/upload/201501/28/1422458764_821879.png) 那么问题来了,如上图所示,我不能定义GtkGrid类型的空间。求解。
linux中安装的eclipse怎么启动
我的虚拟机系统是centos7,在计算机/home下是我的eclipse安装目录,网上都说按下面目录可以启动eclipse [root@localhost ~]# cd /home [root@localhost home]# ls dxx eclipse eclipse-jee-galileo-SR2-linux-gtk.tar.gz [root@localhost home]# cd/eclipse bash: cd/eclipse: 没有那个文件或目录 [root@localhost home]# cd eclipse [root@localhost eclipse]# ls about_files configuration eclipse.ini icon.xpm p2 about.html dropins epl-v10.html libcairo-swt.so plugins artifacts.xml eclipse features notice.html readme [root@localhost eclipse]# ./eclipse bash: ./eclipse: /lib/ld-linux.so.2: bad ELF interpreter: 没有那个文件或目录 [root@localhost eclipse]# 但是我的运行效果如上并没有启动eclipse。哪位前辈帮忙解答一下,多谢 另:我是新手刚开始接触linux,希望说的越详细越好
linux下gtk的库文件有很多,不知道哪一个是我用的
我做的应用运行在手持终端,基于一个精简的Linux系统。 用的gcc-arm-linux交叉编译工具 现在我就想搞清楚头文件和库文件在哪里,makefile脚本很复杂而且有很多文件,完全看不懂,只能凭目录名称去找。。。 头文件在/usr/local/arm-linux/include/gtk/下 库文件用locate libgtk查找有一大堆,目测有关系的有下面这些: /usr/local/arm-linux/arm-linux/lib/libgtk-x11-2.0.so /usr/local/arm-linux/arm-linux/lib/libgtk-x11-2.0.so.0 /usr/local/arm-linux/arm-linux/lib/libgtk-x11-2.0.so.0.600.8 /usr/local/arm-linux/arm-linux/lib/libgtkstylus.so /usr/local/arm-linux/arm-linux/lib/libgtkstylus.so.0 /usr/local/arm-linux/arm-linux/lib/libgtkstylus.so.0.0.0 我要如何才能确定哪一个是编译时依赖的库? 有必要把makefile脚本贴出来吗?
请问如何解决ubunt14.04配置opencv报错(虚拟机)(gedit:11818)
按配置教程是要: 安装完成后需要对系统相关环境变量进行配置: sudo gedit /etc/ld.so.conf.d/opencv.conf 将以下内容添加到最后: /usr/local/lib 报错如下,输入sudo gedit /etc/ld.so.conf.d/opencv.conf后打开了一个文件,在里面我输入了/usr/local/lib,出现报错: (gedit:11818): IBUS-WARNING **: The owner of /home/aa/.config/ibus/bus is not root!  (gedit:11818): Gtk-WARNING **: Calling Inhibit failed: GDBus.Error:org.freedesktop.DBus.Error.ServiceUnknown: The name org.gnome.SessionManager was not provided by any .service files 谢谢
运行基于qt的opencv程序时提示安装libgt2.0-dev
OpenCV Error: Unspecified error (The function is not implemented. Rebuild the library with Windows, GTK+ 2.x or Carbon support. If you are on Ubuntu or Debian, install libgtk2.0-dev and pkg-config, then re-run cmake or configure script) in cvNamedWindow, file /work/tools/OpenCV-2.3.1/modules/highgui/src/window.cpp, line 275 terminate called after throwing an instance of 'cv::Exception' what(): /work/tools/OpenCV-2.3.1/modules/highgui/src/window.cpp:275: error: (-2) The function is not implemented. Rebuild the library with Windows, GTK+ 2.x or Carbon support. If you are on Ubuntu or Debian, install libgtk2.0-dev and pkg-config, then re-run cmake or configure script in function cvNamedWindow 可是我这是用qmake编译出来的可执行文件啊,为什么还要安装gtk?另外我安装了pkg-config,qte的移植经测试也是正确的
Ubuntu启动 eclipse 失败 JVM terminated. Exit code=13
错误码: JVM terminated. Exit code=13 /usr/java/jdk1.8.0_20/bin/java -Dosgi.requiredJavaVersion=1.7 -XX:MaxPermSize=256m -Xms40m -Xmx512m -jar /opt/eclipse//plugins/org.eclipse.equinox.launcher_1.3.100.v20150511-1540.jar -os linux -ws gtk -arch x86_64 -showsplash /opt/eclipse//plugins/org.eclipse.platform_4.5.0.v20150603-2000/splash.bmp -launcher /opt/eclipse/eclipse -name Eclipse --launcher.library /opt/eclipse//plugins/org.eclipse.equinox.launcher.gtk.linux.x86_64_1.1.300.v20150602-1417/eclipse_1612.so -startup /opt/eclipse//plugins/org.eclipse.equinox.launcher_1.3.100.v20150511-1540.jar --launcher.appendVmargs -exitdata 33800f -product org.eclipse.epp.package.jee.product -vm /usr/java/jdk1.8.0_20/bin/java -vmargs -Dosgi.requiredJavaVersion=1.7 -XX:MaxPermSize=256m -Xms40m -Xmx512m -jar /opt/eclipse//plugins/org.eclipse.equinox.launcher_1.3.100.v20150511-1540.jar jdk和eclipse均为64位..系统为Ubuntu 15.04
各位朋友好,请教ubuntu系统python3.4环境下安装matplotlib报错的解决办法
具体的问题是这样的: 我的系统是Ubuntu14.04 的64位系统,python3.4版本下,想使用matplotlib来做图。 由于matplotlib依赖numpy和python的图像库PIL,因此我先安装numpy和PIL然后,再安装matplotlib, 这里附上我的安装matplotlib的shell命令 #安装科学计算库numpy sudo pip3 install numpy #安装图像处理库PIL sudo apt-get install python3.4-dev -y sudo apt-get install libjpeg8-dev zlib1g-dev libfreetype6-dev -y sudo ln -s /usr/lib/x86_64-linux-gnu/libjpeg.so /usr/lib sudo ln -s /usr/lib/x86_64-linux-gnu/libfreetype.so /usr/lib sudo ln -s /usr/lib/x86_64-linux-gnu/libz.so /usr/lib sudo apt-get install python3-pil #安装画图库matplotlib sudo pip3 install matplotlib 但是发现虽然安装成功(在python3的shell交互环境下, import matplotlib 是可以的),但是 执行如下语句 from matplotlib import pyplot as plt 报错: "/usr/local/lib/python3.4/dist-packages/matplotlib-1.5.1-py3.4-linux-x86_64.egg/matplotlib/backends/backend_gtk3.py", line 58, in <module> cursors.MOVE : Gdk.Cursor.new(Gdk.CursorType.FLEUR), TypeError: constructor returned NULL 希望各位朋友能指点一下,十分感谢
在Ubuntu下装ns-3,编译时总是中途出错,具体如下:
Build failed -> task failed (exit status 1): {task 139621304904464: cxx print-introspected-doxygen.cc -> print-introspected-doxygen.cc.4.o} ['/usr/bin/g++', '-O0', '-ggdb', '-g3', '-Wall', '-Werror', '-Wno-error=deprecated-declarations', '-fstrict-aliasing', '-Wstrict-aliasing', '-pthread', '-pthread', '-fno-strict-aliasing', '-fwrapv', '-fdebug-prefix-map=/build/python2.7-3hk45v/python2.7-2.7.15~rc1=.', '-fstack-protector-strong', '-fno-strict-aliasing', '-Ibuild', '-I.', '-I.', '-I/home/zhangzq/tarballs/ns-allinone-3.13', '-I/usr/include/gtk-2.0', '-I/usr/lib/x86_64-linux-gnu/gtk-2.0/include', '-I/usr/include/gio-unix-2.0', '-I/usr/include/cairo', '-I/usr/include/pango-1.0', '-I/usr/include/atk-1.0', '-I/usr/include/pixman-1', '-I/usr/include/gdk-pixbuf-2.0', '-I/usr/include/libpng16', '-I/usr/include/harfbuzz', '-I/usr/include/glib-2.0', '-I/usr/lib/x86_64-linux-gnu/glib-2.0/include', '-I/usr/include/freetype2', '-I/usr/include/libxml2', '-I/usr/include/python2.7', '-I/usr/include/x86_64-linux-gnu/python2.7', '-DNS3_ASSERT_ENABLE', '-DNS3_LOG_ENABLE', '-DSQLITE3=1', '-DHAVE_IF_TUN_H=1', '-DPYTHONDIR="/usr/local/lib/python2.7/dist-packages"', '-DPYTHONARCHDIR="/usr/local/lib/python2.7/dist-packages"', '-DHAVE_PYTHON_H=1', '-DENABLE_GSL', '-DNDEBUG', '-D_FORTIFY_SOURCE=2', '../utils/print-introspected-doxygen.cc', '-c', '-o', 'utils/print-introspected-doxygen.cc.4.o'] Traceback (most recent call last): File "./build.py", line 147, in <module> sys.exit(main(sys.argv)) File "./build.py", line 138, in main build_ns3(config, build_examples, build_tests, args, build_options) File "./build.py", line 61, in build_ns3 run_command([sys.executable, "waf", "build"] + build_options) File "/home/zhangzq/tarballs/ns-allinone-3.13/util.py", line 24, in run_command raise CommandError("Command %r exited with code %i" % (argv, retval)) util.CommandError: Command ['/usr/bin/python', 'waf', 'build'] exited with code 1
爬虫福利二 之 妹子图网MM批量下载
爬虫福利一:27报网MM批量下载 点击 看了本文,相信大家对爬虫一定会产生强烈的兴趣,激励自己去学习爬虫,在这里提前祝:大家学有所成! 目标网站:妹子图网 环境:Python3.x 相关第三方模块:requests、beautifulsoup4 Re:各位在测试时只需要将代码里的变量path 指定为你当前系统要保存的路径,使用 python xxx.py 或IDE运行即可。 ...
Java学习的正确打开方式
在博主认为,对于入门级学习java的最佳学习方法莫过于视频+博客+书籍+总结,前三者博主将淋漓尽致地挥毫于这篇博客文章中,至于总结在于个人,实际上越到后面你会发现学习的最好方式就是阅读参考官方文档其次就是国内的书籍,博客次之,这又是一个层次了,这里暂时不提后面再谈。博主将为各位入门java保驾护航,各位只管冲鸭!!!上天是公平的,只要不辜负时间,时间自然不会辜负你。 何谓学习?博主所理解的学习,它是一个过程,是一个不断累积、不断沉淀、不断总结、善于传达自己的个人见解以及乐于分享的过程。
大学四年自学走来,这些私藏的实用工具/学习网站我贡献出来了
大学四年,看课本是不可能一直看课本的了,对于学习,特别是自学,善于搜索网上的一些资源来辅助,还是非常有必要的,下面我就把这几年私藏的各种资源,网站贡献出来给你们。主要有:电子书搜索、实用工具、在线视频学习网站、非视频学习网站、软件下载、面试/求职必备网站。 注意:文中提到的所有资源,文末我都给你整理好了,你们只管拿去,如果觉得不错,转发、分享就是最大的支持了。 一、电子书搜索 对于大部分程序员...
linux系列之常用运维命令整理笔录
本博客记录工作中需要的linux运维命令,大学时候开始接触linux,会一些基本操作,可是都没有整理起来,加上是做开发,不做运维,有些命令忘记了,所以现在整理成博客,当然vi,文件操作等就不介绍了,慢慢积累一些其它拓展的命令,博客不定时更新 free -m 其中:m表示兆,也可以用g,注意都要小写 Men:表示物理内存统计 total:表示物理内存总数(total=used+free) use...
比特币原理详解
一、什么是比特币 比特币是一种电子货币,是一种基于密码学的货币,在2008年11月1日由中本聪发表比特币白皮书,文中提出了一种去中心化的电子记账系统,我们平时的电子现金是银行来记账,因为银行的背后是国家信用。去中心化电子记账系统是参与者共同记账。比特币可以防止主权危机、信用风险。其好处不多做赘述,这一层面介绍的文章很多,本文主要从更深层的技术原理角度进行介绍。 二、问题引入 假设现有4个人...
程序员接私活怎样防止做完了不给钱?
首先跟大家说明一点,我们做 IT 类的外包开发,是非标品开发,所以很有可能在开发过程中会有这样那样的需求修改,而这种需求修改很容易造成扯皮,进而影响到费用支付,甚至出现做完了项目收不到钱的情况。 那么,怎么保证自己的薪酬安全呢? 我们在开工前,一定要做好一些证据方面的准备(也就是“讨薪”的理论依据),这其中最重要的就是需求文档和验收标准。一定要让需求方提供这两个文档资料作为开发的基础。之后开发...
网页实现一个简单的音乐播放器(大佬别看。(⊙﹏⊙))
今天闲着无事,就想写点东西。然后听了下歌,就打算写个播放器。 于是乎用h5 audio的加上js简单的播放器完工了。 演示地点演示 html代码如下` music 这个年纪 七月的风 音乐 ` 然后就是css`*{ margin: 0; padding: 0; text-decoration: none; list-...
Python十大装B语法
Python 是一种代表简单思想的语言,其语法相对简单,很容易上手。不过,如果就此小视 Python 语法的精妙和深邃,那就大错特错了。本文精心筛选了最能展现 Python 语法之精妙的十个知识点,并附上详细的实例代码。如能在实战中融会贯通、灵活使用,必将使代码更为精炼、高效,同时也会极大提升代码B格,使之看上去更老练,读起来更优雅。
数据库优化 - SQL优化
以实际SQL入手,带你一步一步走上SQL优化之路!
2019年11月中国大陆编程语言排行榜
2019年11月2日,我统计了某招聘网站,获得有效程序员招聘数据9万条。针对招聘信息,提取编程语言关键字,并统计如下: 编程语言比例 rank pl_ percentage 1 java 33.62% 2 cpp 16.42% 3 c_sharp 12.82% 4 javascript 12.31% 5 python 7.93% 6 go 7.25% 7 p...
通俗易懂地给女朋友讲:线程池的内部原理
餐盘在灯光的照耀下格外晶莹洁白,女朋友拿起红酒杯轻轻地抿了一小口,对我说:“经常听你说线程池,到底线程池到底是个什么原理?”
经典算法(5)杨辉三角
杨辉三角 是经典算法,这篇博客对它的算法思想进行了讲解,并有完整的代码实现。
腾讯算法面试题:64匹马8个跑道需要多少轮才能选出最快的四匹?
昨天,有网友私信我,说去阿里面试,彻底的被打击到了。问了为什么网上大量使用ThreadLocal的源码都会加上private static?他被难住了,因为他从来都没有考虑过这个问题。无独有偶,今天笔者又发现有网友吐槽了一道腾讯的面试题,我们一起来看看。 腾讯算法面试题:64匹马8个跑道需要多少轮才能选出最快的四匹? 在互联网职场论坛,一名程序员发帖求助到。二面腾讯,其中一个算法题:64匹...
面试官:你连RESTful都不知道我怎么敢要你?
干货,2019 RESTful最贱实践
JDK12 Collectors.teeing 你真的需要了解一下
前言 在 Java 12 里面有个非常好用但在官方 JEP 没有公布的功能,因为它只是 Collector 中的一个小改动,它的作用是 merge 两个 collector 的结果,这句话显得很抽象,老规矩,我们先来看个图(这真是一个不和谐的图????): 管道改造经常会用这个小东西,通常我们叫它「三通」,它的主要作用就是将 downstream1 和 downstre...
为啥国人偏爱Mybatis,而老外喜欢Hibernate/JPA呢?
关于SQL和ORM的争论,永远都不会终止,我也一直在思考这个问题。昨天又跟群里的小伙伴进行了一番讨论,感触还是有一些,于是就有了今天这篇文。 声明:本文不会下关于Mybatis和JPA两个持久层框架哪个更好这样的结论。只是摆事实,讲道理,所以,请各位看官勿喷。 一、事件起因 关于Mybatis和JPA孰优孰劣的问题,争论已经很多年了。一直也没有结论,毕竟每个人的喜好和习惯是大不相同的。我也看...
SQL-小白最佳入门sql查询一
不要偷偷的查询我的个人资料,即使你再喜欢我,也不要这样,真的不好;
项目中的if else太多了,该怎么重构?
介绍 最近跟着公司的大佬开发了一款IM系统,类似QQ和微信哈,就是聊天软件。我们有一部分业务逻辑是这样的 if (msgType = "文本") { // dosomething } else if(msgType = "图片") { // doshomething } else if(msgType = "视频") { // doshomething } else { // doshom...
【图解经典算法题】如何用一行代码解决约瑟夫环问题
约瑟夫环问题算是很经典的题了,估计大家都听说过,然后我就在一次笔试中遇到了,下面我就用 3 种方法来详细讲解一下这道题,最后一种方法学了之后保证让你可以让你装逼。 问题描述:编号为 1-N 的 N 个士兵围坐在一起形成一个圆圈,从编号为 1 的士兵开始依次报数(1,2,3…这样依次报),数到 m 的 士兵会被杀死出列,之后的士兵再从 1 开始报数。直到最后剩下一士兵,求这个士兵的编号。 1、方...
致 Python 初学者
欢迎来到“Python进阶”专栏!来到这里的每一位同学,应该大致上学习了很多 Python 的基础知识,正在努力成长的过程中。在此期间,一定遇到了很多的困惑,对未来的学习方向感到迷茫。我非常理解你们所面临的处境。我从2007年开始接触 python 这门编程语言,从2009年开始单一使用 python 应对所有的开发工作,直至今天。回顾自己的学习过程,也曾经遇到过无数的困难,也曾经迷茫过、困惑过。开办这个专栏,正是为了帮助像我当年一样困惑的 Python 初学者走出困境、快速成长。希望我的经验能真正帮到你
“狗屁不通文章生成器”登顶GitHub热榜,分分钟写出万字形式主义大作
一、垃圾文字生成器介绍 最近在浏览GitHub的时候,发现了这样一个骨骼清奇的雷人项目,而且热度还特别高。 项目中文名:狗屁不通文章生成器 项目英文名:BullshitGenerator 根据作者的介绍,他是偶尔需要一些中文文字用于GUI开发时测试文本渲染,因此开发了这个废话生成器。但由于生成的废话实在是太过富于哲理,所以最近已经被小伙伴们给玩坏了。 他的文风可能是这样的: 你发现,...
程序员:我终于知道post和get的区别
是一个老生常谈的话题,然而随着不断的学习,对于以前的认识有很多误区,所以还是需要不断地总结的,学而时习之,不亦说乎
GitHub标星近1万:只需5秒音源,这个网络就能实时“克隆”你的声音
作者 | Google团队 译者 | 凯隐 编辑 | Jane 出品 | AI科技大本营(ID:rgznai100) 本文中,Google 团队提出了一种文本语音合成(text to speech)神经系统,能通过少量样本学习到多个不同说话者(speaker)的语音特征,并合成他们的讲话音频。此外,对于训练时网络没有接触过的说话者,也能在不重新训练的情况下,仅通过未知...
《程序人生》系列-这个程序员只用了20行代码就拿了冠军
你知道的越多,你不知道的越多 点赞再看,养成习惯GitHub上已经开源https://github.com/JavaFamily,有一线大厂面试点脑图,欢迎Star和完善 前言 这一期不算《吊打面试官》系列的,所有没前言我直接开始。 絮叨 本来应该是没有这期的,看过我上期的小伙伴应该是知道的嘛,双十一比较忙嘛,要值班又要去帮忙拍摄年会的视频素材,还得搞个程序员一天的Vlog,还要写BU...
加快推动区块链技术和产业创新发展,2019可信区块链峰会在京召开
11月8日,由中国信息通信研究院、中国通信标准化协会、中国互联网协会、可信区块链推进计划联合主办,科技行者协办的2019可信区块链峰会将在北京悠唐皇冠假日酒店开幕。   区块链技术被认为是继蒸汽机、电力、互联网之后,下一代颠覆性的核心技术。如果说蒸汽机释放了人类的生产力,电力解决了人类基本的生活需求,互联网彻底改变了信息传递的方式,区块链作为构造信任的技术有重要的价值。   1...
程序员把地府后台管理系统做出来了,还有3.0版本!12月7号最新消息:已在开发中有github地址
第一幕:缘起 听说阎王爷要做个生死簿后台管理系统,我们派去了一个程序员…… 996程序员做的梦: 第一场:团队招募 为了应对地府管理危机,阎王打算找“人”开发一套地府后台管理系统,于是就在地府总经办群中发了项目需求。 话说还是中国电信的信号好,地府都是满格,哈哈!!! 经常会有外行朋友问:看某网站做的不错,功能也简单,你帮忙做一下? 而这次,面对这样的需求,这个程序员...
网易云6亿用户音乐推荐算法
网易云音乐是音乐爱好者的集聚地,云音乐推荐系统致力于通过 AI 算法的落地,实现用户千人千面的个性化推荐,为用户带来不一样的听歌体验。 本次分享重点介绍 AI 算法在音乐推荐中的应用实践,以及在算法落地过程中遇到的挑战和解决方案。 将从如下两个部分展开: AI算法在音乐推荐中的应用 音乐场景下的 AI 思考 从 2013 年 4 月正式上线至今,网易云音乐平台持续提供着:乐屏社区、UGC...
【技巧总结】位运算装逼指南
位算法的效率有多快我就不说,不信你可以去用 10 亿个数据模拟一下,今天给大家讲一讲位运算的一些经典例子。不过,最重要的不是看懂了这些例子就好,而是要在以后多去运用位运算这些技巧,当然,采用位运算,也是可以装逼的,不信,你往下看。我会从最简单的讲起,一道比一道难度递增,不过居然是讲技巧,那么也不会太难,相信你分分钟看懂。 判断奇偶数 判断一个数是基于还是偶数,相信很多人都做过,一般的做法的代码如下...
【管理系统课程设计】美少女手把手教你后台管理
【文章后台管理系统】URL设计与建模分析+项目源码+运行界面 栏目管理、文章列表、用户管理、角色管理、权限管理模块(文章最后附有源码) 1. 这是一个什么系统? 1.1 学习后台管理系统的原因 随着时代的变迁,现如今各大云服务平台横空出世,市面上有许多如学生信息系统、图书阅读系统、停车场管理系统等的管理系统,而本人家里就有人在用烟草销售系统,直接在网上完成挑选、购买与提交收货点,方便又快捷。 试想,若没有烟草销售系统,本人家人想要购买烟草,还要独自前往药...
4G EPS 第四代移动通信系统
目录 文章目录目录4G 与 LTE/EPCLTE/EPC 的架构E-UTRANE-UTRAN 协议栈eNodeBEPCMMES-GWP-GWHSSLTE/EPC 协议栈概览 4G 与 LTE/EPC 4G,即第四代移动通信系统,提供了 3G 不能满足的无线网络宽带化,主要提供数据(上网)业务。而 LTE(Long Term Evolution,长期演进技术)是电信领域用于手机及数据终端的高速无线通...
日均350000亿接入量,腾讯TubeMQ性能超过Kafka
整理 | 夕颜出品 | AI科技大本营(ID:rgznai100)【导读】近日,腾讯开源动作不断,相继开源了分布式消息中间件TubeMQ,基于最主流的 OpenJDK8开发的Tencent Kona JDK,分布式HTAP数据库 TBase,企业级容器平台TKEStack,以及高性能图计算框架Plato。短短一周之内,腾讯开源了五大重点项目。其中,TubeMQ是腾讯大数据平台部门应用的核心组件,...
相关热词 c# 二进制截断字符串 c#实现窗体设计器 c#检测是否为微信 c# plc s1200 c#里氏转换原则 c# 主界面 c# do loop c#存为组套 模板 c# 停掉协程 c# rgb 读取图片
立即提问