安装gtk+./configure时报错

configure:error: pangox Pango backend is required for x11 target

1个回答

Csdn user default icon
上传中...
上传图片
插入图片
抄袭、复制答案,以达到刷声望分或其他目的的行为,在CSDN问答是严格禁止的,一经发现立刻封号。是时候展现真正的技术了!
其他相关推荐
安装gtk+./configure时报错
configure:error: pangox Pango backend is required for x11 target
ubuntu编译./configure错误
configure: error: Library requirements (libgnome-2.0 >= 2.0.0 libgnomeui-2.0 >= 2.0.0 gtk+-2.0 >= 2.4.0 gnome-vfs-2.0 >= 2.6.0 libglade-2.0 >= 2.3.6) not met; consider adjusting the PKG_CONFIG_PATH environment variable if your libraries are in a nonstandard prefix so pkg-config can find them.
在ubuntu下编译一个开源软件,./configure时出现错误,求指教
显示的错误: checking for libgnome-2.0 >= 2.0.0 libgnomeui-2.0 >= 2.0.0 gtk+-2.0 >= 2.4.0 gnome-vfs-2.0 >= 2.6.0 libglade-2.0 >= 2.3.6... Package libgnome-2.0 was not found in the pkg-config search path. Perhaps you should add the directory containing `libgnome-2.0.pc' to the PKG_CONFIG_PATH environment variable No package 'libgnome-2.0' found Package libgnomeui-2.0 was not found in the pkg-config search path. Perhaps you should add the directory containing `libgnomeui-2.0.pc' to the PKG_CONFIG_PATH environment variable No package 'libgnomeui-2.0' found Package gnome-vfs-2.0 was not found in the pkg-config search path. Perhaps you should add the directory containing `gnome-vfs-2.0.pc' to the PKG_CONFIG_PATH environment variable No package 'gnome-vfs-2.0' found configure: error: Library requirements (libgnome-2.0 >= 2.0.0 libgnomeui-2.0 >= 2.0.0 gtk+-2.0 >= 2.4.0 gnome-vfs-2.0 >= 2.6.0 libglade-2.0 >= 2.3.6) not met; consider adjusting the PKG_CONFIG_PATH environment variable if your libraries are in a nonstandard prefix so pkg-config can find them. 可是找不到这些.pc文件,把缺少的.pc文件安装上去,在安装时会缺少其他文件。 不知道该怎么办
如何在Lubuntu下快速安装glade
刚安装的Lubuntu14.04系统,然后载好glade包,解包,安装,./configure的时候,提示错误,说是gtk之类的版本太低,然后载了最新版的gtk安装,./configure的时候,又提示别的什么版本太低。是不是我安装完系统之后,环境没有搭建好,所以很多库或者软件没有或者版本太低?求大神指点啊!
ubuntu下NS3使用“./test.py -c core”命令测试一直报错,求大神帮忙
Build failed -> task in 'test-runner' failed (exit status 1): {task 140009040312272: cxx test-runner.cc -> test-runner.cc.1.o} ['/usr/bin/g++', '-O3', '-g', '-Wall', '-Werror', '-march=native', '-fstrict-overflow', '-Wno-error=deprecated-declarations', '-fstrict-aliasing', '-Wstrict-aliasing', '-pthread', '-pthread', '-I.', '-I..', '-I/usr/include/gtk-2.0', '-I/usr/lib/x86_64-linux-gnu/gtk-2.0/include', '-I/usr/include/gio-unix-2.0', '-I/usr/include/cairo', '-I/usr/include/pango-1.0', '-I/usr/include/atk-1.0', '-I/usr/include/pixman-1', '-I/usr/include/libpng12', '-I/usr/include/gdk-pixbuf-2.0', '-I/usr/include/harfbuzz', '-I/usr/include/glib-2.0', '-I/usr/lib/x86_64-linux-gnu/glib-2.0/include', '-I/usr/include/freetype2', '-DNS3_BUILD_PROFILE_OPTIMIZED', '-DHAVE_SYS_IOCTL_H=1', '-DHAVE_IF_NETS_H=1', '-DHAVE_NET_ETHERNET_H=1', '-DHAVE_PACKET_H=1', '-DHAVE_IF_TUN_H=1', '-DHAVE_SQLITE3=1', '-DHAVE_GTK2=1', '../utils/test-runner.cc', '-c', '-o', '/home/chenhl/ns-allinone-3.25/ns-3.25/build/utils/test-runner.cc.1.o'] Waf died. Not running tests
关于 Mac 上用 Homebrew 更新软件后无效的问题求助
半年以前可以用的 gtk+3 发现现在不能用了,用 homebrew 把所有软件更新了一道之后再编译就显示如下问题: ``` $ gcc -o test1 test.c `pkg-config --libs --cflags gtk+-3.0` Package 'gdk-3.0' requires 'cairo >= 1.14.0' but version of cairo is 1.12.16 test.c:1:10: fatal error: 'gtk/gtk.h' file not found #include <gtk/gtk.h> ^ 1 error generated. ``` 但是我检查我的 cairo 版本发现已经是最新的 1.14.6 ``` e$ brew list cairo /usr/local/Cellar/cairo/1.14.6/bin/cairo-sphinx /usr/local/Cellar/cairo/1.14.6/bin/cairo-trace /usr/local/Cellar/cairo/1.14.6/include/cairo/ (14 files) /usr/local/Cellar/cairo/1.14.6/lib/libcairo-gobject.2.dylib /usr/local/Cellar/cairo/1.14.6/lib/libcairo-script-interpreter.2.dylib /usr/local/Cellar/cairo/1.14.6/lib/libcairo.2.dylib /usr/local/Cellar/cairo/1.14.6/lib/cairo/ (9 files) /usr/local/Cellar/cairo/1.14.6/lib/pkgconfig/ (13 files) /usr/local/Cellar/cairo/1.14.6/lib/ (6 other files) /usr/local/Cellar/cairo/1.14.6/share/gtk-doc/ (65 files) ``` 表示要疯了 XD
JNI 运行错误 symbol lookup error
```sh /usr/lib/jvm/java-6-openjdk-amd64/bin/java -Djava.library.path=../cef-swt-gtk-linux-x86_64-native/ -cp ./target/classes:./target/test-classes:$HOME/.m2/repository/org/eclipse/swt/org.eclipse.swt.gtk.linux.x86_64/3.7.2/org.eclipse.swt.gtk.linux.x86_64-3.7.2.jar com.zxg.cef.swt.test.TestWindow ``` 错误: /usr/lib/jvm/java-6-openjdk-amd64/bin/java: symbol lookup error: /home/xxx/code/workspace/eclipse_workspace/cef-swt-gtk-linux-x86_64-native/libcef-swt-gtk-linux-x86_64.so: undefined symbol: _Z13CefInitializeRK11CefMainArgsRK13CefStructBaseI17CefSettingsTraitsE9CefRefPtrI6CefAppE makefile: ```makefile OBJS = cef-swt-gtk-linux-x86_64.o JAVA_HOME = /usr/lib/jvm/java-6-openjdk-amd64 CXXFLAGS = -fPIC -Wall -fmessage-length=0 -I$(JAVA_HOME)/include -I/usr/local/include/cef3 `pkg-config --cflags gtk+-2.0` LIBS = -lcef -lffmpegsumo `pkg-config --libs gtk+-2.0` LDFLAGS := -shared -fpic -Wl,-rpath,/usr/local/lib CXX = g++ TARGET = libcef-swt-gtk-linux-x86_64.so $(TARGET): $(OBJS) $(CXX) $(LDFLAGS) -o $(TARGET) $(OBJS) $(LIBS) all: $(TARGET) ../cef-swt-gtk-linux-x86_64/target/classes/com/zxg/cef/swt/Cef.class: ../cef-swt-gtk-linux-x86_64/src/main/java/com/zxg/cef/swt/Cef.java mvn -f ../cef-swt-gtk-linux-x86_64/pom.xml compile com_zxg_cef_swt_Cef.h: ../cef-swt-gtk-linux-x86_64/target/classes/com/zxg/cef/swt/Cef.class $(JAVA_HOME)/bin/javah -classpath ../cef-swt-gtk-linux-x86_64/target/classes com.zxg.cef.swt.Cef cef-swt-gtk-linux-x86_64.o: cef-swt-gtk-linux-x86_64.cpp com_zxg_cef_swt_Cef.h $(CXX) $(CXXFLAGS) -c -o cef-swt-gtk-linux-x86_64.o cef-swt-gtk-linux-x86_64.cpp clean: rm -f $(OBJS) $(TARGET) ```
求问ubuntu 13.10下ns3.8安装遇到python2.7-config意外停止
运行./build.py时,报错说“对不起,应用程序i386-linux-gnu-python2.7-config意外停止” 所以就build failed,遇见错误的地方如下: # Build NS-3 Entering directory `./ns-3.8' Note: configuring ns-3 without NSC => python waf configure --with-regression-traces ../ns-3.8-ref-traces --with-pybindgen ../pybindgen-0.14.1 Checking for program gcc or cc : /usr/bin/gcc Checking for program cpp : /usr/bin/cpp Checking for program ar : /usr/bin/ar Checking for program ranlib : /usr/bin/ranlib Checking for gcc : ok Checking for program g++ or c++ : /usr/bin/g++ Checking for program ar : /usr/bin/ar Checking for program ranlib : /usr/bin/ranlib Checking for g++ : ok Checking for program pkg-config : /usr/bin/pkg-config Checking for regression traces location : ok ../ns-3.8-ref-traces (given) Checking for -Wl,--soname=foo support : yes Checking for header stdlib.h : yes Checking for header signal.h : yes Checking for header pthread.h : yes Checking for high precision time implementation : 128-bit integer Checking for header stdint.h : yes Checking for header inttypes.h : yes Checking for header sys/inttypes.h : not found Checking for library rt : yes Checking for header netpacket/packet.h : yes Checking for header linux/if_tun.h : yes Checking for pkg-config flags for GTK_CONFIG_STORE : ok Checking for pkg-config flags for LIBXML2 : ok Checking for library sqlite3 : yes Checking for NSC location : not found Checking for header sys/socket.h : yes Checking for header netinet/in.h : yes Checking for program python : /usr/bin/python Checking for Python version >= 2.3 : ok 2.7.5 Checking for library python2.7 : yes Checking for program python2.7-config : /usr/bin/python2.7-config File "/usr/bin/python2.7-config", line 5 echo "Usage: $0 --prefix|--exec-prefix|--includes|--libs|--cflags|--ldflags|--extension-suffix|--help|--configdir" ^ SyntaxError: invalid syntax Traceback (most recent call last): File "waf", line 158, in <module> Scripting.prepare(t, cwd, VERSION, wafdir) File "/home/daisy/workspace/eclipseWorkspace/ns3.8/ns-3.8/.waf-1.5.16-e6d03192b5ddfa5ef2c8d65308e48e42/wafadmin/Scripting.py", line 105, in prepare prepare_impl(t,cwd,ver,wafdir)
Ubuntu 16.04 编译 Ncurses 6.0 报错
### Ubuntu 16.04 LTS 编译 Ncurses 6.0 报错: ``` In file included from ./curses.priv.h:325:0, from ../ncurses/lib_gen.c:19: _24273.c:843:15: error: expected ‘)’ before ‘int’ ../include/curses.h:1631:56: note: in definition of macro ‘mouse_trafo’ #define mouse_trafo(y,x,to_screen) wmouse_trafo(stdscr,y,x,to_screen) ^ Makefile:962: recipe for target '../objects/lib_gen.o' failed make[1]: *** [../objects/lib_gen.o] Error 1 make[1]: Leaving directory '/home/netsamir/Sofware/Tmux/ncurses-6.0/ncurses' Makefile:113: recipe for target 'all' failed make: *** [all] Error 2 ``` ### 系统配置 ``` $ lsb_release -a No LSB modules are available. Distributor ID: Ubuntu Description: Ubuntu 16.04 LTS Release: 16.04 Codename: xenial $ gcc -v Using built-in specs. COLLECT_GCC=gcc COLLECT_LTO_WRAPPER=/usr/lib/gcc/x86_64-linux-gnu/5/lto-wrapper Target: x86_64-linux-gnu Configured with: ../src/configure -v --with-pkgversion='Ubuntu 5.4.0-6ubuntu1~16.04.4' --with-bugurl=file:///usr/share/doc/gcc-5/README.Bugs --enable-languages=c,ada,c++,java,go,d,fortran,objc,obj-c++ --prefix=/usr --program-suffix=-5 --enable-shared --enable-linker-build-id --libexecdir=/usr/lib --without-included-gettext --enable-threads=posix --libdir=/usr/lib --enable-nls --with-sysroot=/ --enable-clocale=gnu --enable-libstdcxx-debug --enable-libstdcxx-time=yes --with-default-libstdcxx-abi=new --enable-gnu-unique-object --disable-vtable-verify --enable-libmpx --enable-plugin --with-system-zlib --disable-browser-plugin --enable-java-awt=gtk --enable-gtk-cairo --with-java-home=/usr/lib/jvm/java-1.5.0-gcj-5-amd64/jre --enable-java-home --with-jvm-root-dir=/usr/lib/jvm/java-1.5.0-gcj-5-amd64 --with-jvm-jar-dir=/usr/lib/jvm-exports/java-1.5.0-gcj-5-amd64 --with-arch-directory=amd64 --with-ecj-jar=/usr/share/java/eclipse-ecj.jar --enable-objc-gc --enable-multiarch --disable-werror --with-arch-32=i686 --with-abi=m64 --with-multilib-list=m32,m64,mx32 --enable-multilib --with-tune=generic --enable-checking=release --build=x86_64-linux-gnu --host=x86_64-linux-gnu --target=x86_64-linux-gnu Thread model: posix gcc version 5.4.0 20160609 (Ubuntu 5.4.0-6ubuntu1~16.04.4) $ g++ -v Using built-in specs. COLLECT_GCC=g++ COLLECT_LTO_WRAPPER=/usr/lib/gcc/x86_64-linux-gnu/5/lto-wrapper Target: x86_64-linux-gnu Configured with: ../src/configure -v --with-pkgversion='Ubuntu 5.4.0-6ubuntu1~16.04.4' --with-bugurl=file:///usr/share/doc/gcc-5/README.Bugs --enable-languages=c,ada,c++,java,go,d,fortran,objc,obj-c++ --prefix=/usr --program-suffix=-5 --enable-shared --enable-linker-build-id --libexecdir=/usr/lib --without-included-gettext --enable-threads=posix --libdir=/usr/lib --enable-nls --with-sysroot=/ --enable-clocale=gnu --enable-libstdcxx-debug --enable-libstdcxx-time=yes --with-default-libstdcxx-abi=new --enable-gnu-unique-object --disable-vtable-verify --enable-libmpx --enable-plugin --with-system-zlib --disable-browser-plugin --enable-java-awt=gtk --enable-gtk-cairo --with-java-home=/usr/lib/jvm/java-1.5.0-gcj-5-amd64/jre --enable-java-home --with-jvm-root-dir=/usr/lib/jvm/java-1.5.0-gcj-5-amd64 --with-jvm-jar-dir=/usr/lib/jvm-exports/java-1.5.0-gcj-5-amd64 --with-arch-directory=amd64 --with-ecj-jar=/usr/share/java/eclipse-ecj.jar --enable-objc-gc --enable-multiarch --disable-werror --with-arch-32=i686 --with-abi=m64 --with-multilib-list=m32,m64,mx32 --enable-multilib --with-tune=generic --enable-checking=release --build=x86_64-linux-gnu --host=x86_64-linux-gnu --target=x86_64-linux-gnu Thread model: posix gcc version 5.4.0 20160609 (Ubuntu 5.4.0-6ubuntu1~16.04.4) ```
·Robotframework」运行ride.py 报错 麻烦大神们看一下!
环境:Ubuntu 16.04 折腾了好久pip install robotframework-ride 才成功 运行ride.py又又又报错了 心累 麻烦各位帮我看看 指点迷津 ``` pip install robotframework-ride 提示 Looking in indexes: https://pypi.tuna.tsinghua.edu.cn/simple Requirement already satisfied: robotframework-ride in /usr/local/lib/python2.7/dist-packages (1.7.4b1.dev1) Requirement already satisfied: wxPython in /usr/lib/python2.7/dist-packages/wx-2.8-gtk2-unicode (from robotframework-ride) (2.8.12.1) Requirement already satisfied: PyPubSub in /usr/local/lib/python2.7/dist-packages (from robotframework-ride) (3.3.0) Requirement already satisfied: Pygments in /usr/local/lib/python2.7/dist-packages (from robotframework-ride) (2.4.2 ``` ``` ride.py后 ``` ![图片说明](https://img-ask.csdn.net/upload/201907/18/1563447987_206124.png) 报错:Traceback (most recent call last): File "/usr/local/lib/python2.7/dist-packages/robotide/__init__.py", line 83, in main _run(inpath, not noupdatecheck, debug_console) File "/usr/local/lib/python2.7/dist-packages/robotide/__init__.py", line 112, in _run ride = RIDE(inpath, updatecheck) File "/usr/local/lib/python2.7/dist-packages/robotide/application/application.py", line 45, in __init__ wx.App.__init__(self, redirect=False) File "/usr/lib/python2.7/dist-packages/wx-2.8-gtk2-unicode/wx/_core.py", line 7981, in __init__ self._BootstrapApp() File "/usr/lib/python2.7/dist-packages/wx-2.8-gtk2-unicode/wx/_core.py", line 7555, in _BootstrapApp return _core_.PyApp__BootstrapApp(*args, **kwargs) File "/usr/local/lib/python2.7/dist-packages/robotide/application/application.py", line 55, in OnInit self.frame = RideFrame(self, self._controller) File "/usr/local/lib/python2.7/dist-packages/robotide/ui/mainframe.py", line 173, in __init__ self.Bind(wx.EVT_DIRCTRL_FILEACTIVATED, self.OnOpenFile) AttributeError: 'module' object has no attribute 'EVT_DIRCTRL_FILEACTIVATED' 麻烦各位了!!非常感谢!!
关于GTK问题,GtkGrid控件无法定义
![图片说明](https://img-ask.csdn.net/upload/201501/28/1422458623_601006.png) 上面的图上显示我的GTK版本是3.* 不过我也有安装2.* ![图片说明](https://img-ask.csdn.net/upload/201501/28/1422458689_43178.png) 这张图是我code::blocks的设置 ![图片说明](https://img-ask.csdn.net/upload/201501/28/1422458764_821879.png) 那么问题来了,如上图所示,我不能定义GtkGrid类型的空间。求解。
通过MakeFile文件了解项目目录结构,编写CMake的CMakelist.txt文件方法。
主项目: CC = gcc CFLAGS += -O3 BIN_DIR = ./bin SRC_DIR = ./src DOC_DIR = ./docs INC_DIR = ./include LIB_DIR = ./lib BIN = siftfeat match dspfeat all: $(BIN) libopensift.a docs docs: doxygen Doxyfile libopensift.a: make -C $(SRC_DIR) $@ $(BIN): make -C $(SRC_DIR) $@ clean: make -C $(SRC_DIR) $@; \ make -C $(INC_DIR) $@; \ distclean: clean rm -f $(LIB_DIR)/* rm -f $(BIN_DIR)/* docsclean: rm -rf $(DOC_DIR)/html/ .PHONY: docs clean docsclean libopensift.a scr文件: CC = gcc CFLAGS += BIN_DIR = ../bin INC_DIR = ../include LIB_DIR = ../lib INCL = -I$(INC_DIR) `pkg-config --cflags opencv gtk+-2.0` LIBS = -L$(LIB_DIR) -lopensift -lm `pkg-config --libs opencv gtk+-2.0` OBJ = imgfeatures.o utils.o sift.o kdtree.o minpq.o xform.o BIN = siftfeat match dspfeat all: $(BIN) libopensift.a libopensift.a: $(OBJ) ar rc $(LIB_DIR)/$@ $(OBJ) ranlib $(LIB_DIR)/$@ siftfeat: libopensift.a siftfeat.c $(CC) $(CFLAGS) $(INCL) siftfeat.c -o $(BIN_DIR)/$@ $(LIBS) match: libopensift.a match.c $(CC) $(CFLAGS) $(INCL) match.c -o $(BIN_DIR)/$@ $(LIBS) dspfeat: libopensift.a dspfeat.c $(CC) $(CFLAGS) $(INCL) dspfeat.c -o $(BIN_DIR)/$@ $(LIBS) imgfeatures.o: imgfeatures.c $(INC_DIR)/imgfeatures.h $(CC) $(CFLAGS) $(INCL) -c imgfeatures.c -o $@ utils.o: utils.c $(INC_DIR)/utils.h $(CC) $(CFLAGS) $(INCL) -c utils.c -o $@ sift.o: sift.c $(INC_DIR)/sift.h $(CC) $(CFLAGS) $(INCL) -c sift.c -o $@ kdtree.o: kdtree.c $(INC_DIR)/kdtree.h $(CC) $(CFLAGS) $(INCL) -c kdtree.c -o $@ minpq.o: minpq.c $(INC_DIR)/minpq.h $(CC) $(CFLAGS) $(INCL) -c minpq.c -o $@ xform.o: xform.c $(INC_DIR)/xform.h $(CC) $(CFLAGS) $(INCL) -c xform.c -o $@ clean: rm -f *~ *.o core .PHONY: clean include文件: clean: rm -f *~ .PHONY: clean
linux中安装的eclipse怎么启动
我的虚拟机系统是centos7,在计算机/home下是我的eclipse安装目录,网上都说按下面目录可以启动eclipse [root@localhost ~]# cd /home [root@localhost home]# ls dxx eclipse eclipse-jee-galileo-SR2-linux-gtk.tar.gz [root@localhost home]# cd/eclipse bash: cd/eclipse: 没有那个文件或目录 [root@localhost home]# cd eclipse [root@localhost eclipse]# ls about_files configuration eclipse.ini icon.xpm p2 about.html dropins epl-v10.html libcairo-swt.so plugins artifacts.xml eclipse features notice.html readme [root@localhost eclipse]# ./eclipse bash: ./eclipse: /lib/ld-linux.so.2: bad ELF interpreter: 没有那个文件或目录 [root@localhost eclipse]# 但是我的运行效果如上并没有启动eclipse。哪位前辈帮忙解答一下,多谢 另:我是新手刚开始接触linux,希望说的越详细越好
linux下gtk的库文件有很多,不知道哪一个是我用的
我做的应用运行在手持终端,基于一个精简的Linux系统。 用的gcc-arm-linux交叉编译工具 现在我就想搞清楚头文件和库文件在哪里,makefile脚本很复杂而且有很多文件,完全看不懂,只能凭目录名称去找。。。 头文件在/usr/local/arm-linux/include/gtk/下 库文件用locate libgtk查找有一大堆,目测有关系的有下面这些: /usr/local/arm-linux/arm-linux/lib/libgtk-x11-2.0.so /usr/local/arm-linux/arm-linux/lib/libgtk-x11-2.0.so.0 /usr/local/arm-linux/arm-linux/lib/libgtk-x11-2.0.so.0.600.8 /usr/local/arm-linux/arm-linux/lib/libgtkstylus.so /usr/local/arm-linux/arm-linux/lib/libgtkstylus.so.0 /usr/local/arm-linux/arm-linux/lib/libgtkstylus.so.0.0.0 我要如何才能确定哪一个是编译时依赖的库? 有必要把makefile脚本贴出来吗?
请问如何解决ubunt14.04配置opencv报错(虚拟机)(gedit:11818)
按配置教程是要: 安装完成后需要对系统相关环境变量进行配置: sudo gedit /etc/ld.so.conf.d/opencv.conf 将以下内容添加到最后: /usr/local/lib 报错如下,输入sudo gedit /etc/ld.so.conf.d/opencv.conf后打开了一个文件,在里面我输入了/usr/local/lib,出现报错: (gedit:11818): IBUS-WARNING **: The owner of /home/aa/.config/ibus/bus is not root!  (gedit:11818): Gtk-WARNING **: Calling Inhibit failed: GDBus.Error:org.freedesktop.DBus.Error.ServiceUnknown: The name org.gnome.SessionManager was not provided by any .service files 谢谢
运行基于qt的opencv程序时提示安装libgt2.0-dev
OpenCV Error: Unspecified error (The function is not implemented. Rebuild the library with Windows, GTK+ 2.x or Carbon support. If you are on Ubuntu or Debian, install libgtk2.0-dev and pkg-config, then re-run cmake or configure script) in cvNamedWindow, file /work/tools/OpenCV-2.3.1/modules/highgui/src/window.cpp, line 275 terminate called after throwing an instance of 'cv::Exception' what(): /work/tools/OpenCV-2.3.1/modules/highgui/src/window.cpp:275: error: (-2) The function is not implemented. Rebuild the library with Windows, GTK+ 2.x or Carbon support. If you are on Ubuntu or Debian, install libgtk2.0-dev and pkg-config, then re-run cmake or configure script in function cvNamedWindow 可是我这是用qmake编译出来的可执行文件啊,为什么还要安装gtk?另外我安装了pkg-config,qte的移植经测试也是正确的
Ubuntu启动 eclipse 失败 JVM terminated. Exit code=13
错误码: JVM terminated. Exit code=13 /usr/java/jdk1.8.0_20/bin/java -Dosgi.requiredJavaVersion=1.7 -XX:MaxPermSize=256m -Xms40m -Xmx512m -jar /opt/eclipse//plugins/org.eclipse.equinox.launcher_1.3.100.v20150511-1540.jar -os linux -ws gtk -arch x86_64 -showsplash /opt/eclipse//plugins/org.eclipse.platform_4.5.0.v20150603-2000/splash.bmp -launcher /opt/eclipse/eclipse -name Eclipse --launcher.library /opt/eclipse//plugins/org.eclipse.equinox.launcher.gtk.linux.x86_64_1.1.300.v20150602-1417/eclipse_1612.so -startup /opt/eclipse//plugins/org.eclipse.equinox.launcher_1.3.100.v20150511-1540.jar --launcher.appendVmargs -exitdata 33800f -product org.eclipse.epp.package.jee.product -vm /usr/java/jdk1.8.0_20/bin/java -vmargs -Dosgi.requiredJavaVersion=1.7 -XX:MaxPermSize=256m -Xms40m -Xmx512m -jar /opt/eclipse//plugins/org.eclipse.equinox.launcher_1.3.100.v20150511-1540.jar jdk和eclipse均为64位..系统为Ubuntu 15.04
各位朋友好,请教ubuntu系统python3.4环境下安装matplotlib报错的解决办法
具体的问题是这样的: 我的系统是Ubuntu14.04 的64位系统,python3.4版本下,想使用matplotlib来做图。 由于matplotlib依赖numpy和python的图像库PIL,因此我先安装numpy和PIL然后,再安装matplotlib, 这里附上我的安装matplotlib的shell命令 #安装科学计算库numpy sudo pip3 install numpy #安装图像处理库PIL sudo apt-get install python3.4-dev -y sudo apt-get install libjpeg8-dev zlib1g-dev libfreetype6-dev -y sudo ln -s /usr/lib/x86_64-linux-gnu/libjpeg.so /usr/lib sudo ln -s /usr/lib/x86_64-linux-gnu/libfreetype.so /usr/lib sudo ln -s /usr/lib/x86_64-linux-gnu/libz.so /usr/lib sudo apt-get install python3-pil #安装画图库matplotlib sudo pip3 install matplotlib 但是发现虽然安装成功(在python3的shell交互环境下, import matplotlib 是可以的),但是 执行如下语句 from matplotlib import pyplot as plt 报错: "/usr/local/lib/python3.4/dist-packages/matplotlib-1.5.1-py3.4-linux-x86_64.egg/matplotlib/backends/backend_gtk3.py", line 58, in <module> cursors.MOVE : Gdk.Cursor.new(Gdk.CursorType.FLEUR), TypeError: constructor returned NULL 希望各位朋友能指点一下,十分感谢
在Ubuntu下装ns-3,编译时总是中途出错,具体如下:
Build failed -> task failed (exit status 1): {task 139621304904464: cxx print-introspected-doxygen.cc -> print-introspected-doxygen.cc.4.o} ['/usr/bin/g++', '-O0', '-ggdb', '-g3', '-Wall', '-Werror', '-Wno-error=deprecated-declarations', '-fstrict-aliasing', '-Wstrict-aliasing', '-pthread', '-pthread', '-fno-strict-aliasing', '-fwrapv', '-fdebug-prefix-map=/build/python2.7-3hk45v/python2.7-2.7.15~rc1=.', '-fstack-protector-strong', '-fno-strict-aliasing', '-Ibuild', '-I.', '-I.', '-I/home/zhangzq/tarballs/ns-allinone-3.13', '-I/usr/include/gtk-2.0', '-I/usr/lib/x86_64-linux-gnu/gtk-2.0/include', '-I/usr/include/gio-unix-2.0', '-I/usr/include/cairo', '-I/usr/include/pango-1.0', '-I/usr/include/atk-1.0', '-I/usr/include/pixman-1', '-I/usr/include/gdk-pixbuf-2.0', '-I/usr/include/libpng16', '-I/usr/include/harfbuzz', '-I/usr/include/glib-2.0', '-I/usr/lib/x86_64-linux-gnu/glib-2.0/include', '-I/usr/include/freetype2', '-I/usr/include/libxml2', '-I/usr/include/python2.7', '-I/usr/include/x86_64-linux-gnu/python2.7', '-DNS3_ASSERT_ENABLE', '-DNS3_LOG_ENABLE', '-DSQLITE3=1', '-DHAVE_IF_TUN_H=1', '-DPYTHONDIR="/usr/local/lib/python2.7/dist-packages"', '-DPYTHONARCHDIR="/usr/local/lib/python2.7/dist-packages"', '-DHAVE_PYTHON_H=1', '-DENABLE_GSL', '-DNDEBUG', '-D_FORTIFY_SOURCE=2', '../utils/print-introspected-doxygen.cc', '-c', '-o', 'utils/print-introspected-doxygen.cc.4.o'] Traceback (most recent call last): File "./build.py", line 147, in <module> sys.exit(main(sys.argv)) File "./build.py", line 138, in main build_ns3(config, build_examples, build_tests, args, build_options) File "./build.py", line 61, in build_ns3 run_command([sys.executable, "waf", "build"] + build_options) File "/home/zhangzq/tarballs/ns-allinone-3.13/util.py", line 24, in run_command raise CommandError("Command %r exited with code %i" % (argv, retval)) util.CommandError: Command ['/usr/bin/python', 'waf', 'build'] exited with code 1
《奇巧淫技》系列-python!!每天早上八点自动发送天气预报邮件到QQ邮箱
将代码部署服务器,每日早上定时获取到天气数据,并发送到邮箱。 也可以说是一个小人工智障。 思路可以运用在不同地方,主要介绍的是思路。
Linux(服务器编程):15---两种高效的事件处理模式(reactor模式、proactor模式)
前言 同步I/O模型通常用于实现Reactor模式 异步I/O模型则用于实现Proactor模式 最后我们会使用同步I/O方式模拟出Proactor模式 一、Reactor模式 Reactor模式特点 它要求主线程(I/O处理单元)只负责监听文件描述符上是否有事件发生,有的话就立即将时间通知工作线程(逻辑单元)。除此之外,主线程不做任何其他实质性的工作 读写数据,接受新的连接,以及处...
为什么要学数据结构?
一、前言 在可视化化程序设计的今天,借助于集成开发环境可以很快地生成程序,程序设计不再是计算机专业人员的专利。很多人认为,只要掌握几种开发工具就可以成为编程高手,其实,这是一种误解。要想成为一个专业的开发人员,至少需要以下三个条件: 1) 能够熟练地选择和设计各种数据结构和算法 2) 至少要能够熟练地掌握一门程序设计语言 3) 熟知所涉及的相关应用领域的知识 其中,后两个条件比较容易实现,而第一个...
C语言魔塔游戏
很早就很想写这个,今天终于写完了。 游戏截图: 编译环境: VS2017 游戏需要一些图片,如果有想要的或者对游戏有什么看法的可以加我的QQ 2985486630 讨论,如果暂时没有回应,可以在博客下方留言,到时候我会看到。 下面我来介绍一下游戏的主要功能和实现方式 首先是玩家的定义,使用结构体,这个名字是可以自己改变的 struct gamerole { char n
进程通信方式总结与盘点
​ 进程通信是指进程之间的信息交换。这里需要和进程同步做一下区分,进程同步控制多个进程按一定顺序执行,进程通信是一种手段,而进程同步是目标。从某方面来讲,进程通信可以解决进程同步问题。 ​ 首先回顾下我们前面博文中讲到的信号量机制,为了实现进程的互斥与同步,需要在进程间交换一定的信息,因此信号量机制也可以被归为进程通信的一种方式,但是也被称为低级进程通信,主要原因为: 效率低:一次只可操作少量的...
究竟你适不适合买Mac?
我清晰的记得,刚买的macbook pro回到家,开机后第一件事情,就是上了淘宝网,花了500元钱,找了一个上门维修电脑的师傅,上门给我装了一个windows系统。。。。。。 表砍我。。。 当时买mac的初衷,只是想要个固态硬盘的笔记本,用来运行一些复杂的扑克软件。而看了当时所有的SSD笔记本后,最终决定,还是买个好(xiong)看(da)的。 已经有好几个朋友问我mba怎么样了,所以今天尽量客观
听说了吗?阿里双11作战室竟1根网线都没有
双11不光是购物狂欢节,更是对技术的一次“大考”,对于阿里巴巴企业内部运营的基础保障技术而言,亦是如此。 回溯双11历史,这背后也经历过“小米加步枪”的阶段:作战室从随处是网线,交换机放地上的“一地狼藉”;到如今媲美5G的wifi网速,到现场却看不到一根网线;从当年使用商用AP(无线路由器),让光明顶双11当天断网一分钟,到全部使用阿里自研AP……阿里巴巴企业智能事业部工程师们提供的基础保障...
在阿里,40岁的奋斗姿势
在阿里,40岁的奋斗姿势 在阿里,什么样的年纪可以称为老呢?35岁? 在云网络,有这样一群人,他们的平均年龄接近40,却刚刚开辟职业生涯的第二战场。 他们的奋斗姿势是什么样的呢? 洛神赋 “翩若惊鸿,婉若游龙。荣曜秋菊,华茂春松。髣髴兮若轻云之蔽月,飘飖兮若流风之回雪。远而望之,皎若太阳升朝霞;迫而察之,灼若芙蕖出渌波。” 爱洛神,爱阿里云 2018年,阿里云网络产品部门启动洛神2.0升...
关于研发效能提升的思考
研发效能提升是最近比较热门的一个话题,本人根据这几年的工作心得,做了一些思考总结,由于个人深度有限,暂且抛转引入。 三要素 任何生产力的提升都离不开这三个因素:人、流程和工具,少了其中任何一个因素都无法实现。 人,即思想,也就是古人说的“道”,道不同不相为谋,是制高点,也是高层建筑的基石。 流程,即方法,也是古人说的“法”。研发效能的提升,也就是要提高投入产出比,既要增加产出,也要减...
Python爬虫爬取淘宝,京东商品信息
小编是一个理科生,不善长说一些废话。简单介绍下原理然后直接上代码。 使用的工具(Python+pycharm2019.3+selenium+xpath+chromedriver)其中要使用pycharm也可以私聊我selenium是一个框架可以通过pip下载 pip install selenium -i https://pypi.tuna.tsinghua.edu.cn/simple/ 
阿里程序员写了一个新手都写不出的低级bug,被骂惨了。
这种新手都不会范的错,居然被一个工作好几年的小伙子写出来,差点被当场开除了。
Java工作4年来应聘要16K最后没要,细节如下。。。
前奏: 今天2B哥和大家分享一位前几天面试的一位应聘者,工作4年26岁,统招本科。 以下就是他的简历和面试情况。 基本情况: 专业技能: 1、&nbsp;熟悉Sping了解SpringMVC、SpringBoot、Mybatis等框架、了解SpringCloud微服务 2、&nbsp;熟悉常用项目管理工具:SVN、GIT、MAVEN、Jenkins 3、&nbsp;熟悉Nginx、tomca
2020年,冯唐49岁:我给20、30岁IT职场年轻人的建议
点击“技术领导力”关注∆  每天早上8:30推送 作者| Mr.K   编辑| Emma 来源| 技术领导力(ID:jishulingdaoli) 前天的推文《冯唐:职场人35岁以后,方法论比经验重要》,收到了不少读者的反馈,觉得挺受启发。其实,冯唐写了不少关于职场方面的文章,都挺不错的。可惜大家只记住了“春风十里不如你”、“如何避免成为油腻腻的中年人”等不那么正经的文章。 本文整理了冯
程序员该看的几部电影
##1、骇客帝国(1999) 概念:在线/离线,递归,循环,矩阵等 剧情简介: 不久的将来,网络黑客尼奥对这个看似正常的现实世界产生了怀疑。 他结识了黑客崔妮蒂,并见到了黑客组织的首领墨菲斯。 墨菲斯告诉他,现实世界其实是由一个名叫“母体”的计算机人工智能系统控制,人们就像他们饲养的动物,没有自由和思想,而尼奥就是能够拯救人类的救世主。 可是,救赎之路从来都不会一帆风顺,到底哪里才是真实的世界?
入职阿里5年,他如何破解“技术债”?
简介: 作者 | 都铎 作为一名技术人,你常常会听到这样的话: “先快速上线” “没时间改” “再缓一缓吧” “以后再解决” “先用临时方案处理” …… 当你埋下的坑越来越多,不知道哪天哪位同学就会踩上一颗雷。特别赞同“人最大的恐惧就是未知,当技术债可说不可见的时候,才是最让人不想解决的时候。” 作为一个程序员,我们反对复制粘贴,但是我们经常会见到相似的代码,相同的二方包,甚至整个代码...
Python绘图,圣诞树,花,爱心 | Turtle篇
每周每日,分享Python实战代码,入门资料,进阶资料,基础语法,爬虫,数据分析,web网站,机器学习,深度学习等等。 公众号回复【进群】沟通交流吧,QQ扫码进群学习吧 微信群 QQ群 1.画圣诞树 import turtle screen = turtle.Screen() screen.setup(800,600) circle = turtle.Turtle()...
作为一个程序员,CPU的这些硬核知识你必须会!
CPU对每个程序员来说,是个既熟悉又陌生的东西? 如果你只知道CPU是中央处理器的话,那可能对你并没有什么用,那么作为程序员的我们,必须要搞懂的就是CPU这家伙是如何运行的,尤其要搞懂它里面的寄存器是怎么一回事,因为这将让你从底层明白程序的运行机制。 随我一起,来好好认识下CPU这货吧 把CPU掰开来看 对于CPU来说,我们首先就要搞明白它是怎么回事,也就是它的内部构造,当然,CPU那么牛的一个东
破14亿,Python分析我国存在哪些人口危机!
2020年1月17日,国家统计局发布了2019年国民经济报告,报告中指出我国人口突破14亿。 猪哥的朋友圈被14亿人口刷屏,但是很多人并没有看到我国复杂的人口问题:老龄化、男女比例失衡、生育率下降、人口红利下降等。 今天我们就来分析一下我们国家的人口数据吧! 一、背景 1.人口突破14亿 2020年1月17日,国家统计局发布了 2019年国民经济报告 ,报告中指出:年末中国大陆总人口(包括31个
在家远程办公效率低?那你一定要收好这个「在家办公」神器!
相信大家都已经收到国务院延长春节假期的消息,接下来,在家远程办公可能将会持续一段时间。 但是问题来了。远程办公不是人在电脑前就当坐班了,相反,对于沟通效率,文件协作,以及信息安全都有着极高的要求。有着非常多的挑战,比如: 1在异地互相不见面的会议上,如何提高沟通效率? 2文件之间的来往反馈如何做到及时性?如何保证信息安全? 3如何规划安排每天工作,以及如何进行成果验收? ......
作为一个程序员,内存和磁盘的这些事情,你不得不知道啊!!!
截止目前,我已经分享了如下几篇文章: 一个程序在计算机中是如何运行的?超级干货!!! 作为一个程序员,CPU的这些硬核知识你必须会! 作为一个程序员,内存的这些硬核知识你必须懂! 这些知识可以说是我们之前都不太重视的基础知识,可能大家在上大学的时候都学习过了,但是嘞,当时由于老师讲解的没那么有趣,又加上这些知识本身就比较枯燥,所以嘞,大家当初几乎等于没学。 再说啦,学习这些,也看不出来有什么用啊!
2020年的1月,我辞掉了我的第一份工作
其实,这篇文章,我应该早点写的,毕竟现在已经2月份了。不过一些其它原因,或者是我的惰性、还有一些迷茫的念头,让自己迟迟没有试着写一点东西,记录下,或者说是总结下自己前3年的工作上的经历、学习的过程。 我自己知道的,在写自己的博客方面,我的文笔很一般,非技术类的文章不想去写;另外我又是一个还比较热衷于技术的人,而平常复杂一点的东西,如果想写文章写的清楚点,是需要足够...
别低估自己的直觉,也别高估自己的智商
所有群全部吵翻天,朋友圈全部沦陷,公众号疯狂转发。这两周没怎么发原创,只发新闻,可能有人注意到了。我不是懒,是文章写了却没发,因为大家的关注力始终在这次的疫情上面,发了也没人看。当然,我...
Java坑人面试题系列: 包装类(中级难度)
Java Magazine上面有一个专门坑人的面试题系列: https://blogs.oracle.com/javamagazine/quiz-2。 这些问题的设计宗旨,主要是测试面试者对Java语言的了解程度,而不是为了用弯弯绕绕的手段把面试者搞蒙。 如果你看过往期的问题,就会发现每一个都不简单。 这些试题模拟了认证考试中的一些难题。 而 “中级(intermediate)” 和 “高级(ad
深度学习入门笔记(十八):卷积神经网络(一)
欢迎关注WX公众号:【程序员管小亮】 专栏——深度学习入门笔记 声明 1)该文章整理自网上的大牛和机器学习专家无私奉献的资料,具体引用的资料请看参考文献。 2)本文仅供学术交流,非商用。所以每一部分具体的参考资料并没有详细对应。如果某部分不小心侵犯了大家的利益,还望海涵,并联系博主删除。 3)博主才疏学浅,文中如有不当之处,请各位指出,共同进步,谢谢。 4)此属于第一版本,若有错误,还需继续修正与...
这个世界上人真的分三六九等,你信吗?
偶然间,在知乎上看到一个问题 一时间,勾起了我深深的回忆。 以前在厂里打过两次工,做过家教,干过辅导班,做过中介。零下几度的晚上,贴过广告,满脸、满手地长冻疮。 再回首那段岁月,虽然苦,但让我学会了坚持和忍耐。让我明白了,在这个世界上,无论环境多么的恶劣,只要心存希望,星星之火,亦可燎原。 下文是原回答,希望能对你能有所启发。 如果我说,这个世界上人真的分三六九等,...
节后首个工作日,企业们集体开晨会让钉钉挂了
By 超神经场景描述:昨天 2 月 3 日,是大部分城市号召远程工作的第一天,全国有接近 2 亿人在家开始远程办公,钉钉上也有超过 1000 万家企业活跃起来。关键词:十一出行 人脸...
Java基础知识点梳理
Java基础知识点梳理 摘要: 虽然已经在实际工作中经常与java打交道,但是一直没系统地对java这门语言进行梳理和总结,掌握的知识也比较零散。恰好利用这段时间重新认识下java,并对一些常见的语法和知识点做个总结与回顾,一方面为了加深印象,方便后面查阅,一方面为了学好java打下基础。 Java简介 java语言于1995年正式推出,最开始被命名为Oak语言,由James Gosling(詹姆
2020年全新Java学习路线图,含配套视频,学完即为中级Java程序员!!
新的一年来临,突如其来的疫情打破了平静的生活! 在家的你是否很无聊,如果无聊就来学习吧! 世上只有一种投资只赚不赔,那就是学习!!! 传智播客于2020年升级了Java学习线路图,硬核升级,免费放送! 学完你就是中级程序员,能更快一步找到工作! 一、Java基础 JavaSE基础是Java中级程序员的起点,是帮助你从小白到懂得编程的必经之路。 在Java基础板块中有6个子模块的学
B 站上有哪些很好的学习资源?
哇说起B站,在小九眼里就是宝藏般的存在,放年假宅在家时一天刷6、7个小时不在话下,更别提今年的跨年晚会,我简直是跪着看完的!! 最早大家聚在在B站是为了追番,再后来我在上面刷欧美新歌和漂亮小姐姐的舞蹈视频,最近两年我和周围的朋友们已经把B站当作学习教室了,而且学习成本还免费,真是个励志的好平台ヽ(.◕ฺˇд ˇ◕ฺ;)ノ 下面我们就来盘点一下B站上优质的学习资源: 综合类 Oeasy: 综合
你也能看懂的:蒙特卡罗方法
蒙特卡罗方法,也称统计模拟方法,是1940年代中期由于科学技术的发展和电子计算机的发明,而提出的一种以概率统计理论为指导的数值计算方法。是指使用随机数(或更常见的伪随机数)来解决很多计算问题的方法 蒙特卡罗方法可以粗略地分成两类:一类是所求解的问题本身具有内在的随机性,借助计算机的运算能力可以直接模拟这种随机的过程。另一种类型是所求解问题可以转化为某种随机分布的特征数,比如随机事件出现的概率,或...
如何优雅地打印一个Java对象?
你好呀,我是沉默王二,一个和黄家驹一样身高,和刘德华一样颜值的程序员。虽然已经写了十多年的 Java 代码,但仍然觉得自己是个菜鸟(请允许我惭愧一下)。 在一个月黑风高的夜晚,我思前想后,觉得再也不能这么蹉跎下去了。于是痛下决心,准备通过输出的方式倒逼输入,以此来修炼自己的内功,从而进阶成为一名真正意义上的大神。与此同时,希望这些文章能够帮助到更多的读者,让大家在学习的路上不再寂寞、空虚和冷。 ...
相关热词 c# 压缩图片好麻烦 c#计算数组中的平均值 c#获取路由参数 c#日期精确到分钟 c#自定义异常必须继承 c#查表并返回值 c# 动态 表达式树 c# 监控方法耗时 c# listbox c#chart显示滚动条
立即提问