iOS打包错误 normal armv7 2C

遇到过这种自动打包错误没有呢?大神们

❌ clang: error: unable to execute command: Segmentation fault: 11

❌ clang: error: linker command failed due to signal (use -v to see invocation)

** ARCHIVE FAILED **

The following build commands failed:
Ld /Users/admin/Library/Developer/Xcode/DerivedData/STAdSDK-apbnitvgnkrwozgoldatmyapckfl/Build/Intermediates/ArchiveIntermediates/STAdTestApp/IntermediateBuildFilesPath/STAdSDK.build/Release-iphoneos/STAdTestApp.build/Objects-normal/armv7/STAdTestApp normal armv7
(1 failure)
[13:06:33]: Exit status: 65

[!] Error building the application - see the log above

2个回答

解决办法 把Architectures的debug改为NO就可以

u011583971
Kina美真 not work but 能解释一下你为什么这样做吗
3 年多之前 回复

你buid报错吗?只是archieve报错?而且你这错误信息太粗略了,无法判断问题。能否提供更详细的情况?

AsureSara
AsureSara 回复u011583971: 这问题解决了嘛
一年多之前 回复
u011583971
Kina美真 在本地archive 成功,使用脚本打包(脚本正确),没有接入支付宝分享SDK时,打包正确,接入了支付宝分享SDK后,本地archive没有问题,脚本打包打包出现了这个问题,给出的错误log就是上面的描述
3 年多之前 回复
Csdn user default icon
上传中...
上传图片
插入图片
抄袭、复制答案,以达到刷声望分或其他目的的行为,在CSDN问答是严格禁止的,一经发现立刻封号。是时候展现真正的技术了!
其他相关推荐
Xcode:关于armv7s的错误
在运行程序的时候报出的错误信息: Undefined symbols for architecture armv7s: "_CLLocationCoordinate2DMake", referenced from: -[DodgeDirectionsViewController viewDidLoad] in DodgeDirectionsViewController.o ld: symbol(s) not found for architecture armv7s clang: error: linker command failed with exit code 1 (use -v to see invocation) 这错误怎么来的?请高人帮忙解决一下,谢谢。
quick cocos 打包ios出错。请问如何解决 在线急等!!
Ld /Users/daixun/Library/Developer/Xcode/DerivedData/sgjsz-biqrybjofyxkyjcryxglyjtqiesi/Build/Intermediates/ArchiveIntermediates/sgjsz_app/IntermediateBuildFilesPath/sgjsz.build/Release-iphoneos/sgjsz_app.build/Objects-normal/armv7/sgjsz normal armv7 cd /Users/daixun/Desktop/mjzb/sgjsz/sgjsz export IPHONEOS_DEPLOYMENT_TARGET=6.0 export PATH="/Applications/Xcode.app/Contents/Developer/Platforms/iPhoneOS.platform/Developer/usr/bin:/Applications/Xcode.app/Contents/Developer/usr/bin:/usr/local/bin:/usr/bin:/bin:/usr/sbin:/sbin" /Applications/Xcode.app/Contents/Developer/Toolchains/XcodeDefault.xctoolchain/usr/bin/clang++ -arch armv7 -isysroot /Applications/Xcode.app/Contents/Developer/Platforms/iPhoneOS.platform/Developer/SDKs/iPhoneOS9.3.sdk -L/Users/daixun/Library/Developer/Xcode/DerivedData/sgjsz-biqrybjofyxkyjcryxglyjtqiesi/Build/Intermediates/ArchiveIntermediates/sgjsz_app/BuildProductsPath/Release-iphoneos -L/Users/daixun/Documents/quick-cocos2d-x-2.2.5-plus-release/lib/cocos2d-x/cocos2dx/platform/third_party/ios/libraries -L/Users/daixun/Documents/quick-cocos2d-x-2.2.5-plus-release/lib/cocos2d-x/scripting/lua/luajit/ios -L/Users/daixun/Documents/quick-cocos2d-x-2.2.5-plus-release/lib/cocos2d-x/external/libwebsockets/ios/lib -L/Users/daixun/Desktop/mjzb/sgjsz/sgjsz/lodoSdk -L/Users/daixun/Desktop/mjzb/sgjsz/sgjsz/sy34SDK -F/Users/daixun/Library/Developer/Xcode/DerivedData/sgjsz-biqrybjofyxkyjcryxglyjtqiesi/Build/Intermediates/ArchiveIntermediates/sgjsz_app/BuildProductsPath/Release-iphoneos -filelist /Users/daixun/Library/Developer/Xcode/DerivedData/sgjsz-biqrybjofyxkyjcryxglyjtqiesi/Build/Intermediates/ArchiveIntermediates/sgjsz_app/IntermediateBuildFilesPath/sgjsz.build/Release-iphoneos/sgjsz_app.build/Objects-normal/armv7/sgjsz.LinkFileList -miphoneos-version-min=6.0 -dead_strip -ObjC -stdlib=libc++ -fobjc-link-runtime -lstdc++ -lsqlite3.0 -lz -framework AssetsLibrary -framework CoreGraphics -llodoSdk -lpng /Users/daixun/Library/Developer/Xcode/DerivedData/sgjsz-biqrybjofyxkyjcryxglyjtqiesi/Build/Intermediates/ArchiveIntermediates/sgjsz_app/BuildProductsPath/Release-iphoneos/libquickcocos2dx.a -framework MediaPlayer -lz -framework UIKit -framework Foundation -weak_framework AdSupport -framework AudioToolbox -framework Security -framework QuartzCore -framework SystemConfiguration -weak_framework CoreTelephony -framework AddressBook -framework OpenGLES -framework CoreText /Users/daixun/Desktop/mjzb/sgjsz/sgjsz/sy34SDK/3344sy.a -framework StoreKit -framework MobileCoreServices -framework CFNetwork -framework OpenAL -framework AVFoundation -lfreetype -Xlinker -dependency_info -Xlinker /Users/daixun/Library/Developer/Xcode/DerivedData/sgjsz-biqrybjofyxkyjcryxglyjtqiesi/Build/Intermediates/ArchiveIntermediates/sgjsz_app/IntermediateBuildFilesPath/sgjsz.build/Release-iphoneos/sgjsz_app.build/Objects-normal/armv7/sgjsz_dependency_info.dat -o /Users/daixun/Library/Developer/Xcode/DerivedData/sgjsz-biqrybjofyxkyjcryxglyjtqiesi/Build/Intermediates/ArchiveIntermediates/sgjsz_app/IntermediateBuildFilesPath/sgjsz.build/Release-iphoneos/sgjsz_app.build/Objects-normal/armv7/sgjsz clang: error: no such file or directory: '/Users/daixun/Library/Developer/Xcode/DerivedData/sgjsz-biqrybjofyxkyjcryxglyjtqiesi/Build/Intermediates/ArchiveIntermediates/sgjsz_app/BuildProductsPath/Release-iphoneos/libquickcocos2dx.a'
Xcode armv7s的错误。。。。。
Undefined symbols for architecture armv7: "_GDLocalizedString", referenced from: -[QBAssetCollectionViewController done] in QBAssetCollectionViewController.o -[QBAssetCollectionViewController assetCell:canSelectAssetAtIndex:] in QBAssetCollectionViewController.o -[QBImagePickerController initWithNibName:bundle:] in QBImagePickerController.o ld: symbol(s) not found for architecture armv7 clang: error: linker command failed with exit code 1 (use -v to see invocation) 这个怎么解决啊,求大神指点
请问哪位大佬有tensorflow-1.12.0-cp27-none-linux_armv7l.whl呀?我这边下载不了
求文件:tensorflow-1.12.0-cp27-none-linux_armv7l.whl
Unity、iOS交互时,Unity调用iOS出错
Undefined symbols for architecture armv7: "__PressButton1", referenced from: RegisterMonoModules() in RegisterMonoModules.o "__PressButton0", referenced from: RegisterMonoModules() in RegisterMonoModules.o ld: symbol(s) not found for architecture armv7 clang: error: linker command failed with exit code 1 (use -v to see invocation) 求助 要怎么解决啊?
ios ZBar 二维码扫描。。。。
ld: warning: directory not found for option '-LZBarSDK' ld: '/Users/**/Documents/**/**/ios7 Scan QRCode/ZBarSDK-for-iOS-master/libzbar.a(ZBarReaderController.o)' does not contain bitcode. You must rebuild it with bitcode enabled (Xcode setting ENABLE_BITCODE), obtain an updated library from the vendor, or disable bitcode for this target. for architecture armv7 clang: error: linker command failed with exit code 1 (use -v to see invocation) 这个错误简直是无情,求大神教我怎么解决,我要疯了。。
编译好的linux驱动模块向android手机的linux内核中insmod时错误
我编写了一个helloworld.ko的驱动模块,编译成功后向手机中insmod时报错,错误提示为version magic '2.6.35.7_hi3716m mod_unload ARMv7 ' should be '3.3.6_hi3716m mod_unload ARMv7 p2v8 ',请问怎么解决?还有ARMv7后的p2v8是什么意思?
iOS配置编译ffmpeg无法编译成功
#!/bin/bash SDKVERSION="9.1" ARCHS="armv7 armv7s i386" DEVELOPER=`xcode-select -print-path` cd "`dirname \"$0\"`" REPOROOT=$(pwd) # where we will store intermediary builds INTERDIR="${REPOROOT}/built" mkdir -p $INTERDIR ######################################## # Exit the script if an error happens for ARCH in ${ARCHS} do if [ "${ARCH}" == "i386" ]; then PLATFORM="iPhoneSimulator" EXTRA_CONFIG="--arch=i386 --disable-asm --enable-cross-compile --target-os=darwin --cpu=i386" EXTRA_CFLAGS="-arch i386" EXTRA_LDFLAGS="-I${DEVELOPER}/Platforms/${PLATFORM}.platform/Developer/SDKs/${PLATFORM}${SDKVERSION}.sdk/usr/lib" else PLATFORM="iPhoneOS" EXTRA_CONFIG="--arch=arm --target-os=darwin --enable-cross-compile --cpu=cortex-a9 --disable-armv5te" EXTRA_CFLAGS="-w -arch ${ARCH}" fi mkdir -p "${INTERDIR}/${ARCH}" ./configure --prefix="${INTERDIR}/${ARCH}" \ --disable-neon \ --disable-armv6 \ --disable-armv6t2 \ --disable-ffmpeg \ --disable-ffplay \ --disable-ffprobe \ --disable-ffserver \ --disable-iconv \ --disable-bzlib \ --enable-avresample \ --sysroot="${DEVELOPER}/Platforms/${PLATFORM}.platform/Developer/SDKs/${PLATFORM}${SDKVERSION}.sdk" \ --cc="${DEVELOPER}/Toolchains/XcodeDefault.xctoolchain/usr/bin/clang" \ --as='/usr/sbin/gas-preprocessor.pl' \ --extra-cflags="${EXTRA_CFLAGS} -miphoneos-version-min=${SDKVERSION}" \ --extra-ldflags="-arch ${ARCH} ${EXTRA_LDFLAGS} -isysroot /Applications/Xcode.app/Contents/Developer/Platforms/${PLATFORM}.platform/Developer/SDKs/${PLATFORM}${SDKVERSION}.sdk -miphoneos-version-min=${SDKVERSION}" ${EXTRA_CONFIG} \ --enable-pic \ --extra-cxxflags="$CPPFLAGS -isysroot ${DEVELOPER}/Platforms/${PLATFORM}.platform/Developer/SDKs/${PLATFORM}${SDKVERSION}.sdk" make && make install && make clean done mkdir -p "${INTERDIR}/universal/lib" cd "${INTERDIR}/armv7/lib" for file in *.a do cd ${INTERDIR} xcrun -sdk iphoneos lipo -output universal/lib/$file -create -arch armv7 armv7/lib/$file -arch armv7s armv7s/lib/$file -arch i386 i386/lib/$file echo "Universal $file created." done cp -r ${INTERDIR}/armv7/include ${INTERDIR}/universal/ echo "Done." 以上为config.sh执行后只生成了i386的库,armv7和armv7s都没有生成东西,提示如下: -bash: cd: /Users/nevermore/Downloads/ffmpeg-2.8.3/built/armv7/lib: No such file or directory fatal error: /Applications/Xcode.app/Contents/Developer/Toolchains/XcodeDefault.xctoolchain/usr/bin/lipo: can't open input file: armv7/lib/*.a (No such file or directory) Universal *.a created. cp: /Users/nevermore/Downloads/ffmpeg-2.8.3/built/armv7/include: No such file or directory Done. 机器的os操作系统为最新版10.10.5,xcode7.1也是最新的,请大家帮帮忙应该怎么解决
qt5.12.4安卓编译问题,生成不了apk, 求助这是哪里的问题?报错如下
20:35:47: 为项目app2执行步骤 ... 20:35:47: 配置没有改变, 跳过 qmake 步骤。 20:35:47: 正在启动 "E:\Android\android-ndk-r18b\prebuilt\windows-x86_64\bin\make.exe" -j12 make: Nothing to be done for `first'. 20:35:48: 进程"E:\Android\android-ndk-r18b\prebuilt\windows-x86_64\bin\make.exe"正常退出。 20:35:48: Removing directory D:\src\qt_src\build-app2-Android_for_armeabi_v7a_Clang_Qt_5_12_4_for_Android_ARMv7-Debug\android-build/assets 20:35:48: Removing directory D:\src\qt_src\build-app2-Android_for_armeabi_v7a_Clang_Qt_5_12_4_for_Android_ARMv7-Debug\android-build/libs 20:35:48: 正在启动 "E:\Android\android-ndk-r18b\prebuilt\windows-x86_64\bin\make.exe" "INSTALL_ROOT=D:\src\qt_src\build-app2-Android_for_armeabi_v7a_Clang_Qt_5_12_4_for_Android_ARMv7-Debug\android-build" install E:\App\Qt\5.12.4\android_armv7\bin\qmake.exe -install qinstall -exe libapp2.so D:\src\qt_src\build-app2-Android_for_armeabi_v7a_Clang_Qt_5_12_4_for_Android_ARMv7-Debug\android-build\libs\armeabi-v7a\libapp2.so 20:35:49: 进程"E:\Android\android-ndk-r18b\prebuilt\windows-x86_64\bin\make.exe"正常退出。 20:35:49: Starting: "E:\App\Qt\5.12.4\android_armv7\bin\androiddeployqt.exe" --input D:/src/qt_src/build-app2-Android_for_armeabi_v7a_Clang_Qt_5_12_4_for_Android_ARMv7-Debug/android-libapp2.so-deployment-settings.json --output D:/src/qt_src/build-app2-Android_for_armeabi_v7a_Clang_Qt_5_12_4_for_Android_ARMv7-Debug/android-build --android-platform android-23 --jdk "C:/Program Files/Java/jdk1.8.0_202" --gradle Generating Android Package Input file: D:/src/qt_src/build-app2-Android_for_armeabi_v7a_Clang_Qt_5_12_4_for_Android_ARMv7-Debug/android-libapp2.so-deployment-settings.json Output directory: D:/src/qt_src/build-app2-Android_for_armeabi_v7a_Clang_Qt_5_12_4_for_Android_ARMv7-Debug/android-build/ Application binary: D:/src/qt_src/build-app2-Android_for_armeabi_v7a_Clang_Qt_5_12_4_for_Android_ARMv7-Debug/libapp2.so Android build platform: android-23 Install to device: No -- Skipping E:/App/Qt/5.12.4/android_armv7/plugins/iconengines/libqsvgicon.so. It has unmet dependencies: lib/libQt5Svg.so. -- Skipping E:/App/Qt/5.12.4/android_armv7/plugins/imageformats/libqsvg.so. It has unmet dependencies: lib/libQt5Svg.so. :checkDebugClasspath UP-TO-DATE :preBuild UP-TO-DATE :preDebugBuild UP-TO-DATE :compileDebugAidl FAILED FAILURE: Build failed with an exception. * What went wrong: Execution failed for task ':compileDebugAidl'. > java.io.IOException: com.android.ide.common.process.ProcessException: Error while executing process E:\Android\android-sdk-windows\build-tools\29.0.0\aidl.exe with arguments {-pE:\Android\android-sdk-windows\platforms\android-23\framework.aidl -oD:\src\qt_src\build-app2-Android_for_armeabi_v7a_Clang_Qt_5_12_4_for_Android_ARMv7-Debug\android-build\build\generated\source\aidl\debug -IE:\App\Qt\5.12.4\android_armv7\src\android\java\src -ID:\src\qt_src\build-app2-Android_for_armeabi_v7a_Clang_Qt_5_12_4_for_Android_ARMv7-Debug\android-build\src -ID:\src\qt_src\build-app2-Android_for_armeabi_v7a_Clang_Qt_5_12_4_for_Android_ARMv7-Debug\android-build\src\debug\aidl -ID:\src\qt_src\build-app2-Android_for_armeabi_v7a_Clang_Qt_5_12_4_for_Android_ARMv7-Debug\android-build\aidl -dC:\Users\ADMINI~1\AppData\Local\Temp\aidl7196521705366926776.d E:\App\Qt\5.12.4\android_armv7\src\android\java\src\org\kde\necessitas\ministro\IMinistro.aidl} * Try: Run with --stacktrace option to get the stack trace. Run with --info or --debug option to get more log output. Run with --scan to get full insights. * Get more help at https://help.gradle.org BUILD FAILED in 6s 3 actionable tasks: 1 executed, 2 up-to-date Building the android package failed! -- For more information, run this command with --verbose. 20:35:57: 进程"E:\App\Qt\5.12.4\android_armv7\bin\androiddeployqt.exe"退出,退出代码 14 。 Error while building/deploying project app2 (kit: Android for armeabi-v7a (Clang Qt 5.12.4 for Android ARMv7)) When executing step "Build Android APK" 20:35:57: Elapsed time: 00:10.
Xcode真机调试出现的错误~
错误信息如下: Undefined symbols for architecture armv7: "_xdSendMessage", referenced from: _Herald_xdSendMessage_m2534056276 in Bulk_Assembly-CSharp-firstpass_0.o (maybe you meant: _Herald_xdSendMessage_m2534056276) ld: symbol(s) not found for architecture armv7 clang: error: linker command failed with exit code 1 (use -v to see invocation)
请问SDL2.0是怎么编译到ios平台的呢,我按照README-ios.txt编译但是编译过不了
uilding with iOS SDK v6.1 for iOS >= 3.0 checking build system type... i386-apple-darwin12.4.0 checking host system type... armv6-apple-darwin checking how to print strings... printf checking for armv6-apple-darwin-gcc... /Applications/Xcode 2.app/Contents/Developer/Platforms/iPhoneOS.platform/Developer/usr/bin/llvm-gcc-4.2 checking whether the C compiler works... no configure: error: in `/Users/PS/SDL2-2.0.0/build/armv6': configure: error: C compiler cannot create executables See `config.log' for more details 请问有遇到这样的问题没?我的系统 OS X 10.8.4,XCode4.6.3 SDK6.1
指令集与错误Undefined symbols for architecture arm64
先说环境:xcode7.3.1,真机9.3.2版本、真机8.4版本 第三方使用cocoaPods管理。 报错如下图: ![图片说明](https://img-ask.csdn.net/upload/201606/14/1465913646_511109.png) 我在模拟器上设置 Build Active Architecture Only的debug为yes,release为NO。 Valid architectures添加arm64 模拟器和真机9.3.2版本正常。 真机8.4上报错16个错误。 设置Build Active Architecture Only全NO,Valid architectures添加arm64报错同上。 设置Build Active Architecture Only的debug为yes,release为NO, Valid architectures移除arm64只报错一个。 设置设置Build Active Architecture Only全NO Valid architectures移除arm64 真机8.4版本正常。 这种临时解决方法能提交AppStore吗? 为什么会这么报错,有什么方法彻底解决? 在终端使用命令: find . -name *.a -exec lipo -info "{}" \;查看第三方是否支持arm64 结果如下: Architectures in the fat file: ./Pods/JPush/lib/libjpush-ios-2.1.7.a are: armv7 armv7s i386 x86_64 arm64 Architectures in the fat file: ./xinetong/Ctrls/OfficeCtrl/AdOfficeCtrl/TempCode0525/Schedule/AgoraSDK/libagora_fat.a are: armv7 i386 x86_64 arm64 Architectures in the fat file: ./xinetong/Ctrls/OfficeCtrl/AdOfficeCtrl/TempCode0525/Schedule/AgoraSDK/libagoradep_fat.a are: armv7 i386 x86_64 arm64 Architectures in the fat file: ./xinetong/Ctrls/OfficeCtrl/AdOfficeCtrl/TempCode0525/Schedule/AgoraSDK/libCrasheye.a are: armv7 i386 x86_64 arm64 备注:已经爬贴50+才问的。
编译u-boot出现bad value (armv4) for -march= switch
下载了一个最新的u-boot2014.10 配置 make smdk2410_config 编译 make 出现如下错误 cc1: error: bad value (armv4) for -march= switch cc1: error: bad value (armv4) for -mtune= switch make[2]: *** [include/autoconf.mk] Error 1 make[1]: *** [silentoldconfig] Error 1 make: *** No rule to make target `include/config/auto.conf', needed by `include/config/uboot.release'. Stop. 谁知道怎么回事呢??
iOS 求大神,不知道什么情况
![图片说明](https://img-ask.csdn.net/upload/201603/01/1456813837_736967.jpg) ld: in /Users/**/Desktop/Test123/Test123/**.a(__.SYMDEF SORTED), archive member '__.SYMDEF SORTED' with length 13736 is not mach-o or llvm bitcode for architecture armv7 clang: error: linker command failed with exit code 1 (use -v to see invocation) pod install 之前没问题,之后就报错。bit是NO;求大神
用的开源签名工具 下面是错误代码 有大佬给看看嘛。缺失的是那个文件
[06/09 11:40:37 682]开始将IPA文件解压缩到路径:/var/folders/2g/l1n077wx51l6shy0xkny5Mf800gn/t/renit/unzip/jj3-1901-/2019年6月9日上午11:40:37 [06/09 11:40:38 932]解压缩IPA文件成功 [06/09 11:40:40 686]生成权利。 [06/09 11:40:40 753]产生的权利 [06/09 11:40:40 754]编辑info.plist文件… [06/09 11:40:40 754]文件信息.plist已正确编辑 [06/09 11:40:40 755]编辑嵌入条款… [06/09 11:40:40 756]嵌入条款编辑成功 [06/09 11:40:40 757]开始代码符号… [06/09 11:40:40 757]开始用国际象棋进行代码签名。应用程序… [06/09 11:40:42 326]验证代码符号:chess.app [06/09 11:40:42 375]签名失败,错误为:/var/folders/2g/l1n07wx51l6shy0xkny5Mf800gn/t/renit/unzip/jj3-1901-/2019年6月9日上午11:40:37/payload/chess.app:替换现有签名 警告:无法为签名者构建到自签名根的链“iphone distribution:art-metall,o o o”警告:无法为签名者构建到自签名根的链“iphone distribution:art-metall,ooo”/var/folders/2g/l1n077wx51l6shy0xkny5Mf800gn/t/renit/unzip/jj3-1901-/2019年6月9日上午11:40:37/payload/chess.app:与mach-o u的已签名应用程序包niversal(armv7 arm64)[com.jj3game.chess] /var/folders/2g/l1n077wx51l6shy0xkny5Mf800gn/t/renit/unzip/jj3-1901-/2019年6月9日上午11:40:37/payload/chess.app:cssmerr_tp_not_trusted 建筑学:ARMV7
Fatal error: invalid -march= option: `armv5te'
android2-2编译时出错-找不出是什么原因,求解? Fatal error: invalid -march= option: `armv5te'
Linaro 13.04 Encountered a section with no Package: header
apt-get install xxx 报错: Reading package lists... Error! E: Encountered a section with no Package: header E: Problem with MergeList /var/lib/dpkg/status E: The package lists or status file could not be parsed or opened. 在网上找到的解决方法都是 rm /var/lib/apt/lists/* -rf apt-get update 可是执行完上面两步之后 还以会报同样的错误 **uname -a 信息:** Linux cubieboard2 3.4.43+ #1 SMP PREEMPT Thu Aug 29 16:54:44 CST 2013 armv7l armv7l armv7l GNU/Linux **lsb_release -a 信息:** No LSB modules are available. Distributor ID: Linaro Description: Linaro 13.04 Release: 13.04 Codename: quantal
关于华为荣耀手机程序运行时闪退的问题?
关于华为荣耀手机程序运行时闪退的问题? 请大佬们帮忙看看是什么原因啊,在此先多谢各位大佬了 ``` 2019-09-06 14:08:47.726 12620-12639/? E/MemoryLeakMonitorManager: MemoryLeakMonitor.jar is not exist! 2019-09-06 14:08:47.787 1790-3421/? E/HsmCoreServiceImpl: onTransact in code is: 102 2019-09-06 14:08:47.940 12603-12617/? E/MemoryLeakMonitorManager: MemoryLeakMonitor.jar is not exist! 2019-09-06 14:08:47.986 1790-11981/? E/HsmCoreServiceImpl: onTransact in code is: 102 2019-09-06 14:08:48.419 1313-3804/? E/WifiService: enforceCanAccessScanResults: hiding ssid and bssidUID 10351 has no location permission 2019-09-06 14:08:48.425 12479-12479/? E/nt.mm:appbrand: Invalid ID 0x00000000. 2019-09-06 14:08:48.429 1313-3804/? E/WifiService: enforceCanAccessScanResults: hiding ssid and bssidUID 10351 has no location permission 2019-09-06 14:08:49.287 720-720/? E/Thermal-daemon: [flash_led] temp_new :39 temp_old :38 2019-09-06 14:08:49.290 720-720/? E/Thermal-daemon: Report temperature: [flash_led] temp :39 report_threshold:1 2019-09-06 14:08:49.290 720-720/? E/Thermal-daemon: [charger_ic] temp_new :40 temp_old :39 2019-09-06 14:08:49.292 720-720/? E/Thermal-daemon: Report temperature: [charger_ic] temp :40 report_threshold:1 2019-09-06 14:08:49.295 720-720/? E/Thermal-daemon: [ap] temp_new :39 temp_old :38 2019-09-06 14:08:49.298 720-720/? E/Thermal-daemon: Report temperature: [ap] temp :39 report_threshold:1 2019-09-06 14:08:49.661 1313-3804/? E/WifiService: enforceCanAccessScanResults: hiding ssid and bssidUID 10351 has no location permission 2019-09-06 14:08:49.811 624-624/? E/WifiHAL: enter wifi_get_link_stats 2019-09-06 14:08:49.821 1313-1519/? E/WificondControl: Noise: -92, Snr: 0, Chload: -1 2019-09-06 14:08:50.863 12479-12568/? E/[HOTFIX]: [ThreadDexHotfixMonitor]Bind hotfix monitor service fail! 2019-09-06 14:08:52.225 12620-12743/? E/[HOTFIX]: [ThreadDexHotfixMonitor]Bind hotfix monitor service fail! 2019-09-06 14:08:52.230 12603-12747/? E/[HOTFIX]: [ThreadDexHotfixMonitor]Bind hotfix monitor service fail! 2019-09-06 14:08:52.800 717-12927/? E/HwExtendedCodec: mime: audio/vorbis matching compontent failed! 2019-09-06 14:08:52.827 624-624/? E/WifiHAL: enter wifi_get_link_stats 2019-09-06 14:08:52.844 1313-1519/? E/WificondControl: Noise: -92, Snr: 0, Chload: -1 2019-09-06 14:08:52.926 724-11678/? E/OMXNodeInstance: setConfig(0xf2f29c20:google.vorbis.decoder, ??(0x6f700006)) ERROR: Undefined(0x80001001) 2019-09-06 14:08:52.929 724-11339/? E/OMXNodeInstance: setConfig(0xf2f29c20:google.vorbis.decoder, ConfigPriority(0x6f800002)) ERROR: Undefined(0x80001001) 2019-09-06 14:08:53.488 1675-1675/? E/ndroid.systemu: Invalid ID 0x00000000. 2019-09-06 14:08:53.488 1675-1675/? E/HwNotchUtils: setIconForView iconId is not found 2019-09-06 14:08:53.488 1675-1675/? E/ndroid.systemu: Invalid ID 0x00000000. 2019-09-06 14:08:53.489 1675-1675/? E/HwNotchUtils: setIconForView iconId is not found 2019-09-06 14:08:53.489 1675-1675/? E/ndroid.systemu: Invalid ID 0x00000000. 2019-09-06 14:08:53.489 1675-1675/? E/HwNotchUtils: setIconForView iconId is not found 2019-09-06 14:08:53.684 1313-1519/? E/WificondControl: Noise: -92, Snr: 0, Chload: -1 2019-09-06 14:08:54.299 720-720/? E/Thermal-daemon: [battery] temp_new :37 temp_old :35 2019-09-06 14:08:54.301 720-720/? E/Thermal-daemon: Report temperature: [battery] temp :37 report_threshold:1 2019-09-06 14:08:54.302 720-720/? E/Thermal-daemon: [charger_ic] temp_new :41 temp_old :40 2019-09-06 14:08:54.304 720-720/? E/Thermal-daemon: Report temperature: [charger_ic] temp :41 report_threshold:1 2019-09-06 14:09:15.807 13033-11766/? A/google-breakpad: Microdump skipped (uninteresting) 2019-09-06 14:09:15.827 1790-3421/? E/HsmCoreServiceImpl: onTransact in code is: 103 2019-09-06 14:09:15.896 13035-11766/? A/google-breakpad: -----BEGIN BREAKPAD MICRODUMP----- 2019-09-06 14:09:15.896 13035-11766/? A/google-breakpad: V UNKNOWN:0.0.0.0 2019-09-06 14:09:15.896 13035-11766/? A/google-breakpad: O A arm 08 armv8l 4.9.111 #1 SMP PREEMPT Fri Mar 29 23:12:42 CST 2019 2019-09-06 14:09:15.896 13035-11766/? A/google-breakpad: P UNKNOWN 2019-09-06 14:09:15.896 13035-11766/? A/google-breakpad: G UNKNOWN 2019-09-06 14:09:15.899 13035-11766/? A/google-breakpad: H 12C00000 FFFF1000 00C4 2CE75000 6DFBE000 0C:41 0D:31 0E:19 0F:10 10:0E 11:04 12:0C 13:02 14:01 15:03 16:01 17:01 1C:01 1D:02 2019-09-06 14:09:15.899 13035-11766/? A/google-breakpad: -----starting crashing thread----- 2019-09-06 14:09:15.914 11758-11766/? A/libc: Fatal signal 11 (SIGSEGV), code 1 (SEGV_MAPERR), fault addr 0x6ab0bc in tid 11766 (FinalizerDaemon), pid 11758 (ncent.tmgp.zrwp) 2019-09-06 14:09:15.950 1313-12028/? E/WifiService: enforceCanAccessScanResults: hiding ssid and bssidUID 10351 has no location permission 2019-09-06 14:09:16.041 13042-13042/? A/DEBUG: *** *** *** *** *** *** *** *** *** *** *** *** *** *** *** *** 2019-09-06 14:09:16.042 13042-13042/? A/DEBUG: Build fingerprint: 'HONOR/STF-AL00/HWSTF:9/HUAWEISTF-AL00/179C00R1:user/release-keys' 2019-09-06 14:09:16.042 13042-13042/? A/DEBUG: Revision: '0' 2019-09-06 14:09:16.042 13042-13042/? A/DEBUG: ABI: 'arm' 2019-09-06 14:09:16.042 13042-13042/? A/DEBUG: pid: 11758, tid: 11766, name: FinalizerDaemon >>> com.tencent.tmgp.zrwp <<< 2019-09-06 14:09:16.042 13042-13042/? A/DEBUG: signal 11 (SIGSEGV), code 1 (SEGV_MAPERR), fault addr 0x6ab0bc 2019-09-06 14:09:16.042 13042-13042/? A/DEBUG: r0 006ab0b8 r1 00000000 r2 006ab0b8 r3 6a6099ca 2019-09-06 14:09:16.042 13042-13042/? A/DEBUG: r4 006ab0b8 r5 00000000 r6 e93e01d8 r7 e93e01d8 2019-09-06 14:09:16.042 13042-13042/? A/DEBUG: r8 00000000 r9 00000000 r10 e93e01ec r11 6f92ef18 2019-09-06 14:09:16.042 13042-13042/? A/DEBUG: ip eaeecd08 sp c7ee04e0 lr e934af41 pc e934aefc 2019-09-06 14:09:16.071 1313-3804/? E/WifiService: enforceCanAccessScanResults: hiding ssid and bssidUID 10351 has no location permission 2019-09-06 14:09:16.089 13042-13042/? A/DEBUG: backtrace: 2019-09-06 14:09:16.089 13042-13042/? A/DEBUG: #00 pc 0002fefc /system/lib/libcrypto.so (ASN1_primitive_free+36) 2019-09-06 14:09:16.089 13042-13042/? A/DEBUG: #01 pc 0002ff3d /system/lib/libcrypto.so (ASN1_primitive_free+100) 2019-09-06 14:09:16.089 13042-13042/? A/DEBUG: #02 pc 0002fd71 /system/lib/libcrypto.so (asn1_item_combine_free+160) 2019-09-06 14:09:16.089 13042-13042/? A/DEBUG: #03 pc 0002fd71 /system/lib/libcrypto.so (asn1_item_combine_free+160) 2019-09-06 14:09:16.089 13042-13042/? A/DEBUG: #04 pc 0002fd71 /system/lib/libcrypto.so (asn1_item_combine_free+160) 2019-09-06 14:09:16.089 13042-13042/? A/DEBUG: #05 pc 0002fcad /system/lib/libcrypto.so (ASN1_item_free+20) 2019-09-06 14:09:16.089 13042-13042/? A/DEBUG: #06 pc 000160c3 /system/framework/arm/boot-conscrypt.oat (offset 0x16000) (com.android.org.conscrypt.NativeCrypto.ASN1_TIME_to_Calendar [DEDUPED]+130) 2019-09-06 14:09:16.089 13042-13042/? A/DEBUG: #07 pc 0002e027 /system/framework/arm/boot-conscrypt.oat (offset 0x16000) (com.android.org.conscrypt.OpenSSLX509Certificate.finalize+70) 2019-09-06 14:09:16.089 13042-13042/? A/DEBUG: #08 pc 0018f7bf /system/framework/arm/boot-core-libart.oat (offset 0x8d000) (java.lang.Daemons$FinalizerDaemon.doFinalize+86) 2019-09-06 14:09:16.089 13042-13042/? A/DEBUG: #09 pc 0018fa1b /system/framework/arm/boot-core-libart.oat (offset 0x8d000) (java.lang.Daemons$FinalizerDaemon.runInternal+466) 2019-09-06 14:09:16.089 13042-13042/? A/DEBUG: #10 pc 0012b2ab /system/framework/arm/boot-core-libart.oat (offset 0x8d000) (java.lang.Daemons$Daemon.run+66) 2019-09-06 14:09:16.089 13042-13042/? A/DEBUG: #11 pc 00270911 /system/framework/arm/boot.oat (offset 0x132000) (java.lang.Thread.run+64) 2019-09-06 14:09:16.089 13042-13042/? A/DEBUG: #12 pc 00430375 /system/lib/libart.so (art_quick_invoke_stub_internal+68) 2019-09-06 14:09:16.089 13042-13042/? A/DEBUG: #13 pc 004091a1 /system/lib/libart.so (art_quick_invoke_stub+224) 2019-09-06 14:09:16.089 13042-13042/? A/DEBUG: #14 pc 000a4901 /system/lib/libart.so (art::ArtMethod::Invoke(art::Thread*, unsigned int*, unsigned int, art::JValue*, char const*)+136) 2019-09-06 14:09:16.089 13042-13042/? A/DEBUG: #15 pc 00365029 /system/lib/libart.so (art::(anonymous namespace)::InvokeWithArgArray(art::ScopedObjectAccessAlreadyRunnable const&, art::ArtMethod*, art::(anonymous namespace)::ArgArray*, art::JValue*, char const*)+52) 2019-09-06 14:09:16.089 13042-13042/? A/DEBUG: #16 pc 00365dbd /system/lib/libart.so (art::InvokeVirtualOrInterfaceWithJValues(art::ScopedObjectAccessAlreadyRunnable const&, _jobject*, _jmethodID*, jvalue*)+316) 2019-09-06 14:09:16.089 13042-13042/? A/DEBUG: #17 pc 00387d19 /system/lib/libart.so (art::Thread::CreateCallback(void*)+900) 2019-09-06 14:09:16.089 13042-13042/? A/DEBUG: #18 pc 00065ab3 /system/lib/libc.so (__pthread_start(void*)+22) 2019-09-06 14:09:16.089 13042-13042/? A/DEBUG: #19 pc 0001e975 /system/lib/libc.so (__start_thread+32) 2019-09-06 14:09:16.099 11758-11758/? E/ncent.tmgp.zrw: No implementation found for java.lang.String com.tencent.bugly.crashreport.crash.jni.NativeCrashHandler.regist(java.lang.String, boolean, int) (tried Java_com_tencent_bugly_crashreport_crash_jni_NativeCrashHandler_regist and Java_com_tencent_bugly_crashreport_crash_jni_NativeCrashHandler_regist__Ljava_lang_String_2ZI) 2019-09-06 14:09:16.242 1313-4246/? E/WifiService: enforceCanAccessScanResults: hiding ssid and bssidUID 10351 has no location permission 2019-09-06 14:09:16.386 1845-1861/? E/OPCollectLog: HwForegroundAppAction:duplicate pkgName. 2019-09-06 14:09:16.416 11758-13071/? E/ncent.tmgp.zrw: No implementation found for java.lang.String com.tencent.bugly.crashreport.crash.jni.NativeCrashHandler.regist(java.lang.String, boolean, int) (tried Java_com_tencent_bugly_crashreport_crash_jni_NativeCrashHandler_regist and Java_com_tencent_bugly_crashreport_crash_jni_NativeCrashHandler_regist__Ljava_lang_String_2ZI) 2019-09-06 14:09:16.459 11758-11819/? E/AwareLog: eglSlice: report time too small 2019-09-06 14:09:17.018 624-624/? E/WifiHAL: enter wifi_get_link_stats 2019-09-06 14:09:17.029 1313-1519/? E/WificondControl: Noise: -92, Snr: 0, Chload: -1 2019-09-06 14:09:17.037 629-629/? E/HWComposer: presentAndGetReleaseFences: present failed for display 0: NotValidated (7) 2019-09-06 14:09:17.052 733-733/? E//system/bin/tombstoned: Tombstone written to: /data/tombstones/tombstone_02 2019-09-06 14:09:17.062 732-2789/? E/iMonitor: FaultDetect: DUMPTOOL_PRINTF return. 2019-09-06 14:09:17.090 623-623/? E/TS_Service: hwTsSetAftAlgoOrientation 2019-09-06 14:09:17.103 732-2789/? E/iMonitor: FaultDetect: DUMPTOOL_PRINTF return. 2019-09-06 14:09:17.103 732-2789/? E/iMonitor: FaultDetect: DUMPTOOL_PRINTF return. 2019-09-06 14:09:17.109 732-2789/? E/iMonitor: FaultDetect: DUMPTOOL_PRINTF return. 2019-09-06 14:09:17.110 732-2789/? E/iMonitor: FaultDetect: DUMPTOOL_PRINTF return. 2019-09-06 14:09:17.110 732-2789/? E/iMonitor: FaultDetect: DUMPTOOL_PRINTF return. 2019-09-06 14:09:17.111 732-2789/? E/iMonitor: FaultDetect: DUMPTOOL_PRINTF return. 2019-09-06 14:09:17.152 725-805/? E/AwareLog: iawared: change_property_content open /proc/11758/task/11799/static_vip fail errno(2)! 2019-09-06 14:09:17.170 1881-3034/? E/AwareLog: SPKSchedFeature: Uid has been sent, ignore. 2019-09-06 14:09:17.200 1313-1499/? E/InputDispatcher: channel '316a469 com.tencent.tmgp.zrwp/com.tencent.midas.proxyactivity.APMidasPayProxyActivity (server)' ~ Channel is unrecoverably broken and will be disposed! 2019-09-06 14:09:17.200 1313-1499/? E/InputDispatcher: channel '601333 com.tencent.tmgp.zrwp/com.tencent.midas.proxyactivity.APMidasPayProxyActivity (server)' ~ Channel is unrecoverably broken and will be disposed! 2019-09-06 14:09:17.214 1881-3092/? E/AwareLog: GameSdkConfigReader: GameSdkLog: idNameMap: null 2019-09-06 14:09:17.229 1313-1499/? E/InputDispatcher: channel 'c46b993 com.tencent.tmgp.zrwp/com.xmen.main.AppActivity (server)' ~ Channel is unrecoverably broken and will be disposed! 2019-09-06 14:09:17.297 1313-1352/? E/ActivityManager: Failed to schedule configuration change android.os.DeadObjectException at android.os.BinderProxy.transactNative(Native Method) at android.os.BinderProxy.transact(Binder.java:1147) at android.app.IApplicationThread$Stub$Proxy.scheduleTransaction(IApplicationThread.java:1900) at android.app.servertransaction.ClientTransaction.schedule(ClientTransaction.java:129) at com.android.server.am.ClientLifecycleManager.scheduleTransaction(ClientLifecycleManager.java:47) at com.android.server.am.ClientLifecycleManager.scheduleTransaction(ClientLifecycleManager.java:100) at com.android.server.am.ActivityManagerService.updateGlobalConfigurationLocked(ActivityManagerService.java:24536) at com.android.server.am.ActivityManagerService.updateDisplayOverrideConfigurationLocked(ActivityManagerService.java:24650) at com.android.server.am.ActivityManagerService.updateDisplayOverrideConfiguration(ActivityManagerService.java:24615) at com.android.server.wm.WindowManagerService.sendNewConfiguration(WindowManagerService.java:5075) at com.android.server.wm.WindowManagerService$H.handleMessage(WindowManagerService.java:5606) at android.os.Handler.dispatchMessage(Handler.java:109) at android.os.Looper.loop(Looper.java:207) at android.os.HandlerThread.run(HandlerThread.java:65) at com.android.server.ServiceThread.run(ServiceThread.java:44) 2019-09-06 14:09:17.308 9088-9088/? E/HiBoard_LauncherOverlayService: IllegalArgumentException, mWorkspace have not attach,errmsg:View=com.huawei.intelligent.ui.view.Workspace{80ef296 V.E...... ......I. 0,0-0,0} not attached to window manager 2019-09-06 14:09:17.320 9101-9101/? E/HiSearch9.11.6.301: [LauncherOverlayService]: IllegalArgumentException, mWorkspace have not attach and e: View=com.huawei.search.ui.views.Workspace{6b052d5 VFE...C.. ......I. 0,0-0,0} not attached to window manager 2019-09-06 14:09:17.326 1790-11981/? E/HsmCoreServiceImpl: onTransact in code is: 102 2019-09-06 14:09:17.326 1881-3092/? E/AwareLog: GameSdkConfigReader: GameSdkLog: idNameMap: null 2019-09-06 14:09:17.330 1790-1992/? E/Hicom_PolicyCenterService: handleAppDied. null == mMultipathAppsMap 2019-09-06 14:09:17.337 1790-1992/? E/XEngineMpipControl: Invalid SubId 2019-09-06 14:09:17.351 12661-12661/? E/DataSrv-9.3.0.304-O-0709-00:28-PackageUtils: NameNotFoundException: service apk is not installed 2019-09-06 14:09:17.355 725-805/? E/AwareLog: iawared: unknown message:157 2019-09-06 14:09:17.355 725-805/? E/AwareLog: iawared: change_property_content open /proc/11758/task/11796/static_vip fail errno(2)! 2019-09-06 14:09:17.355 725-805/? E/AwareLog: iawared: getProcCpuset open /proc/11758/task/11758/cpuset fail errno(2)! 2019-09-06 14:09:17.355 725-805/? E/AwareLog: iawared: getProcCpuset open /proc/11758/task/11758/cpuset fail errno(2)! 2019-09-06 14:09:17.363 1790-1811/? E/HsmCoreServiceImpl: onTransact in code is: 103 2019-09-06 14:09:17.401 1914-2088/? E/HwLauncher: SettingsEx , no such field. 2019-09-06 14:09:17.404 1675-1675/? E/ndroid.systemu: No package ID ff found for ID 0xffffffff. 2019-09-06 14:09:17.413 1675-1675/? E/ndroid.systemu: No package ID ff found for ID 0xffffffff. 2019-09-06 14:09:17.422 1790-1811/? E/HsmCoreServiceImpl: onTransact in code is: 103 2019-09-06 14:09:17.424 4509-4703/? E/[HwRecSys]HwRecSysService: getIsRportDirectService is false! 2019-09-06 14:09:17.469 1313-1813/? E/ProcessInfoCollector: getProcessInfo: failed to find this proc 2019-09-06 14:09:17.474 13106-13106/? E/ndroid.contact: Not starting debugger since process cannot load the jdwp agent. 2019-09-06 14:09:17.498 3861-3861/? E/UI-KeyboardView: EnShiftState.reset() failed! mKeyboard is null 2019-09-06 14:09:17.500 1790-11981/? E/HsmCoreServiceImpl: onTransact in code is: 102 2019-09-06 14:09:17.604 3861-3861/? E/CrashInfoComponent: [ SogouIME:onInitializeInterface 2019-09-06 14:09:17:595 ] 2019-09-06 14:09:17.604 3861-3861/? E/CrashInfoComponent: [ MainImeServiceDel:onInitializeInterface start 2019-09-06 14:09:17:604 ] 2019-09-06 14:09:17.705 1313-1519/? E/WificondControl: Noise: -92, Snr: 0, Chload: -1 2019-09-06 14:09:17.757 13106-13131/? E/Contacts: RcsFeatureManager isRcsEnabled = true 2019-09-06 14:09:17.812 3861-3861/? E/BitmapFactory: Unable to decode stream: java.io.FileNotFoundException: /data/user/0/com.sohu.inputmethod.sogou/files/.theme/sogou_custom/res/composing_bg.png (No such file or directory) 2019-09-06 14:09:17.814 1313-1813/? E/ProcessInfoCollector: getProcessInfo: failed to find this proc 2019-09-06 14:09:17.819 13140-13140/? E/d.process.acor: Not starting debugger since process cannot load the jdwp agent. 2019-09-06 14:09:17.831 3861-3861/? E/BitmapFactory: Unable to decode stream: java.io.FileNotFoundException: /data/user/0/com.sohu.inputmethod.sogou/files/.theme/sogou_custom/res/composing_bg.png (No such file or directory) 2019-09-06 14:09:17.847 1790-26786/? E/HsmCoreServiceImpl: onTransact in code is: 102 2019-09-06 14:09:17.901 13106-13122/? E/MemoryLeakMonitorManager: MemoryLeakMonitor.jar is not exist! 2019-09-06 14:09:18.205 13106-13106/? E/Contacts: AlphaScroller Resources.NotFoundException in AlphaScroller 2019-09-06 14:09:18.212 13106-13106/? E/Contacts: AlphaScroller Resources.NotFoundException in AlphaScroller 2019-09-06 14:09:18.242 13106-13106/? E/SQLiteLog: (1) 2019-09-06 14:09:18.242 13106-13106/? E/Contacts: ContactsAppProvider makeInsertOperation gets SQLiteException. 2019-09-06 14:09:18.297 13140-13156/? E/MemoryLeakMonitorManager: MemoryLeakMonitor.jar is not exist! 2019-09-06 14:09:18.374 732-899/? E/JankService: JankFrequencyMonitor action return :0 2019-09-06 14:09:18.826 13106-13145/? E/ndroid.contact: Invalid ID 0x00000000. 2019-09-06 14:09:18.827 13106-13145/? E/ndroid.contact: Invalid ID 0x00000000. 2019-09-06 14:09:18.897 13106-13145/? E/ndroid.contact: Invalid ID 0x00000000. 2019-09-06 14:09:19.553 1675-1675/? E/ndroid.systemu: Invalid ID 0x00000000. 2019-09-06 14:09:19.554 1675-1675/? E/HwNotchUtils: setIconForView iconId is not found 2019-09-06 14:09:19.554 1675-1675/? E/ndroid.systemu: Invalid ID 0x00000000. 2019-09-06 14:09:19.554 1675-1675/? E/HwNotchUtils: setIconForView iconId is not found 2019-09-06 14:09:19.555 1675-1675/? E/ndroid.systemu: Invalid ID 0x00000000. 2019-09-06 14:09:19.555 1675-1675/? E/HwNotchUtils: setIconForView iconId is not found 2019-09-06 14:09:20.035 624-624/? E/WifiHAL: enter wifi_get_link_stats 2019-09-06 14:09:20.047 1313-1519/? E/WificondControl: Noise: -92, Snr: 0, Chload: -1 2019-09-06 14:09:21.561 1675-1675/? E/ndroid.systemu: Invalid ID 0x00000000. 2019-09-06 14:09:21.562 1675-1675/? E/HwNotchUtils: setIconForView iconId is not found 2019-09-06 14:09:21.562 1675-1675/? E/ndroid.systemu: Invalid ID 0x00000000. 2019-09-06 14:09:21.562 1675-1675/? E/HwNotchUtils: setIconForView iconId is not found 2019-09-06 14:09:21.563 1675-1675/? E/ndroid.systemu: Invalid ID 0x00000000. 2019-09-06 14:09:21.563 1675-1675/? E/HwNotchUtils: setIconForView iconId is not found 2019-09-06 14:09:23.054 624-624/? E/WifiHAL: enter wifi_get_link_stats 2019-09-06 14:09:23.067 1313-1519/? E/WificondControl: Noise: -92, Snr: 0, Chload: -1 2019-09-06 14:09:23.090 1675-1675/? E/ndroid.systemu: Invalid ID 0x00000000. 2019-09-06 14:09:23.090 1675-1675/? E/HwNotchUtils: setIconForView iconId is not found 2019-09-06 14:09:23.092 1675-1675/? E/ndroid.systemu: Invalid ID 0x00000000. 2019-09-06 14:09:23.092 1675-1675/? E/HwNotchUtils: setIconForView iconId is not found 2019-09-06 14:09:23.093 1675-1675/? E/ndroid.systemu: Invalid ID 0x00000000. 2019-09-06 14:09:23.093 1675-1675/? E/HwNotchUtils: setIconForView iconId is not found 2019-09-06 14:09:23.094 1675-1675/? E/ndroid.systemu: Invalid ID 0x00000000. 2019-09-06 14:09:23.095 1675-1675/? E/HwNotchUtils: setIconForView iconId is not found 2019-09-06 14:09:23.096 1675-1675/? E/ndroid.systemu: Invalid ID 0x00000000. 2019-09-06 14:09:23.096 1675-1675/? E/HwNotchUtils: setIconForView iconId is not found 2019-09-06 14:09:23.097 1675-1675/? E/ndroid.systemu: Invalid ID 0x00000000. 2019-09-06 14:09:23.097 1675-1675/? E/HwNotchUtils: setIconForView iconId is not found 2019-09-06 14:09:23.099 1845-2036/? E/HwWifiStatStore: updateLinkSpeed linkSpeed =130 lastSpdLev=3 index=3 2019-09-06 14:09:23.102 1675-1675/? E/ndroid.systemu: Invalid ID 0x00000000. 2019-09-06 14:09:23.102 1675-1675/? E/HwNotchUtils: setIconForView iconId is not found 2019-09-06 14:09:23.102 1675-1675/? E/ndroid.systemu: Invalid ID 0x00000000. 2019-09-06 14:09:23.103 1675-1675/? E/HwNotchUtils: setIconForView iconId is not found 2019-09-06 14:09:23.104 1313-1667/? E/WifiService: enforceCanAccessScanResults: hiding ssid and bssidUID 10097 has no location permission 2019-09-06 14:09:23.105 1675-1675/? E/ndroid.systemu: Invalid ID 0x00000000. 2019-09-06 14:09:23.105 1675-1675/? E/HwNotchUtils: setIconForView iconId is not found 2019-09-06 14:09:24.333 720-720/? E/Thermal-daemon: [battery] temp_new :36 temp_old :35 2019-09-06 14:09:24.334 720-720/? E/Thermal-daemon: Report temperature: [battery] temp :36 report_threshold:1 ```
Error on Xcode10, Undefined symbols for architecture armv64
当我使用xcode10编译从unity输出的示例项目时,我得到了一个下面的错误,示例项目可以在xcode9.4.1上编译,但是使用xcode10会产生错误 我已经导入了libiPhone-lib.a在Libraries,但仍然有同样的错误,我该怎么去解决这个问题?
相见恨晚的超实用网站
搞学习 知乎:www.zhihu.com 简答题:http://www.jiandati.com/ 网易公开课:https://open.163.com/ted/ 网易云课堂:https://study.163.com/ 中国大学MOOC:www.icourse163.org 网易云课堂:study.163.com 哔哩哔哩弹幕网:www.bilibili.com 我要自学网:www.51zxw
爬虫福利二 之 妹子图网MM批量下载
爬虫福利一:27报网MM批量下载    点击 看了本文,相信大家对爬虫一定会产生强烈的兴趣,激励自己去学习爬虫,在这里提前祝:大家学有所成! 目标网站:妹子图网 环境:Python3.x 相关第三方模块:requests、beautifulsoup4 Re:各位在测试时只需要将代码里的变量 path 指定为你当前系统要保存的路径,使用 python xxx.py 或IDE运行即可。
字节跳动视频编解码面经
引言 本文主要是记录一下面试字节跳动的经历。 三四月份投了字节跳动的实习(图形图像岗位),然后hr打电话过来问了一下会不会opengl,c++,shador,当时只会一点c++,其他两个都不会,也就直接被拒了。 七月初内推了字节跳动的提前批,因为内推没有具体的岗位,hr又打电话问要不要考虑一下图形图像岗,我说实习投过这个岗位不合适,不会opengl和shador,然后hr就说秋招更看重基础。我当时
开源一个功能完整的SpringBoot项目框架
福利来了,给大家带来一个福利。 最近想了解一下有关Spring Boot的开源项目,看了很多开源的框架,大多是一些demo或者是一个未成形的项目,基本功能都不完整,尤其是用户权限和菜单方面几乎没有完整的。 想到我之前做的框架,里面通用模块有:用户模块,权限模块,菜单模块,功能模块也齐全了,每一个功能都是完整的。 打算把这个框架分享出来,供大家使用和学习。 为什么用框架? 框架可以学习整体
小白如何学习java?
在博主认为,对于入门级学习java的最佳学习方法莫过于视频+博客+书籍+总结,前三者博主将淋漓尽致地挥毫于这篇博客文章中,至于总结在于个人,实际上越到后面你会发现学习的最好方式就是阅读参考官方文档其次就是国内的书籍,博客次之,这又是一个层次了,这里暂时不提后面再谈。博主将为各位入门java保驾护航,各位只管冲鸭!!!上天是公平的,只要不辜负时间,时间自然不会辜负你。 何谓学习?博主所理解的学习,它
程序员必须掌握的核心算法有哪些?
由于我之前一直强调数据结构以及算法学习的重要性,所以就有一些读者经常问我,数据结构与算法应该要学习到哪个程度呢?,说实话,这个问题我不知道要怎么回答你,主要取决于你想学习到哪些程度,不过针对这个问题,我稍微总结一下我学过的算法知识点,以及我觉得值得学习的算法。这些算法与数据结构的学习大多数是零散的,并没有一本把他们全部覆盖的书籍。下面是我觉得值得学习的一些算法以及数据结构,当然,我也会整理一些看过...
比特币原理详解
一、什么是比特币 比特币是一种电子货币,是一种基于密码学的货币,在2008年11月1日由中本聪发表比特币白皮书,文中提出了一种去中心化的电子记账系统,我们平时的电子现金是银行来记账,因为银行的背后是国家信用。去中心化电子记账系统是参与者共同记账。比特币可以防止主权危机、信用风险。其好处不多做赘述,这一层面介绍的文章很多,本文主要从更深层的技术原理角度进行介绍。 二、问题引入 假设现有4个人...
【C++】C++11的std::array的详细剖析
当学习C++的时候,数组是最基本的结构之一,通常通过以下的方式来定义: int a[5]; int *b = new int[5]; 上面一句是在栈上定义了一个长度为5的数组,下面一句是在堆上定义了一个长度为5的数组,并用一个指针指向它。 在C++11中,引入了一种新的数组定义方式std::array。 std::array的特性 std::array是具有固定大小的数组。因此,它并不支持添加...
Python 基础(一):入门必备知识
Python 入门必备知识,你都掌握了吗?
程序员接私活怎样防止做完了不给钱?
首先跟大家说明一点,我们做 IT 类的外包开发,是非标品开发,所以很有可能在开发过程中会有这样那样的需求修改,而这种需求修改很容易造成扯皮,进而影响到费用支付,甚至出现做完了项目收不到钱的情况。 那么,怎么保证自己的薪酬安全呢? 我们在开工前,一定要做好一些证据方面的准备(也就是“讨薪”的理论依据),这其中最重要的就是需求文档和验收标准。一定要让需求方提供这两个文档资料作为开发的基础。之后开发...
Python十大装B语法
Python 是一种代表简单思想的语言,其语法相对简单,很容易上手。不过,如果就此小视 Python 语法的精妙和深邃,那就大错特错了。本文精心筛选了最能展现 Python 语法之精妙的十个知识点,并附上详细的实例代码。如能在实战中融会贯通、灵活使用,必将使代码更为精炼、高效,同时也会极大提升代码B格,使之看上去更老练,读起来更优雅。
数据库优化 - SQL优化
以实际SQL入手,带你一步一步走上SQL优化之路!
2019年11月中国大陆编程语言排行榜
2019年11月2日,我统计了某招聘网站,获得有效程序员招聘数据9万条。针对招聘信息,提取编程语言关键字,并统计如下: 编程语言比例 rank pl_ percentage 1 java 33.62% 2 cpp 16.42% 3 c_sharp 12.82% 4 javascript 12.31% 5 python 7.93% 6 go 7.25% 7 p...
写了很久,这是一份最适合/贴切普通大众/科班/非科班的『学习路线』
说实话,对于学习路线这种文章我一般是不写的,大家看我的文章也知道,我是很少写建议别人怎么样怎么样的文章,更多的是,写自己的真实经历,然后供大家去参考,这样子,我内心也比较踏实,也不怕误导他人。 但是,最近好多人问我学习路线,而且很多大一大二的,说自己很迷茫,看到我那篇 普普通通,我的三年大学 之后很受激励,觉得自己也能行,(是的,别太浪,你一定能行)希望我能给他个学习路线,说...
腾讯算法面试题:64匹马8个跑道需要多少轮才能选出最快的四匹?
昨天,有网友私信我,说去阿里面试,彻底的被打击到了。问了为什么网上大量使用ThreadLocal的源码都会加上private static?他被难住了,因为他从来都没有考虑过这个问题。无独有偶,今天笔者又发现有网友吐槽了一道腾讯的面试题,我们一起来看看。 腾讯算法面试题:64匹马8个跑道需要多少轮才能选出最快的四匹? 在互联网职场论坛,一名程序员发帖求助到。二面腾讯,其中一个算法题:64匹...
面试官:你连RESTful都不知道我怎么敢要你?
干货,2019 RESTful最贱实践
为啥国人偏爱Mybatis,而老外喜欢Hibernate/JPA呢?
关于SQL和ORM的争论,永远都不会终止,我也一直在思考这个问题。昨天又跟群里的小伙伴进行了一番讨论,感触还是有一些,于是就有了今天这篇文。 声明:本文不会下关于Mybatis和JPA两个持久层框架哪个更好这样的结论。只是摆事实,讲道理,所以,请各位看官勿喷。 一、事件起因 关于Mybatis和JPA孰优孰劣的问题,争论已经很多年了。一直也没有结论,毕竟每个人的喜好和习惯是大不相同的。我也看...
SQL-小白最佳入门sql查询一
不要偷偷的查询我的个人资料,即使你再喜欢我,也不要这样,真的不好;
项目中的if else太多了,该怎么重构?
介绍 最近跟着公司的大佬开发了一款IM系统,类似QQ和微信哈,就是聊天软件。我们有一部分业务逻辑是这样的 if (msgType = "文本") { // dosomething } else if(msgType = "图片") { // doshomething } else if(msgType = "视频") { // doshomething } else { // doshom...
致 Python 初学者
文章目录1. 前言2. 明确学习目标,不急于求成,不好高骛远3. 在开始学习 Python 之前,你需要做一些准备2.1 Python 的各种发行版2.2 安装 Python2.3 选择一款趁手的开发工具3. 习惯使用IDLE,这是学习python最好的方式4. 严格遵从编码规范5. 代码的运行、调试5. 模块管理5.1 同时安装了py2/py35.2 使用Anaconda,或者通过IDE来安装模
“狗屁不通文章生成器”登顶GitHub热榜,分分钟写出万字形式主义大作
一、垃圾文字生成器介绍 最近在浏览GitHub的时候,发现了这样一个骨骼清奇的雷人项目,而且热度还特别高。 项目中文名:狗屁不通文章生成器 项目英文名:BullshitGenerator 根据作者的介绍,他是偶尔需要一些中文文字用于GUI开发时测试文本渲染,因此开发了这个废话生成器。但由于生成的废话实在是太过富于哲理,所以最近已经被小伙伴们给玩坏了。 他的文风可能是这样的: 你发现,
程序员:我终于知道post和get的区别
IT界知名的程序员曾说:对于那些月薪三万以下,自称IT工程师的码农们,其实我们从来没有把他们归为我们IT工程师的队伍。他们虽然总是以IT工程师自居,但只是他们一厢情愿罢了。 此话一出,不知激起了多少(码农)程序员的愤怒,却又无可奈何,于是码农问程序员。 码农:你知道get和post请求到底有什么区别? 程序员:你看这篇就知道了。 码农:你月薪三万了? 程序员:嗯。 码农:你是怎么做到的? 程序员:
羞,Java 字符串拼接竟然有这么多姿势
二哥,我今年大二,看你分享的《阿里巴巴 Java 开发手册》上有一段内容说:“循环体内,拼接字符串最好使用 StringBuilder 的 append 方法,而不是 + 号操作符。”到底为什么啊,我平常一直就用的‘+’号操作符啊!二哥有空的时候能否写一篇文章分析一下呢? 就在昨天,一位叫小菜的读者微信我说了上面这段话。 我当时看到这条微信的第一感觉是:小菜你也太菜了吧,这都不知道为啥啊!我估
"狗屁不通文章生成器"登顶GitHub热榜,分分钟写出万字形式主义大作
GitHub 被誉为全球最大的同性交友网站,……,陪伴我们已经走过 10+ 年时间,它托管了大量的软件代码,同时也承载了程序员无尽的欢乐。 万字申请,废话报告,魔幻形式主义大作怎么写?兄dei,狗屁不通文章生成器了解一下。这个富有灵魂的项目名吸引了众人的目光。项目仅仅诞生一周,便冲上了GitHub趋势榜榜首(Js中文网 -前端进阶资源教程)、是榜首哦
推荐几款比较实用的工具,网站
1.盘百度PanDownload   这个云盘工具是免费的,可以进行资源搜索,提速(偶尔会抽风......) 不要去某站买付费的......   PanDownload下载地址   2.BeJSON 这是一款拥有各种在线工具的网站,推荐它的主要原因是网站简洁,功能齐全,广告相比其他广告好太多了     bejson网站   3.二维码美化 这个网站的二维码美化很好看,网站界面
《程序人生》系列-这个程序员只用了20行代码就拿了冠军
你知道的越多,你不知道的越多 点赞再看,养成习惯GitHub上已经开源https://github.com/JavaFamily,有一线大厂面试点脑图,欢迎Star和完善 前言 这一期不算《吊打面试官》系列的,所有没前言我直接开始。 絮叨 本来应该是没有这期的,看过我上期的小伙伴应该是知道的嘛,双十一比较忙嘛,要值班又要去帮忙拍摄年会的视频素材,还得搞个程序员一天的Vlog,还要写BU
程序员把地府后台管理系统做出来了,还有3.0版本!12月7号最新消息:已在开发中有github地址
第一幕:缘起 听说阎王爷要做个生死簿后台管理系统,我们派去了一个程序员…… 996程序员做的梦: 第一场:团队招募 为了应对地府管理危机,阎王打算找“人”开发一套地府后台管理系统,于是就在地府总经办群中发了项目需求。 话说还是中国电信的信号好,地府都是满格,哈哈!!! 经常会有外行朋友问:看某网站做的不错,功能也简单,你帮忙做一下? 而这次,面对这样的需求,这个程序员
网易云6亿用户音乐推荐算法
网易云音乐是音乐爱好者的集聚地,云音乐推荐系统致力于通过 AI 算法的落地,实现用户千人千面的个性化推荐,为用户带来不一样的听歌体验。 本次分享重点介绍 AI 算法在音乐推荐中的应用实践,以及在算法落地过程中遇到的挑战和解决方案。 将从如下两个部分展开: AI 算法在音乐推荐中的应用 音乐场景下的 AI 思考 从 2013 年 4 月正式上线至今,网易云音乐平台持续提供着:乐屏社区、UGC
8年经验面试官详解 Java 面试秘诀
    作者 | 胡书敏 责编 | 刘静 出品 | CSDN(ID:CSDNnews) 本人目前在一家知名外企担任架构师,而且最近八年来,在多家外企和互联网公司担任Java技术面试官,前后累计面试了有两三百位候选人。在本文里,就将结合本人的面试经验,针对Java初学者、Java初级开发和Java开发,给出若干准备简历和准备面试的建议。   Java程序员准备和投递简历的实
面试官如何考察你的思维方式?
1.两种思维方式在求职面试中,经常会考察这种问题:北京有多少量特斯拉汽车? 某胡同口的煎饼摊一年能卖出多少个煎饼? 深圳有多少个产品经理? 一辆公交车里能装下多少个乒乓球? 一
相关热词 c#处理浮点数 c# 生成字母数字随机数 c# 动态曲线 控件 c# oracle 开发 c#选择字体大小的控件 c# usb 批量传输 c#10进制转8进制 c#转base64 c# 科学计算 c#下拉列表获取串口
立即提问