linux升级glibc2.11报错

linux升级glibc2.11报错,部分报错信息如下:

gcc ../sysdeps/x86_64/dl-trampoline.S -c -I../include -I/usr/glibc/glibc-2.11.1/glibc-build/elf -I/usr/glibc/glibc-2.11.1/glibc-build -I../sysdeps/x86_64/elf -I../nptl/sysdeps/unix/sysv/linux/x86_64 -I../sysdeps/unix/sysv/linux/x86_64 -I../sysdeps/unix/sysv/linux/wordsize-64 -I../nptl/sysdeps/unix/sysv/linux -I../nptl/sysdeps/pthread -I../sysdeps/pthread -I../ports/sysdeps/unix/sysv/linux -I../sysdeps/unix/sysv/linux -I../sysdeps/gnu -I../sysdeps/unix/common -I../sysdeps/unix/mman -I../sysdeps/unix/inet -I../nptl/sysdeps/unix/sysv -I../ports/sysdeps/unix/sysv -I../sysdeps/unix/sysv -I../sysdeps/unix/x86_64 -I../nptl/sysdeps/unix -I../ports/sysdeps/unix -I../sysdeps/unix -I../sysdeps/posix -I../sysdeps/x86_64/fpu -I../nptl/sysdeps/x86_64 -I../sysdeps/x86_64 -I../sysdeps/wordsize-64 -I../sysdeps/ieee754/ldbl-96 -I../sysdeps/ieee754/dbl-64 -I../sysdeps/ieee754/flt-32 -I../sysdeps/ieee754 -I../sysdeps/generic/elf -I../sysdeps/generic -I../nptl -I../ports -I.. -I../libio -I. -D_LIBC_REENTRANT -include ../include/libc-symbols.h -DASSEMBLER -g -Wa,--noexecstack -o /usr/glibc/glibc-2.11.1/glibc-build/elf/dl-trampoline.o -MD -MP -MF /usr/glibc/glibc-2.11.1/glibc-build/elf/dl-trampoline.o.dt -MT /usr/glibc/glibc-2.11.1/glibc-build/elf/dl-trampoline.o
../sysdeps/x86_64/dl-trampoline.h: Assembler messages:
../sysdeps/x86_64/dl-trampoline.h:23: Error: no such instruction: vmovdqu %ymm0,(192)(%rsp)'
../sysdeps/x86_64/dl-trampoline.h:24: Error: no such instruction:
vmovdqu %ymm1,(192+64)(%rsp)'
../sysdeps/x86_64/dl-trampoline.h:25: Error: no such instruction: vmovdqu %ymm2,(192+64*2)(%rsp)'
../sysdeps/x86_64/dl-trampoline.h:26: Error: no such instruction:
vmovdqu %ymm3,(192+64*3)(%rsp)'
../sysdeps/x86_64/dl-trampoline.h:27: Error: no such instruction: vmovdqu %ymm4,(192+64*4)(%rsp)'
../sysdeps/x86_64/dl-trampoline.h:28: Error: no such instruction:
vmovdqu %ymm5,(192+64*5)(%rsp)'
../sysdeps/x86_64/dl-trampoline.h:29: Error: no such instruction: vmovdqu %ymm6,(192+64*6)(%rsp)'
../sysdeps/x86_64/dl-trampoline.h:30: Error: no such instruction:
vmovdqu %ymm7,(192+64*7)(%rsp)'
../sysdeps/x86_64/dl-trampoline.h:34: Error: no such instruction: vmovdqa %xmm0,(704)(%rsp)'
../sysdeps/x86_64/dl-trampoline.h:35: Error: no such instruction:
vmovdqa %xmm1,(704+16)(%rsp)'
../sysdeps/x86_64/dl-trampoline.h:36: Error: no such instruction: vmovdqa %xmm2,(704+16*2)(%rsp)'
../sysdeps/x86_64/dl-trampoline.h:37: Error: no such instruction:
vmovdqa %xmm3,(704+16*3)(%rsp)'
../sysdeps/x86_64/dl-trampoline.h:38: Error: no such instruction: vmovdqa %xmm4,(704+16*4)(%rsp)'
../sysdeps/x86_64/dl-trampoline.h:39: Error: no such instruction:
vmovdqa %xmm5,(704+16*5)(%rsp)'
../sysdeps/x86_64/dl-trampoline.h:40: Error: no such instruction: vmovdqa %xmm6,(704+16*6)(%rsp)'
../sysdeps/x86_64/dl-trampoline.h:41: Error: no such instruction:
vmovdqa %xmm7,(704+16*7)(%rsp)'
../sysdeps/x86_64/dl-trampoline.h:70: Error: no such instruction: vpcmpeqq (704)(%rsp),%xmm0,%xmm8'
../sysdeps/x86_64/dl-trampoline.h:71: Error: no such instruction:
vpmovmskb %xmm8,%esi'
../sysdeps/x86_64/dl-trampoline.h:74: Error: no such instruction: vmovdqa %xmm0,(192)(%rsp)'
../sysdeps/x86_64/dl-trampoline.h:76: Error: no such instruction:
vmovdqu (192)(%rsp),%ymm0'
../sysdeps/x86_64/dl-trampoline.h:77: Error: no such instruction: vmovdqa %xmm0,(64)(%rsp)'
../sysdeps/x86_64/dl-trampoline.h:79: Error: no such instruction:
vpcmpeqq (704+16)(%rsp),%xmm1,%xmm8'
../sysdeps/x86_64/dl-trampoline.h:80: Error: no such instruction: vpmovmskb %xmm8,%esi'
../sysdeps/x86_64/dl-trampoline.h:83: Error: no such instruction:
vmovdqa %xmm1,(192+64)(%rsp)'
../sysdeps/x86_64/dl-trampoline.h:85: Error: no such instruction: vmovdqu (192+64)(%rsp),%ymm1'
../sysdeps/x86_64/dl-trampoline.h:86: Error: no such instruction:
vmovdqa %xmm1,(64+16)(%rsp)'
../sysdeps/x86_64/dl-trampoline.h:88: Error: no such instruction: vpcmpeqq (704+16*2)(%rsp),%xmm2,%xmm8'
../sysdeps/x86_64/dl-trampoline.h:89: Error: no such instruction:
vpmovmskb %xmm8,%esi'
../sysdeps/x86_64/dl-trampoline.h:92: Error: no such instruction: vmovdqa %xmm2,(192+64*2)(%rsp)'
../sysdeps/x86_64/dl-trampoline.h:94: Error: no such instruction:
vmovdqu (192+64*2)(%rsp),%ymm2'
../sysdeps/x86_64/dl-trampoline.h:95: Error: no such instruction: vmovdqa %xmm2,(64+16*2)(%rsp)'
../sysdeps/x86_64/dl-trampoline.h:97: Error: no such instruction:
vpcmpeqq (704+16*3)(%rsp),%xmm3,%xmm8'
../sysdeps/x86_64/dl-trampoline.h:98: Error: no such instruction: vpmovmskb %xmm8,%esi'
../sysdeps/x86_64/dl-trampoline.h:101: Error: no such instruction:
vmovdqa %xmm3,(192+64*3)(%rsp)'
../sysdeps/x86_64/dl-trampoline.h:103: Error: no such instruction: vmovdqu (192+64*3)(%rsp),%ymm3'
../sysdeps/x86_64/dl-trampoline.h:104: Error: no such instruction:
vmovdqa %xmm3,(64+16*3)(%rsp)'
../sysdeps/x86_64/dl-trampoline.h:106: Error: no such instruction: vpcmpeqq (704+16*4)(%rsp),%xmm4,%xmm8'
../sysdeps/x86_64/dl-trampoline.h:107: Error: no such instruction:
vpmovmskb %xmm8,%esi'
../sysdeps/x86_64/dl-trampoline.h:110: Error: no such instruction: vmovdqa %xmm4,(192+64*4)(%rsp)'
../sysdeps/x86_64/dl-trampoline.h:112: Error: no such instruction:
vmovdqu (192+64*4)(%rsp),%ymm4'
../sysdeps/x86_64/dl-trampoline.h:113: Error: no such instruction: vmovdqa %xmm4,(64+16*4)(%rsp)'
../sysdeps/x86_64/dl-trampoline.h:115: Error: no such instruction:
vpcmpeqq (704+16*5)(%rsp),%xmm5,%xmm8'
../sysdeps/x86_64/dl-trampoline.h:116: Error: no such instruction: vpmovmskb %xmm8,%esi'
../sysdeps/x86_64/dl-trampoline.h:119: Error: no such instruction:
vmovdqa %xmm5,(192+64*5)(%rsp)'
../sysdeps/x86_64/dl-trampoline.h:121: Error: no such instruction: vmovdqu (192+64*5)(%rsp),%ymm5'
../sysdeps/x86_64/dl-trampoline.h:122: Error: no such instruction:
vmovdqa %xmm5,(64+16*5)(%rsp)'
../sysdeps/x86_64/dl-trampoline.h:124: Error: no such instruction: vpcmpeqq (704+16*6)(%rsp),%xmm6,%xmm8'
../sysdeps/x86_64/dl-trampoline.h:125: Error: no such instruction:
vpmovmskb %xmm8,%esi'
../sysdeps/x86_64/dl-trampoline.h:128: Error: no such instruction: vmovdqa %xmm6,(192+64*6)(%rsp)'
../sysdeps/x86_64/dl-trampoline.h:130: Error: no such instruction:
vmovdqu (192+64*6)(%rsp),%ymm6'
../sysdeps/x86_64/dl-trampoline.h:131: Error: no such instruction: vmovdqa %xmm6,(64+16*6)(%rsp)'
../sysdeps/x86_64/dl-trampoline.h:133: Error: no such instruction:
vpcmpeqq (704+16*7)(%rsp),%xmm7,%xmm8'
../sysdeps/x86_64/dl-trampoline.h:134: Error: no such instruction: vpmovmskb %xmm8,%esi'
../sysdeps/x86_64/dl-trampoline.h:137: Error: no such instruction:
vmovdqa %xmm7,(192+64*7)(%rsp)'
../sysdeps/x86_64/dl-trampoline.h:139: Error: no such instruction: vmovdqu (192+64*7)(%rsp),%ymm7'
../sysdeps/x86_64/dl-trampoline.h:140: Error: no such instruction:
vmovdqa %xmm7,(64+16*7)(%rsp)'
../sysdeps/x86_64/dl-trampoline.h:217: Error: no such instruction: vmovdqu %ymm0,80(%rcx)'
../sysdeps/x86_64/dl-trampoline.h:218: Error: no such instruction:
vmovdqu %ymm1,144(%rcx)'
../sysdeps/x86_64/dl-trampoline.h:222: Error: no such instruction: vmovdqa %xmm0,(208)(%rcx)'
../sysdeps/x86_64/dl-trampoline.h:223: Error: no such instruction:
vmovdqa %xmm1,(208+16)(%rcx)'
../sysdeps/x86_64/dl-trampoline.h:243: Error: no such instruction: vpcmpeqq (208)(%rsp),%xmm0,%xmm2'
../sysdeps/x86_64/dl-trampoline.h:244: Error: no such instruction:
vpmovmskb %xmm2,%esi'
../sysdeps/x86_64/dl-trampoline.h:247: Error: no such instruction: vmovdqu 80(%rsp),%ymm0'
../sysdeps/x86_64/dl-trampoline.h:249: Error: no such instruction:
vpcmpeqq (208+16)(%rsp),%xmm1,%xmm2'
../sysdeps/x86_64/dl-trampoline.h:250: Error: no such instruction: vpmovmskb %xmm2,%esi'
../sysdeps/x86_64/dl-trampoline.h:253: Error: no such instruction:
vmovdqu 144(%rsp),%ymm1'
make[2]: *** [/usr/glibc/glibc-2.11.1/glibc-build/elf/dl-trampoline.o] 错误 1
make[2]: Leaving directory /usr/glibc/glibc-2.11.1/elf'
make[1]: *** [elf/subdir_lib] 错误 2
make[1]: Leaving directory
/usr/glibc/glibc-2.11.1'
make: *** [all] 错误 2

0

1个回答

0
Csdn user default icon
上传中...
上传图片
插入图片
抄袭、复制答案,以达到刷声望分或其他目的的行为,在CSDN问答是严格禁止的,一经发现立刻封号。是时候展现真正的技术了!
其他相关推荐
glibc rpm升级包
linux glibc (2.14/2.15/2.18)rpm升级包 linux glibc (2.14/2.15/2.18)rpm升级包
linux服务器nginx升级报错解决
公司有几台点播服务器,用的是nginx+nginx_mod_h264_streaming模块,由于安装的时间不同,所以几台服务器上的nginx版本都不相同,早起装的是nginx1.0.5版本。而目前nginx都已经升级到mainline1.5.3版本,stable版本也升级到了1.4.3版本了。主要还是更新太快了,仔细考虑下,决定把使用的版本升级到1.3.3版。rn准备工作需要确认服务器系统版本,
Linux环境下 升级Python的pip,导致pip命令不可用,报错ImportError: cannot import name main解决办法
首先进入根目录,在 usr/bin 目录下 找到 pip 文件。(如果是在虚拟环境中,则需要去对应的虚拟环境中查找对应的 pip 文件)n打开pip文件显示代码如下:n# -*- coding: utf-8 -*-nimport renimport sysnnfrom pip import mainnnif __name__ == '__main__':n sys.argv[0] = re....
Linux(Ubuntu)下pip3进行版本升级后报错的解决办法
系统中含有pyhton2.7和3.6两个,并且有个pip和pip3.n在使用pip3 install --upgrade pip升级后,再次访问pip3会出现报错:nTraceback (most recent call last):n File "/usr/bin/pip3", line 9, in <module>n from pip import mainnImportE...
SUSE11 SP3系统源码升级安装glibc2.18
SUSE11 SP3系统源码升级安装glibc2.18nn1、下载源码安装包nn        glibc-2.18.tar.gznn2、保存以下脚本到setup.sh,或者手动执行install函数里面的脚本nn[root@QIANZI-BASE home]# vim setup.shnn#!/bin/bashnnNAME=""nVERSION=""nSUFFIX="tar.gz"nSUBJEC...
pip升级后遇到的错误
pip升级到10之后出现错误,解决方法卸载原有的pip  apt-get remove python-pipeasy_install -U pip原理未知,留个坑回头踩
用友软件 u821升级u6报错.rar
用友软件 u821升级u6报错.rar用友软件 u821升级u6报错.rar
酷派升级工具
解决酷派手机升级报错,解决8705,8702等4g机型升级报错
cmake 升级遇到的错误
用了半天时间,我真的九条命都给了ubuntu了cmake网址:http://www.cmake.org/download/下载自己需要的1)配置$ cd cmake-3.4.0~/cmake-3.4.0$ sudo ./bootstrap~/cmake-3.4.0$ sudo ./configure --prefix=/usr/local/cmake-3.4.02) 编译~/cmake-3.4.0...
Node.js升级与升级失败的解决方法
Node.js升级rn使用 Node.js 专用管理版本的模块 n 来升级rn(下文命令都可能需要超级权限,加sudo)rn1. 安装rnnpm install -g nrn2. 升级到稳定版本rnn stablern3. 升级到指定版本rnn 0.10.26rnrnrn方法是很简单,但是由于这货在墙外,经常会出现升级失败的情况,下面是如何离线解决的问题rn失败后首先要删除刚刚失败的版本rnn -
pip 换源、安装、升级,pip超时,报错 解决方案
安装mysqlclient出错,终于找到解决神方法:pip安装报错: n Failed building wheel for n failed with exit status 2 n 解决方案import platformnplatform.architecture() 看下平台信息 n然后去http://www.lfd.uci.edu/~gohlke/pythonlibs/ n下载对应版本所需w
升级Node.js报错
解决bug:not compatible with your operating system or architecture: n@2.1.8
Cenos python2.6升级2.7后存在问题
1、Centos升级后,pip时会报如下错误:nnnTraceback (most recent call last):n File "./pip", line 5, in <module>n from pkg_resources import load_entry_pointn File "/opt/soft/distribute-0.7.3/pkg_resources.p...
npm更新出错的解决方法
欢迎关注本人Github:https://github.com/itgoyonn错误信息如下:nnnpm ERR! code ECONNRESETnnpm ERR! errno ECONNRESETnnpm ERR! network request to https://registry.npmjs.org/npm failed, reason: socket hang upnnpm ERR! n...
linux系统下pip不能更新问题解决
linux系统下pip不能更新问题解决,python setup.py egg_info" failed with error code 1 ,Not uninstalling pip at /usr/lib/python2.7/dist-packages, outside environment /us
联想锋行bios
联想bios升级cpu f1报错 解决方案
curl: (35) SSL connect error报错处理,更新nss版本;Linux版本centos7下载树
n处理n请求命令 curl -O https:// xxx 时候,报错curl: (35) SSL connect errorn原因是nss版本有点旧了,yum -y update nss更新一下nLinux7下载树地址:nhttp://mirrors.163.com/centos/7/isos/x86_64/nnnn更新完毕,从新请求:n下载mogoDBncurl -O https://f...
LINUX升级GCC版本至8.3.0
GCC(GNU Compiler Collection,GNU编译器套件),是由 GNU 开发的编程语言编译器。它是以GPL许可证所发行的自由软件,也是 GNU计划的关键部分。GCC原本作为GNU操作系统的官方编译器,现已被大多数类Unix操作系统(如Linux、BSD、Mac OS X等)采纳为标准的编译器,GCC同样适用于微软的Windows。GCC是自由软件过程发展中的著名例子,由自由软...
Linux下将python2.6升级到2.7 安装pip 以及升级中遇到问题的解决方法
python2.6版本有很多局限性:最重要的就是,当前最新的pip版本已经不再支持python2.6;这给我们安装很多python库增加了很多不便;所以这里把我升级python2.6--2.7的过程及遇到的坑 记录一下:实验系统版本centos6+ ;centos7+版本自带的python版本就是2.7+的。第一步:安装相关的编译依赖包:[root@lexsaints ~]# yum instal...
Jenkins升级遇到的错
前言n  由于项目要求需要把Jenkins的版本升级,本人也没有实践过,所以就查了一下怎么做,看了看操作步骤还是挺简单的,就想着试验一下。n过程n  1.找到Jenkins的安装目录,默认安装的话是:/usr/lib/jenkinsncd /usr/lib/jenkins  2.关闭Jenkins服务nservice Jenkins stop  3.以防出现问题,先备份jenkins.w
用rvm安装升级ruby
1. 在安装redis时报错说ruby的版本低,用rvm进行安装ruby:(用源码进行安装ruby也不行)rn2. 安装RVM:rn  gpg2 --keyserver hkp://keys.gnupg.net --recv-keys D39DC0E3rn  curl -L get.rvm.io | bash -s stablern  find / -name rvm -printrn  sour
pip升级到18.0版本过程中报错解决方法
我这台电脑是windows10系统,一般在cmd命令行界面下执行pip的升级命令:pip install –upgrade pip n安装的时候,会有拒绝访问报错:这个时候应该是权限的问题,于是在win10系统的搜索框输入cmd,然后在命令提示符上点右键,选择以管理员身份运行。 nnn然后就执行pip的升级命令:pip install –upgrade pip就可以了...
Linux之cudnn升级方法
在安装tensorrt的时候,要求cudnn版本为7.3.1,而我之前安装的版本是5.1.10,因此需要对cudnn进行升级,升级方法很简单,而且不会对现有安装环境造成破坏,升级完之后tensorflow还可以正常使用nn1 查看cudnn版本nn首先使用以下指令查看现有cudnn的版本nnncat /usr/local/cuda/include/cudnn.h | grep CUDNN_MAJO...
Linux系统中Python2升级到Python3出现的问题
问题描述:    本来好久就没有使用我的Ubuntu系统了。今天突然心血来潮,想换姿势码代码、进入系统后随机更新了一些软件:# sudo apt-get updaten# sudo apt-get upgrade    结果在upgrade时出现了以下错误:Errors were encountered while processing: n /var/cache/apt/archives/ap...
linux环境下如何快速升级你的Node.js
安装n安装Node.js有好多中方法,一般从管网下载好安装包,点击安装即可(跟所有的Windows应用一样方便)。在Linux上安装Node.js,也可以下载源码编译安装:n# tar xvf node-vx.x.x.tar.gz n# cd node-vx.x.xn# ./configure n# make n# make install nps.不要忘记设置全局环境变量n当然也可
clamav升级
可以升级的,具体步骤如下:先在http://www.clamav.net/下载最新版本然后,删除旧版本(以0.88为例)cd /home/pkg/clamav-0.88make uninstall安装新版本cd /home/pkg/tar zvxf clamav-0.88.7.tar.gzcd clamav-0.88.7./configure --disable-zlib-vcheckmake &...
Linux 升级 gcc 版本
环境:Ubuntu 12.04 LTS nGCC版本:4.6.3 n升级原因:不支持C++11 n目标gcc版本:gcc 5.1.0nnnn下载 gcc 安装包nnn由于直接从官网下载速度比较慢,选择一个速度比较快的镜像下载: nhttp://mirrors-usa.go-parts.com/gcc/releases/gcc-5.1.0/gcc-5.1.0.tar.gzn解压缩:tar -xvzf...
升级curl
下载安装curl 7.55.1报错:curl: error while loading shared libraries: libcurl.so.4: cannot open shared object file: No such file or directory解决: n/usr/lib里有libcurl.so.3, /usr/local/lib里有libcurl.so.4[root@local
Linux离线(手动)升级GCC-4.8
本文介绍在系统无法连接互联网的情况下,如何升级GCC。离线和在线升级的主要区别在于,如果可以联网,在升级gcc前的需要安装的依赖包,可以通过运行gcc安装包下的脚本自行下载安装,免去了很多的麻烦。
linux下升级pip 到10.0.X出现不能使用命令行pip
pip 升级后,控制台上编写pip命令行会出现以下错误:Traceback (most recent call last): File “/usr/bin/pip3”, line 9, in from pip import main或者pip 时也出现这个问题 这是pip 10.0.0版本的BUG解决办法修改 /usr/bin/pip 文件from pip import mainnif __na...
setuptools升级7+引发的错误
今天用pip install包的时候,下载完成后报了以下错误nValueError: A 0.7-series setuptools cannot be installed with distribute. Found one at /usr/local/lib/python2.7/dist-packages/setuptools-20.7.0.post20160415-py2.7.egg
软件安装与升级——rpm
软件安装与升级——rpmnnLinux的自由软件非常多,为了方便软件的管理,目前有两大主流软件管理工具:dpkg和RPM。本文主要介绍RPM的相关信息。nnRPM与SRPMnRPM是RedHat Package Manager的简称,是一种软件管理机制,起初是有RedHad公司发展出来的。RPM是以一种数据库记录的方式来将我们所需的软件安装到Linux系统中。RPM软件包制作时,会将安装软件源码进...
Centos7更新yum报错 解决
替换好YUM源后再更新YUM的的时候报错如下:意思是nginx.repo 源文件找不到路径404  ,是因为$releaserver(centos版本号)变量在该源文件中的值位置,所以我直接写死(写成centos的版本号  7).然后重试就可以....
npm升级后报错
原node版本:v3.3.1 n原npm版本:v2.3.0 n希望npm升级到3.0以上 n于是直接执行了命令:npm install -g npm n结果就报错了: nSyntaxError: Block-scoped declarations (let, const, function, class) not yet supported outside stric n升级之后npm命令用不了,...
关于centos安装升级CMake3.6的报错整理
1、安装cmake工具:nn0、使用yum命令安装GCC开发工具包以及开发库nnyum -y groupinstall "Development Tools"nnyum install ncurses-develnn1.下载源码安装包:cmake-3.6.0.tar.gz(下载地址:https://cmake.org/files/v3.6/cmake-3.6.0.tar.gz)
ipod ipad iphone 软件更新 ios4.2 报错解决方案
ipod ipad iphone 升级 ios4.2 报错解决方案 绝对可靠。
部分业务从Tomcat6升级到Tomcat7后,访问部分jsp报错
升级tomcat后,访问jsp报错500,错误信息如下:org.apache.jasper.JasperException: … … The JSP specification requires that an attribute name is preceded by whitespace问题原因:Tomcat7增加了个参数 org.apache.jasper.compiler.Parser.S...
在linux安装Nginx以从http升级到https
在linux安装Nginx以从http升级到https本文章以cent OS为例说一下在linux平台下安装Nginx下的一些经验。可以通过yum 安装通过命令yum -y install nginx就能进行安装,剩下的就是自己进行一些防火墙和配置文件的配置。 n但是上面的不能指定版本,也就是说不能下载很新的版本,如果对版本有要求的要是要看下面的方式。解压Nginx压缩包创建用户Nginx使用的ww
swig使用介绍
swig是Simplified Wrapper and Interface Generator的简称,它是一个能将C和C++的程序与其他各种高级语言诸如Perl,Python,Ruby和Tcl进行连结的开发工具。nnswig的官方中文网站:http://www.swig.org/translations/chinesenn什么是typemapnntymemap are an advanced cu...
AS升级NDK 17版本到18版本报错解决方法
AS检测升级NDK由1.7到1.8版本后会爆No toolchains found in the NDK toolchains folder for ABI with prefix: mips64el-linux-android错误(Linux环境下)n产生原因:NDK(r17c)版本升级到NDK(r18c)版本后,ndk-nbundle>>>toolchains文件夹中缺少mi...
文章热词 机器学习教程 Objective-C培训 交互设计视频教程 颜色模型 设计制作学习
相关热词 mysql关联查询两次本表 native底部 react extjs glyph 图标 区块链升级 乌班图升级python