vscode 编码Python时出现Error: spawn python ENOENT问题

我在Python2.7上写Python程序时能够运行,在vscode上总是不能调试出结果,出现Error: spawn python ENOENT,不知道只是什么意思,请教一下。
图片说明
图片说明

3个回答

vscode没有正确配置,跟python关联

qq_34818060
34818060 怎么配置,是 launch.json?
3 年多之前 回复
qq_34818060
34818060 照文章那样配置了还是不行,感觉提示的错误是在launch.json里面
3 年多之前 回复

你试试在系统命令行中输入"python -V",v需要大写,如果有问题,说明原因是python没被加入环境变量。
比如,我的python安装在D盘,需要在环境变量 -> 系统变量 的Path中添加"D:\Python\Python36-32".你需要根据自己实际安装python的目录来调整。
图片说明

按上图加入之后,重启命令行,再输入"python -V",如果正常再试试vs code,问题应该已经解决了。

Csdn user default icon
上传中...
上传图片
插入图片
抄袭、复制答案,以达到刷声望分或其他目的的行为,在CSDN问答是严格禁止的,一经发现立刻封号。是时候展现真正的技术了!
其他相关推荐
hexo d部署报错fatal: unable to access... OpenSSL SSL_connect: SSL_ERROR_SYSCALL in connection to github.com:443. Error: Spawn failed
![图片说明](https://img-ask.csdn.net/upload/201911/05/1572956033_106060.png) 问题在弄网页写latex时就出现过,以为是找了个错误教程导致,今天重新把之前的被封复制粘贴过来还是报错,不懂问题出在哪,网上找了一些方法,或者是与自己不同,或者尝试了没用。求大佬出手相救,感激不尽。
webstorm中grunt运行pancn_serve时报错
前几天还好好的,最近在webstorm中运行pancn serve是时就会报错, 页面也没自动弹出来,报错信息如下: Fatal error: spawn cmd ENOENT 求大神帮忙
locust(蝗虫)一直运行不了,尝试了很多方法都不行,求见过的大佬帮忙解决
[2019-11-21 09:20:20,796] 小米笔记本/INFO/locust.main: Starting web monitor at *:8089 [2019-11-21 09:20:20,796] 小米笔记本/INFO/locust.main: Starting Locust 0.13.2 [2019-11-21 09:20:20,806] 小米笔记本/ERROR/stderr: Traceback (most recent call last): [2019-11-21 09:20:20,806] 小米笔记本/ERROR/stderr: [2019-11-21 09:20:20,806] 小米笔记本/ERROR/stderr: File "c:\python\lib\site-packages\gevent\threadpool.py", line 281, in _worker value = func(*args, **kwargs) [2019-11-21 09:20:20,807] 小米笔记本/ERROR/stderr: [2019-11-21 09:20:20,807] 小米笔记本/ERROR/stderr: UnicodeDecodeError: 'utf-8' codec can't decode byte 0xc3 in position 2: invalid continuation byte [2019-11-21 09:20:20,807] 小米笔记本/ERROR/stderr: [2019-11-21 09:20:20,807] 小米笔记本/ERROR/stderr: 2019-11-21T01:20:20Z [2019-11-21 09:20:20,808] 小米笔记本/ERROR/stderr: [2019-11-21 09:20:20,808] 小米笔记本/ERROR/stderr: (<ThreadPool at 0x3ae3550 0/1/10 hub=<Hub at 0x41a7bd8 thread_ident=0x26720>>, <built-in func tion gethostbyaddr>) failed with UnicodeDecodeError [2019-11-21 09:20:20,812] 小米笔记本/ERROR/stderr: Traceback (most recent call last): [2019-11-21 09:20:20,812] 小米笔记本/ERROR/stderr: [2019-11-21 09:20:20,812] 小米笔记本/ERROR/stderr: File "src/gevent/greenlet.py", line 818, in gevent._greenlet.Greenlet.run [2019-11-21 09:20:20,812] 小米笔记本/ERROR/stderr: [2019-11-21 09:20:20,812] 小米笔记本/ERROR/stderr: File "c:\python\lib\site-packages\locust\web.py", line 201, in start pywsgi.WSGIServer((options.web_host, options.port), [2019-11-21 09:20:20,812] 小米笔记本/ERROR/stderr: [2019-11-21 09:20:20,813] 小米笔记本/ERROR/stderr: File "c:\python\lib\site-packages\gevent\baseserver.py", line 385, in serve_forever self.start() [2019-11-21 09:20:20,813] 小米笔记本/ERROR/stderr: [2019-11-21 09:20:20,813] 小米笔记本/ERROR/stderr: File "c:\python\lib\site-packages\gevent\baseserver.py", line 323, in start self.init_socket() [2019-11-21 09:20:20,813] 小米笔记本/ERROR/stderr: [2019-11-21 09:20:20,814] 小米笔记本/ERROR/stderr: File "c:\python\lib\site-packages\gevent\pywsgi.py", line 1479, in init_socket self.update_environ() [2019-11-21 09:20:20,814] 小米笔记本/ERROR/stderr: [2019-11-21 09:20:20,815] 小米笔记本/ERROR/stderr: File "c:\python\lib\site-packages\gevent\pywsgi.py", line 1491, in update_environ name = socket.getfqdn(address[0]) [2019-11-21 09:20:20,815] 小米笔记本/ERROR/stderr: [2019-11-21 09:20:20,815] 小米笔记本/ERROR/stderr: File "c:\python\lib\site-packages\gevent\_socketcommon.py", line 275, in getfqdn hostname, aliases, _ = gethostbyaddr(name) [2019-11-21 09:20:20,815] 小米笔记本/ERROR/stderr: [2019-11-21 09:20:20,816] 小米笔记本/ERROR/stderr: File "c:\python\lib\site-packages\gevent\_socketcommon.py", line 247, in gethostbyaddr return get_hub().resolver.gethostbyaddr(ip_address) [2019-11-21 09:20:20,816] 小米笔记本/ERROR/stderr: [2019-11-21 09:20:20,816] 小米笔记本/ERROR/stderr: File "c:\python\lib\site-packages\gevent\resolver\thread.py", line 70, in gethostbyaddr return self.pool.apply(_socket.gethostbyaddr, args, kwargs) [2019-11-21 09:20:20,816] 小米笔记本/ERROR/stderr: [2019-11-21 09:20:20,817] 小米笔记本/ERROR/stderr: File "c:\python\lib\site-packages\gevent\pool.py", line 159, in apply return self.spawn(func, *args, **kwds).get() [2019-11-21 09:20:20,817] 小米笔记本/ERROR/stderr: [2019-11-21 09:20:20,817] 小米笔记本/ERROR/stderr: File "src/gevent/event.py", line 268, in gevent._event.AsyncResult.get [2019-11-21 09:20:20,817] 小米笔记本/ERROR/stderr: [2019-11-21 09:20:20,818] 小米笔记本/ERROR/stderr: File "src/gevent/event.py", line 296, in gevent._event.AsyncResult.get [2019-11-21 09:20:20,818] 小米笔记本/ERROR/stderr: [2019-11-21 09:20:20,818] 小米笔记本/ERROR/stderr: File "src/gevent/event.py", line 286, in gevent._event.AsyncResult.get [2019-11-21 09:20:20,818] 小米笔记本/ERROR/stderr: [2019-11-21 09:20:20,818] 小米笔记本/ERROR/stderr: File "src/gevent/event.py", line 266, in gevent._event.AsyncResult._raise_exception [2019-11-21 09:20:20,819] 小米笔记本/ERROR/stderr: [2019-11-21 09:20:20,819] 小米笔记本/ERROR/stderr: File "c:\python\lib\site-packages\gevent\_compat.py", line 54, in reraise raise value.with_traceback(tb) [2019-11-21 09:20:20,819] 小米笔记本/ERROR/stderr: [2019-11-21 09:20:20,819] 小米笔记本/ERROR/stderr: File "c:\python\lib\site-packages\gevent\threadpool.py", line 281, in _worker value = func(*args, **kwargs) [2019-11-21 09:20:20,819] 小米笔记本/ERROR/stderr: [2019-11-21 09:20:20,819] 小米笔记本/ERROR/stderr: UnicodeDecodeError: 'utf-8' codec can't decode byte 0xc3 in position 2: invalid continuation byte [2019-11-21 09:20:20,820] 小米笔记本/ERROR/stderr: [2019-11-21 09:20:20,820] 小米笔记本/ERROR/stderr: 2019-11-21T01:20:20Z [2019-11-21 09:20:20,820] 小米笔记本/ERROR/stderr: [2019-11-21 09:20:20,821] 小米笔记本/ERROR/stderr: <Greenlet at 0x5143798: start([<class 'locustfile.WebsiteUser'>], Namespace(csvfilebase=None, exit_code_on_error=1, )> failed with UnicodeDecodeError [2019-11-21 09:20:20,821] 小米笔记本/INFO/locust.main: Shutting down (exit code 0), bye. [2019-11-21 09:20:20,821] 小米笔记本/INFO/locust.main: Cleaning up runner... [2019-11-21 09:20:20,821] 小米笔记本/INFO/locust.main: Running teardowns... Name # reqs # fails Avg Min Max | Median req/s failures/s -------------------------------------------------------------------------------------------------------------------------------------------- -------------------------------------------------------------------------------------------------------------------------------------------- Aggregated 0 0(0.00%) 0 0 0 | 0 0.00 0.00 Percentage of the requests completed within given times Name # reqs 50% 66% 75% 80% 90% 95% 98% 99% 99.9% 99.99% 1 00% ------------------------------------------------------------------------------------------------------------------------------------------------ ------ ------------------------------------------------------------------------------------------------------------------------------------------------ ------
vue-element-admin 中npm install 急等!我的git环境变量也配置了 dos 输入git也没问题 真是玄学!
npm ERR! path git npm ERR! code ENOENT npm ERR! errno ENOENT npm ERR! syscall spawn git npm ERR! enoent Error while executing: npm ERR! enoent undefined ls-remote -h -t ssh://git@github.com/sohee-lee7/Squire.git npm ERR! enoent npm ERR! enoent npm ERR! enoent spawn git ENOENT npm ERR! enoent This is related to npm not being able to find a file. npm ERR! enoent npm ERR! A complete log of this run can be found in:
如何使用selenium进行多协程填写表单?
系统: win10 环境:python3.7 浏览器:chrom 小白自学phthon,使用selenium写了一个工具,任务是进入帐号,点掉所有被选中的勾选框,但是假设我需要对1000个帐号进行同样的操作,for i in range(len(work)):将会打开1000个浏览器窗口,有没有一种方法能实现每次打开5个窗口,直至遍历帐号列表? 这是我的帐号列表:(假装有1000个帐号) (https://img-ask.csdn.net/upload/202001/06/1578295823_23416.png) 这是我的代码: ``` #!/usr/bin/env python # -*- coding:utf-8 -*- from gevent import monkey monkey.patch_all() from selenium import webdriver import time, openpyxl, gevent from gevent.queue import Queue work = Queue() def login(): if not work.empty(): user = work.get_nowait() driver = webdriver.Chrome() driver.get('http://safe.shougang.com.cn/srp/#') driver.maximize_window() # 打开浏览器登陆首安云并最大化窗口 username = driver.find_element_by_id('userName') username.send_keys(user) password = driver.find_element_by_id('passWord') password.send_keys(user[0][-6:]) # 传入帐号和密码 button = driver.find_element_by_css_selector('.btn.btn-primary') button.click() try: driver.find_element_by_css_selector('.x-component.x-window-text.x-box-item.x-component-default') print('用户%s 密码错误!\n队列剩余%s个' % (user, len(work))) driver.close() return except Exception: time.sleep(1) # 试登陆 try: url_yhpc = driver.find_element_by_partial_link_text('您有待排查') url_yhpc.click() time.sleep(1) except Exception: print('用户%s 无隐患排查任务\n队列剩余%s个' % (user, len(work))) driver.close() time.sleep(1) return daj_button = driver.find_elements_by_css_selector('.x-grid-checkcolumn.x-grid-checkcolumn-checked') for bt in daj_button: bt.click() time.sleep(0.5) send_button = driver.find_element_by_id('button-1302-btnInnerEl') send_button.click() time.sleep(1) yes_button = driver.find_element_by_id('button-1010-btnWrap') yes_button.click() time.sleep(1) driver.close() print('用户%s 排查成功\n队列剩余%s个' % (user, len(work))) def get_users(): wb = openpyxl.load_workbook(r'C:\users\lz315\Desktop\首安云试验.xlsx') ws = wb.active for row in ws.rows: list_user = [] for cell in row: aa = str(cell.value) list_user.append(aa) work.put_nowait(list_user) wb.close() return work # 读取帐号信息,返回帐号list start = time.time() get_users() task_list = [] for i in range(len(work)): task = gevent.spawn(login) task_list.append(task) gevent.joinall(task_list) end = time.time() print(end-start) ```
win10重新安装node10.12.0之后查看npm版本报错日志如下
0 info it worked if it ends with ok 1 verbose cli [ 'E:\\soft\\node\\node.exe', 1 verbose cli 'E:\\soft\\node\\node_modules\\npm\\bin\\npm-cli.js', 1 verbose cli 'prefix', 1 verbose cli '-g' ] 2 info using npm@6.4.1 3 info using node@v10.12.0 4 verbose stack Error: spawn E:\soft\node\node.exe ENOENT 4 verbose stack at Process.ChildProcess._handle.onexit (internal/child_process.js:232:19) 4 verbose stack at onErrorNT (internal/child_process.js:407:16) 4 verbose stack at process._tickCallback (internal/process/next_tick.js:63:19) 5 verbose cwd C:\Users\Administrator 6 verbose Windows_NT 10.0.16299 7 verbose argv "E:\\soft\\node\\node.exe" "E:\\soft\\node\\node_modules\\npm\\bin\\npm-cli.js" "prefix" "-g" 8 verbose node v10.12.0 9 verbose npm v6.4.1 10 error path E:\soft\node\node.exe 11 error code ENOENT 12 error errno ENOENT 13 error syscall spawn E:\soft\node\node.exe 14 error enoent spawn E:\soft\node\node.exe ENOENT 15 error enoent This is related to npm not being able to find a file. 16 verbose exit [ 1, true ] ![图片说明](https://img-ask.csdn.net/upload/201812/02/1543755227_153507.png) 我尝试了卸载node,并删除C:\Users\Administrator\AppData\Roaming下的 npm和npm_cache文件夹并没有解决问题
Python:SyntaxError: invalid syntax
#!/usr/bin/python import pexpect import shutil import os import stat remote_dir=r'/quest/splex-builds/depot/spo/9.0.1/latest/' local_dir=r'/splex/' tmp_file=r'/splex/tmp.txt' file_head=r'SharePlex-9.0.1-b' file_tail=r'-oracle110-rh-40-amd64-m64.tpm' user = 'qarun' ip = '127.0.0.1' mypassword = 'qarun' child = pexpect.spawn('ssh %s@%s' % (user, ip)) child.expect('password:') child.sendline(mypassword) child.expect('#') for (p, d, f) in os.walk(remote_dir): for i in f: if i.startswith(file_head) and i.endswith(file_tail): if os.path.exists(i): child.sendline(local_dir+i|tee -a tmp_file) [qarun@zh11gtm03:/splex]$./upgrade.py File "./upgrade.py", line 30 child.sendline(local_dir+i|tee -a tmp_file) ^ SyntaxError: invalid syntax 在最后的这行代码中,我想要实现执行这个命令的同时,将这个命令打印出来的代码都放到tmp_file里面,这个功能该如何实现呢?
npm i --global --product ion windows-build-tools 报错
安装项目依赖包时,报错: ``` MSBUILD : error MSB3428: 未能加载 Visual C++ 组件“VCBuild.exe”。 ``` 之后查了一下 用 ``` npm i --global --product ion windows-build-tools ``` 可以解决,结果执行之后再次报错: events.js:174 throw er; // Unhandled 'error' event ^ Error: spawn powershell.exe ENOENT at Process.ChildProcess._handle.onexit (internal/child_process.js:240:19) at onErrorNT (internal/child_process.js:415:16) at process._tickCallback (internal/process/next_tick.js:63:19) Emitted 'error' event at: at Process.ChildProcess._handle.onexit (internal/child_process.js:246:12) at onErrorNT (internal/child_process.js:415:16) at process._tickCallback (internal/process/next_tick.js:63:19) npm ERR! code ELIFECYCLE npm ERR! errno 1 npm ERR! windows-build-tools@5.1.0 postinstall: `node ./dist/index.js` npm ERR! Exit status 1 npm ERR! npm ERR! Failed at the windows-build-tools@5.1.0 postinstall script. npm ERR! This is probably not a problem with npm. There is likely additional log ging output above. npm ERR! A complete log of this run can be found in: npm ERR! C:\Users\Administrator\AppData\Roaming\npm-cache\_logs\2019-05-07T1 2_15_56_451Z-debug.log 求大佬救命
egret 求解!!!!!!急
C:\xampp\htdocs\myCpp>egret run 您正在使用白鹭编译器 5.2.12 版本 正在编译项目... events.js:160 throw er; // Unhandled 'error' event ^ Error: spawn C:\Program Files (x86)\Egret\EgretLauncher\resources\app\engine\win\node.exe ENOENT at exports._errnoException (util.js:1008:11) at Process.ChildProcess._handle.onexit (internal/child_process.js:182:32) at onErrorNT (internal/child_process.js:348:16) at _combinedTickCallback (internal/process/next_tick.js:74:11) at process._tickCallback (internal/process/next_tick.js:98:9) C:\xampp\htdocs\myCpp>
加载resnet网络 训练好PB模型加载的时候遇到如下错误? 如何解决? 求助
``` 2019-11-27 02:18:29 UTC [MainThread ] - /home/mind/app.py[line:121] - INFO: args: Namespace(model_name='serve', model_path='/home/mind/model/1', service_file='/home/mind/model/1/customize_service.py', tf_server_name='127.0.0.1') 2019-11-27 02:18:36.823910: I tensorflow/core/platform/cpu_feature_guard.cc:140] Your CPU supports instructions that this TensorFlow binary was not compiled to use: AVX2 AVX512F FMA Using TensorFlow backend. [2019-11-27 02:18:37 +0000] [68] [ERROR] Exception in worker process Traceback (most recent call last): File "/usr/local/lib/python3.6/site-packages/gunicorn/arbiter.py", line 583, in spawn_worker worker.init_process() File "/usr/local/lib/python3.6/site-packages/gunicorn/workers/base.py", line 129, in init_process self.load_wsgi() File "/usr/local/lib/python3.6/site-packages/gunicorn/workers/base.py", line 138, in load_wsgi self.wsgi = self.app.wsgi() File "/usr/local/lib/python3.6/site-packages/gunicorn/app/base.py", line 67, in wsgi self.callable = self.load() File "/usr/local/lib/python3.6/site-packages/gunicorn/app/wsgiapp.py", line 52, in load return self.load_wsgiapp() File "/usr/local/lib/python3.6/site-packages/gunicorn/app/wsgiapp.py", line 41, in load_wsgiapp return util.import_app(self.app_uri) File "/usr/local/lib/python3.6/site-packages/gunicorn/util.py", line 350, in import_app __import__(module) File "/home/mind/app.py", line 145, in model_service = class_defs[0](model_name, model_path) File "/home/mind/model/1/customize_service.py", line 39, in __init__ meta_graph_def = tf.saved_model.loader.load(self.sess, [tag_constants.SERVING], self.model_path) File "/usr/local/lib/python3.6/site-packages/tensorflow/python/saved_model/loader_impl.py", line 219, in load saver = tf_saver.import_meta_graph(meta_graph_def_to_load, **saver_kwargs) File "/usr/local/lib/python3.6/site-packages/tensorflow/python/training/saver.py", line 1955, in import_meta_graph **kwargs) File "/usr/local/lib/python3.6/site-packages/tensorflow/python/framework/meta_graph.py", line 743, in import_scoped_meta_graph producer_op_list=producer_op_list) File "/usr/local/lib/python3.6/site-packages/tensorflow/python/util/deprecation.py", line 432, in new_func return func(*args, **kwargs) File "/usr/local/lib/python3.6/site-packages/tensorflow/python/framework/importer.py", line 460, in import_graph_def _RemoveDefaultAttrs(op_dict, producer_op_list, graph_def) File "/usr/local/lib/python3.6/site-packages/tensorflow/python/framework/importer.py", line 227, in _RemoveDefaultAttrs op_def = op_dict[node.op] KeyError: 'DivNoNan' ```
利用Linux的shell脚本sshWindows执行命令不成功
写了一个自动备份数据库的脚本,但每天查看结果都比较麻烦,就想写一个自动提示的脚本,而且是从虚机的linux直接发送提示到物理机的Windows,利用msg弹窗,具体脚本如下: ``` #!/usr/bin/expect set timeout 30 set host "192.168.104.223" set username "administrator" set password "123" spawn ssh $username@$host expect "*password*" {send "$password\r"} expect "*Administrator*" {send "cmd\r"} expect "*Administrator*" {send "msg /server:$host * 已完成昨日MySQL数据库备份\r"} expect "*Administrator*" {send "exit\r"} expect "*Administrator*" {send "exit\r"} expect "*Administrator*" {send "exit\r"} ``` 如果我根据脚本的步骤手动去敲命令,物理机的Windows可以正常出现提示框,但写入到脚本之后就不行了,也不知道具体原因是什么,执行后如下所示: ``` [root@test_server shell]# ./windowspasswd.sh spawn ssh administrator@192.168.104.223 ****USAGE WARNING**** This is a private computer system. This computer system, including all related equipment, networks, and network devices (specifically including Internet access) are provided only for authorized use. This computer system may be monitored for all lawful purposes, including to ensure that its use is authorized, for management of the system, to facilitate protection against unauthorized access, and to verify security procedures, survivability, and operational security. Monitoring includes active attacks by authorized entities to test or verify the security of this system. During monitoring, information may be examined, recorded, copied and used for authorized purposes. All information, including personal information, placed or sent over this system may be monitored. Use of this computer system, authorized or unauthorized, constitutes consent to monitoring of this system. Unauthorized use may subject you to criminal prosecution. Evidence of unauthorized use collected during monitoring may be used for administrative, criminal, or other adverse action. Use of this system constitutes consent to monitoring for these purposes. administrator@192.168.104.223's password: Last login: Tue Dec 31 13:27:54 2019 from 192.168.104.223 Microsoft Windows [版本 6.1.7601] 版权所有 (c) 2009 Microsoft Corporation。保留所有权利。 D:\OpenSSH\home\Administrator>cmd Microsoft Windows [版本 6.1.7601] 版权所有 (c) 2009 Microsoft Corporation。保留所有权利。 D:\OpenSSH\home\Administrator>msg /server:192.168.104.223 * 已完成昨日MySQL数据库备份 ``` 按脚本来走的话,最后Windows应该是成功出现弹窗,同时命令行退回到Linux才对啊。但实际到上面哪里就卡住不动了,也没有弹窗,也没有退回Linux。
expetc脚本报错问题spawn id exp6 not open
先贴代码 主要我用一个shell脚本实现增加linux用户的功能 1 #!/usr/bin/expect -f 2 #!/bin/sh 3 set password 1 4 set name yiyi 5 set num "" 6 spawn adduser $name 7 set timeout 30; 8 expect { 9 password: {send $password\n;exp_continue}; 10 password: {send $password\n;exp_continue}; 11 *[]: {send $num\n;exp_continue}; 12 *[]: {send $num\n;exp_continue}; 13 Phone: {send $num\n;exp_continue}; 14 Phone: {send $num\n;exp_continue}; 15 Other: {send $num\n;exp_continue}; 16 } 17 set timeout 30 18 expect "Is the information correct?" 19 send "Y\r" 20 set timeout 30; 21 send exit\n; 22 expect eof 执行完就以报如下错误求大神解决啊: expect: spawn id exp6 not open while executing "expect "Is the information correct?"" (file "./adduser.sh" line 18)
NPM错误There is likely additional logging output above.怎么解决
0 info it worked if it ends with ok 1 verbose cli [ 'D:\\Program Files\\nodejs\\node.exe', 1 verbose cli 'D:\\Program Files\\nodejs\\node_modules\\npm\\bin\\npm-cli.js', 1 verbose cli 'run', 1 verbose cli 'build' ] 2 info using npm@6.9.0 3 info using node@v10.16.3 4 verbose run-script [ 'prebuild', 'build', 'postbuild' ] 5 info lifecycle 08cms@1.0.0~prebuild: 08cms@1.0.0 6 info lifecycle 08cms@1.0.0~build: 08cms@1.0.0 7 verbose lifecycle 08cms@1.0.0~build: unsafe-perm in lifecycle true 8 verbose lifecycle 08cms@1.0.0~build: PATH: D:\Program Files\nodejs\node_modules\npm\node_modules\npm-lifecycle\node-gyp-bin;c:\av\houses\node_modules\.bin;C:\Program Files (x86)\NetSarang\Xshell 6\;C:\Windows\system32;C:\Windows;C:\Windows\System32\Wbem;C:\Windows\System32\WindowsPowerShell\v1.0\;C:\Program Files (x86)\Microsoft SQL Server\80\Tools\BINN;d:\Program Files\OpenVPN\bin;D:\py;D:\Program Files\nodejs\;C:\Program Files (x86)\Nmap;C:\Users\Administrator\AppData\Roaming\npm 9 verbose lifecycle 08cms@1.0.0~build: CWD: c:\av\houses 10 silly lifecycle 08cms@1.0.0~build: Args: [ '/d /s /c', 'node build/build.js' ] 11 silly lifecycle 08cms@1.0.0~build: Returned: code: 1 signal: null 12 info lifecycle 08cms@1.0.0~build: Failed to exec build script 13 verbose stack Error: 08cms@1.0.0 build: `node build/build.js` 13 verbose stack Exit status 1 13 verbose stack at EventEmitter.<anonymous> (D:\Program Files\nodejs\node_modules\npm\node_modules\npm-lifecycle\index.js:301:16) 13 verbose stack at EventEmitter.emit (events.js:198:13) 13 verbose stack at ChildProcess.<anonymous> (D:\Program Files\nodejs\node_modules\npm\node_modules\npm-lifecycle\lib\spawn.js:55:14) 13 verbose stack at ChildProcess.emit (events.js:198:13) 13 verbose stack at maybeClose (internal/child_process.js:982:16) 13 verbose stack at Process.ChildProcess._handle.onexit (internal/child_process.js:259:5) 14 verbose pkgid 08cms@1.0.0 15 verbose cwd c:\av\houses 16 verbose Windows_NT 6.1.7601 17 verbose argv "D:\\Program Files\\nodejs\\node.exe" "D:\\Program Files\\nodejs\\node_modules\\npm\\bin\\npm-cli.js" "run" "build" 18 verbose node v10.16.3 19 verbose npm v6.9.0 20 error code ELIFECYCLE 21 error errno 1 22 error 08cms@1.0.0 build: `node build/build.js` 22 error Exit status 1 23 error Failed at the 08cms@1.0.0 build script. 23 error This is probably not a problem with npm. There is likely additional logging output above. 24 verbose exit [ 1, true ]
为什么nuxt.js无法安装node-sass?
1.npm 不管怎么样都安装不了 淘宝镜像也没用 2.每次安装后都卡在Downloading binary from https://github.com/sass/node-sass/releases/download/v4.12.0/win32-x64-64这里然后就报错 3.T.T小白求教 ``` PS E:\Users\FuYuHao\Desktop\sb\a\aaa> npm i node-sass > node-sass@4.12.0 install E:\Users\FuYuHao\Desktop\sb\a\aaa\node_modules\node-sass > node scripts/install.js Downloading binary from https://github.com/sass/node-sass/releases/download/v4.12.0/win32-x64-64_binding.node Cannot download "https://github.com/sass/node-sass/releases/download/v4.12.0/win32-x64-64_binding.node": connect ETIMEDOUT 52.216.135.19:443 Timed out whilst downloading the prebuilt binary Hint: If github.com is not accessible in your location try setting a proxy via HTTP_PROXY, e.g. export HTTP_PROXY=http://example.com:1234 or configure npm proxy via npm config set proxy http://example.com:8080 > node-sass@4.12.0 postinstall E:\Users\FuYuHao\Desktop\sb\a\aaa\node_modules\node-sass > node scripts/build.js Building: C:\Program Files\nodejs\node.exe E:\Users\FuYuHao\Desktop\sb\a\aaa\node_modules\node-gyp\bin\node-gyp.js rebuild --verbose --libsass_ext= --libsass_cflags= --libsass_ldflags= --libsass_library= gyp info it worked if it ends with ok gyp verb cli [ 'C:\\Program Files\\nodejs\\node.exe', gyp verb cli 'E:\\Users\\FuYuHao\\Desktop\\sb\\a\\aaa\\node_modules\\node-gyp\\bin\\node-gyp.js', gyp verb cli 'rebuild', gyp verb cli '--verbose', gyp verb cli '--libsass_ext=', gyp verb cli '--libsass_cflags=', gyp verb cli '--libsass_ldflags=', gyp verb cli '--libsass_library=' ] gyp info using node-gyp@3.8.0 gyp info using node@10.14.1 | win32 | x64 gyp verb command rebuild [] gyp verb command clean [] gyp verb clean removing "build" directory gyp verb command configure [] gyp verb check python checking for Python executable "python2" in the PATH gyp verb `which` failed Error: not found: python2 gyp verb `which` failed at getNotFoundError (E:\Users\FuYuHao\Desktop\sb\a\aaa\node_modules\which\which.js:13:12) gyp verb `which` failed at F (E:\Users\FuYuHao\Desktop\sb\a\aaa\node_modules\which\which.js:68:19) gyp verb `which` failed at E (E:\Users\FuYuHao\Desktop\sb\a\aaa\node_modules\which\which.js:80:29) gyp verb `which` failed at E:\Users\FuYuHao\Desktop\sb\a\aaa\node_modules\which\which.js:89:16 gyp verb `which` failed at E:\Users\FuYuHao\Desktop\sb\a\aaa\node_modules\isexe\index.js:42:5 gyp verb `which` failed at E:\Users\FuYuHao\Desktop\sb\a\aaa\node_modules\isexe\windows.js:36:5 gyp verb `which` failed at FSReqWrap.oncomplete (fs.js:154:21) gyp verb `which` failed python2 { Error: not found: python2 gyp verb `which` failed at getNotFoundError (E:\Users\FuYuHao\Desktop\sb\a\aaa\node_modules\which\which.js:13:12) gyp verb `which` failed at F (E:\Users\FuYuHao\Desktop\sb\a\aaa\node_modules\which\which.js:68:19) gyp verb `which` failed at E (E:\Users\FuYuHao\Desktop\sb\a\aaa\node_modules\which\which.js:80:29) gyp verb `which` failed at E:\Users\FuYuHao\Desktop\sb\a\aaa\node_modules\which\which.js:89:16 gyp verb `which` failed at E:\Users\FuYuHao\Desktop\sb\a\aaa\node_modules\isexe\index.js:42:5 gyp verb `which` failed at E:\Users\FuYuHao\Desktop\sb\a\aaa\node_modules\isexe\windows.js:36:5 gyp verb `which` failed at FSReqWrap.oncomplete (fs.js:154:21) gyp verb `which` failed stack: gyp verb `which` failed 'Error: not found: python2\n at getNotFoundError (E:\\Users\\FuYuHao\\Desktop\\sb\\a\\aaa\\node_modules\\which\\which.js:13:12)\n at F (E:\\Users\\FuYuHao\\Desktop\\sb\\a\\aaa\\node_modules\\which\\which.js:68:19)\n at E (E:\\Users\\FuYuHao\\Desktop\\sb\\a\\aaa\\node_modules\\which\\which.js:80:29)\n at E:\\Users\\FuYuHao\\Desktop\\sb\\a\\aaa\\node_modules\\which\\which.js:89:16\n at E:\\Users\\FuYuHao\\Desktop\\sb\\a\\aaa\\node_modules\\isexe\\index.js:42:5\n at E:\\Users\\FuYuHao\\Desktop\\sb\\a\\aaa\\node_modules\\isexe\\windows.js:36:5\n at FSReqWrap.oncomplete (fs.js:154:21)', gyp verb `which` failed code: 'ENOENT' } gyp verb check python checking for Python executable "python" in the PATH gyp verb `which` succeeded python C:\Python27\python.EXE gyp verb check python version `C:\Python27\python.EXE -c "import sys; print "2.7.15 gyp verb check python version .%s.%s" % sys.version_info[:3];"` returned: %j gyp verb get node dir no --target version specified, falling back to host node version: 10.14.1 gyp verb command install [ '10.14.1' ] gyp verb install input version string "10.14.1" gyp verb install installing version: 10.14.1 gyp verb install --ensure was passed, so won't reinstall if already installed gyp verb install version is already installed, need to check "installVersion" gyp verb got "installVersion" 9 gyp verb needs "installVersion" 9 gyp verb install version is good gyp verb get node dir target node version installed: 10.14.1 gyp verb build dir attempting to create "build" dir: E:\Users\FuYuHao\Desktop\sb\a\aaa\node_modules\node-sass\build gyp verb build dir "build" dir needed to be created? E:\Users\FuYuHao\Desktop\sb\a\aaa\node_modules\node-sass\build gyp verb find vs2017 Found installation at: C:\Program Files (x86)\Microsoft Visual Studio\2017\BuildTools gyp verb find vs2017 - Found Microsoft.VisualStudio.Component.Windows10SDK.17763 gyp verb find vs2017 - Found Microsoft.VisualStudio.Component.VC.Tools.x86.x64 gyp verb find vs2017 - Found Microsoft.VisualStudio.VC.MSBuild.Base gyp verb find vs2017 - Using this installation with Windows 10 SDK gyp verb find vs2017 using installation: C:\Program Files (x86)\Microsoft Visual Studio\2017\BuildTools gyp verb build/config.gypi creating config file gyp verb build/config.gypi writing out config file: E:\Users\FuYuHao\Desktop\sb\a\aaa\node_modules\node-sass\build\config.gypi gyp verb config.gypi checking for gypi file: E:\Users\FuYuHao\Desktop\sb\a\aaa\node_modules\node-sass\config.gypi gyp verb common.gypi checking for gypi file: E:\Users\FuYuHao\Desktop\sb\a\aaa\node_modules\node-sass\common.gypi gyp verb gyp gyp format was not specified; forcing "msvs" gyp info spawn C:\Python27\python.EXE gyp info spawn args [ 'E:\\Users\\FuYuHao\\Desktop\\sb\\a\\aaa\\node_modules\\node-gyp\\gyp\\gyp_main.py', gyp info spawn args 'binding.gyp', gyp info spawn args '-f', gyp info spawn args 'msvs', gyp info spawn args '-G', gyp info spawn args 'msvs_version=2015', gyp info spawn args '-I', gyp info spawn args 'E:\\Users\\FuYuHao\\Desktop\\sb\\a\\aaa\\node_modules\\node-sass\\build\\config.gypi', gyp info spawn args '-I', gyp info spawn args 'E:\\Users\\FuYuHao\\Desktop\\sb\\a\\aaa\\node_modules\\node-gyp\\addon.gypi', gyp info spawn args '-I', gyp info spawn args 'C:\\Users\\FuYuHao\\.node-gyp\\10.14.1\\include\\node\\common.gypi', gyp info spawn args '-Dlibrary=shared_library', gyp info spawn args '-Dvisibility=default', gyp info spawn args '-Dnode_root_dir=C:\\Users\\FuYuHao\\.node-gyp\\10.14.1', gyp info spawn args '-Dnode_gyp_dir=E:\\Users\\FuYuHao\\Desktop\\sb\\a\\aaa\\node_modules\\node-gyp', gyp info spawn args '-Dnode_lib_file=C:\\Users\\FuYuHao\\.node-gyp\\10.14.1\\<(target_arch)\\node.lib', gyp info spawn args '-Dmodule_root_dir=E:\\Users\\FuYuHao\\Desktop\\sb\\a\\aaa\\node_modules\\node-sass', gyp info spawn args '-Dnode_engine=v8', gyp info spawn args '--depth=.', gyp info spawn args '--no-parallel', gyp info spawn args '--generator-output', gyp info spawn args 'E:\\Users\\FuYuHao\\Desktop\\sb\\a\\aaa\\node_modules\\node-sass\\build', gyp info spawn args '-Goutput_dir=.' ] gyp verb command build [] gyp verb build type Release gyp verb architecture x64 gyp verb node dev dir C:\Users\FuYuHao\.node-gyp\10.14.1 gyp verb found first Solution file build/binding.sln gyp verb using MSBuild: C:\Program Files (x86)\Microsoft Visual Studio\2017\BuildTools\MSBuild\15.0\Bin\MSBuild.exe gyp info spawn C:\Program Files (x86)\Microsoft Visual Studio\2017\BuildTools\MSBuild\15.0\Bin\MSBuild.exe gyp info spawn args [ 'build/binding.sln', gyp info spawn args '/nologo', gyp info spawn args '/p:Configuration=Release;Platform=x64' ] 在此解决方案中一次生成一个项目。若要启用并行生成,请添加“/m”开关。 生成启动时间为 2019/5/29 22:01:12。 节点 1 上的项目“E:\Users\FuYuHao\Desktop\sb\a\aaa\node_modules\node-sass\build\binding.sln”(默认目标)。 ValidateSolutionConfiguration: 正在生成解决方案配置“Release|x64”。 项目“E:\Users\FuYuHao\Desktop\sb\a\aaa\node_modules\node-sass\build\binding.sln”(1)正在节点 1 上生成“E:\Users\FuYuHao\Desktop\sb\a\aaa\node_modules\node-sass\build\binding.vcxproj.metaproj”(2) (默认目标)。 项目“E:\Users\FuYuHao\Desktop\sb\a\aaa\node_modules\node-sass\build\binding.vcxproj.metaproj”(2)正在节点 1 上生成“E:\Users\FuYuHao\Desktop\sb\a\aaa\node_modules\node-sass\build\src\libsass.vcxproj”(3) (默认目标)。 PrepareForBuild: 正在创建目录“Release\obj\libsass\”。 正在创建目录“E:\Users\FuYuHao\Desktop\sb\a\aaa\node_modules\node-sass\build\Release\”。 正在创建目录“Release\obj\libsass\libsass.tlog\”。 InitializeBuildStatus: 正在创建“Release\obj\libsass\libsass.tlog\unsuccessfulbuild”,因为已指定“AlwaysCreate”。 ClCompile: C:\Program Files (x86)\Microsoft Visual Studio\2017\BuildTools\VC\Tools\MSVC\14.16.27023\bin\HostX64\x64\CL.exe /c /I"C:\Users\FuYuHao\.node-gyp\10.14.1\include\node" /I"C:\Users\FuYuHao\.node-gyp\10.14.1\src" /I"C:\Use rs\FuYuHao\.node-gyp\10.14.1\deps\openssl\config" /I"C:\Users\FuYuHao\.node-gyp\10.14.1\deps\openssl\openssl\include" /I"C:\Users\FuYuHao\.node-gyp\10.14.1\deps\uv\include" /I"C:\Users\FuYuHao\.node-gyp\10.14.1\deps\zli b" /I"C:\Users\FuYuHao\.node-gyp\10.14.1\deps\v8\include" /I..\..\src\libsass\include /Z7 /nologo /W3 /WX- /diagnostics:classic /MP /Ox /Ob2 /Oi /Ot /Oy /GL /D NODE_GYP_MODULE_NAME=libsass /D USING_UV_SHARED=1 /D USING_ V8_SHARED=1 /D V8_DEPRECATION_WARNINGS=1 /D WIN32 /D _CRT_SECURE_NO_DEPRECATE /D _CRT_NONSTDC_NO_DEPRECATE /D _HAS_EXCEPTIONS=0 /D "LIBSASS_VERSION=\"3.5.4\"" /GF /Gm- /MT /GS /Gy /fp:precise /Zc:wchar_t /Zc:forScope /Z c:inline /GR- /Fo"Release\obj\libsass\\" /Fd"Release\obj\libsass\libsass.pdb" /Gd /TP /wd4351 /wd4355 /wd4800 /wd4251 /wd4275 /wd4244 /wd4267 /FC /errorReport:queue /GR /EHsc ..\..\src\libsass\src\ast.cpp ..\..\src\libs ass\src\ast_fwd_decl.cpp ..\..\src\libsass\src\backtrace.cpp ..\..\src\libsass\src\base64vlq.cpp ..\..\src\libsass\src\bind.cpp ..\..\src\libsass\src\check_nesting.cpp ..\..\src\libsass\src\color_maps.cpp ..\..\src\libs ass\src\constants.cpp ..\..\src\libsass\src\context.cpp ..\..\src\libsass\src\cssize.cpp ..\..\src\libsass\src\emitter.cpp ..\..\src\libsass\src\environment.cpp ..\..\src\libsass\src\error_handling.cpp ..\..\src\libsass \src\eval.cpp ..\..\src\libsass\src\expand.cpp ..\..\src\libsass\src\extend.cpp ..\..\src\libsass\src\file.cpp ..\..\src\libsass\src\functions.cpp ..\..\src\libsass\src\inspect.cpp ..\..\src\libsass\src\json.cpp ..\..\s rc\libsass\src\lexer.cpp ..\..\src\libsass\src\listize.cpp ..\..\src\libsass\src\memory\SharedPtr.cpp ..\..\src\libsass\src\node.cpp ..\..\src\libsass\src\operators.cpp ..\..\src\libsass\src\output.cpp ..\..\src\libsass \src\parser.cpp ..\..\src\libsass\src\plugins.cpp ..\..\src\libsass\src\position.cpp ..\..\src\libsass\src\prelexer.cpp ..\..\src\libsass\src\remove_placeholders.cpp ..\..\src\libsass\src\sass.cpp ..\..\src\libsass\src\ sass2scss.cpp ..\..\src\libsass\src\sass_context.cpp ..\..\src\libsass\src\sass_functions.cpp ..\..\src\libsass\src\sass_util.cpp ..\..\src\libsass\src\sass_values.cpp ..\..\src\libsass\src\source_map.cpp ..\..\src\libs ass\src\subset_map.cpp ..\..\src\libsass\src\to_c.cpp ..\..\src\libsass\src\to_value.cpp ..\..\src\libsass\src\units.cpp ..\..\src\libsass\src\utf8_string.cpp ..\..\src\libsass\src\util.cpp ..\..\src\libsass\src\values. cpp cl : 命令行 warning D9025: 正在重写“/GR-”(用“/GR”) [E:\Users\FuYuHao\Desktop\sb\a\aaa\node_modules\node-sass\build\src\libsass.vcxproj] cl : 命令行 warning D9025: 正在重写“/GR-”(用“/GR”) [E:\Users\FuYuHao\Desktop\sb\a\aaa\node_modules\node-sass\build\src\libsass.vcxproj] ast.cpp cl : 命令行 warning D9025: 正在重写“/GR-”(用“/GR”) [E:\Users\FuYuHao\Desktop\sb\a\aaa\node_modules\node-sass\build\src\libsass.vcxproj] ast_fwd_decl.cpp cl : 命令行 warning D9025: 正在重写“/GR-”(用“/GR”) [E:\Users\FuYuHao\Desktop\sb\a\aaa\node_modules\node-sass\build\src\libsass.vcxproj] backtrace.cpp cl : 命令行 warning D9025: 正在重写“/GR-”(用“/GR”) [E:\Users\FuYuHao\Desktop\sb\a\aaa\node_modules\node-sass\build\src\libsass.vcxproj] base64vlq.cpp bind.cpp check_nesting.cpp color_maps.cpp constants.cpp context.cpp cssize.cpp emitter.cpp environment.cpp error_handling.cpp eval.cpp expand.cpp extend.cpp file.cpp functions.cpp inspect.cpp json.cpp e:\users\fuyuhao\desktop\sb\a\aaa\node_modules\node-sass\src\libsass\src\json.cpp(26): warning C4005: “_CRT_NONSTDC_NO_DEPRECATE”: 宏重定义 [E:\Users\FuYuHao\Desktop\sb\a\aaa\node_modules\node-sass\build\src\libsass.vcxp roj] e:\users\fuyuhao\desktop\sb\a\aaa\node_modules\node-sass\src\libsass\src\json.cpp: note: 参见“_CRT_NONSTDC_NO_DEPRECATE”的前一个定义 lexer.cpp listize.cpp SharedPtr.cpp node.cpp operators.cpp output.cpp parser.cpp plugins.cpp position.cpp prelexer.cpp remove_placeholders.cpp sass.cpp sass2scss.cpp e:\users\fuyuhao\desktop\sb\a\aaa\node_modules\node-sass\src\libsass\src\sass2scss.cpp(9): warning C4005: “_CRT_NONSTDC_NO_DEPRECATE”: 宏重定义 [E:\Users\FuYuHao\Desktop\sb\a\aaa\node_modules\node-sass\build\src\libsass. vcxpr oj] e:\users\fuyuhao\desktop\sb\a\aaa\node_modules\node-sass\src\libsass\src\sass2scss.cpp: note: 参见“_CRT_NONSTDC_NO_DEPRECATE”的前一个定义 sass_context.cpp sass_functions.cpp sass_util.cpp sass_values.cpp source_map.cpp subset_map.cpp to_c.cpp to_value.cpp units.cpp utf8_string.cpp util.cpp values.cpp C:\Program Files (x86)\Microsoft Visual Studio\2017\BuildTools\VC\Tools\MSVC\14.16.27023\bin\HostX64\x64\CL.exe /c /I"C:\Users\FuYuHao\.node-gyp\10.14.1\include\node" /I"C:\Users\FuYuHao\.node-gyp\10.14.1\src" /I"C:\Use rs\FuYuHao\.node-gyp\10.14.1\deps\openssl\config" /I"C:\Users\FuYuHao\.node-gyp\10.14.1\deps\openssl\openssl\include" /I"C:\Users\FuYuHao\.node-gyp\10.14.1\deps\uv\include" /I"C:\Users\FuYuHao\.node-gyp\10.14.1\deps\zli b" /I"C:\Users\FuYuHao\.node-gyp\10.14.1\deps\v8\include" /I..\..\src\libsass\include /Z7 /nologo /W3 /WX- /diagnostics:classic /MP /Ox /Ob2 /Oi /Ot /Oy /GL /D NODE_GYP_MODULE_NAME=libsass /D USING_UV_SHARED=1 /D USING_ V8_SHARED=1 /D V8_DEPRECATION_WARNINGS=1 /D WIN32 /D _CRT_SECURE_NO_DEPRECATE /D _CRT_NONSTDC_NO_DEPRECATE /D _HAS_EXCEPTIONS=0 /D "LIBSASS_VERSION=\"3.5.4\"" /GF /Gm- /MT /GS /Gy /fp:precise /Zc:wchar_t /Zc:forScope /Z c:inline /GR- /Fo"Release\obj\libsass\\" /Fd"Release\obj\libsass\libsass.pdb" /Gd /TC /wd4351 /wd4355 /wd4800 /wd4251 /wd4275 /wd4244 /wd4267 /FC /errorReport:queue /GR /EHsc ..\..\src\libsass\src\cencode.c cl : 命令行 warning D9025: 正在重写“/GR-”(用“/GR”) [E:\Users\FuYuHao\Desktop\sb\a\aaa\node_modules\node-sass\build\src\libsass.vcxproj] cencode.c Lib: C:\Program Files (x86)\Microsoft Visual Studio\2017\BuildTools\VC\Tools\MSVC\14.16.27023\bin\HostX64\x64\Lib.exe /OUT:"E:\Users\FuYuHao\Desktop\sb\a\aaa\node_modules\node-sass\build\Release\libsass.lib" /NOLOGO /MACHINE :X64 /LTCG:INCREMENTAL Release\obj\libsass\ast.obj Release\obj\libsass\ast_fwd_decl.obj Release\obj\libsass\backtrace.obj Release\obj\libsass\base64vlq.obj Release\obj\libsass\bind.obj Release\obj\libsass\cencode.obj Release\obj\libsass\check_nesting.obj Release\obj\libsass\color_maps.obj Release\obj\libsass\constants.obj Release\obj\libsass\context.obj Release\obj\libsass\cssize.obj Release\obj\libsass\emitter.obj Release\obj\libsass\environment.obj Release\obj\libsass\error_handling.obj Release\obj\libsass\eval.obj Release\obj\libsass\expand.obj Release\obj\libsass\extend.obj Release\obj\libsass\file.obj Release\obj\libsass\functions.obj Release\obj\libsass\inspect.obj Release\obj\libsass\json.obj Release\obj\libsass\lexer.obj Release\obj\libsass\listize.obj Release\obj\libsass\SharedPtr.obj Release\obj\libsass\node.obj Release\obj\libsass\operators.obj Release\obj\libsass\output.obj Release\obj\libsass\parser.obj Release\obj\libsass\plugins.obj Release\obj\libsass\position.obj Release\obj\libsass\prelexer.obj Release\obj\libsass\remove_placeholders.obj Release\obj\libsass\sass.obj Release\obj\libsass\sass2scss.obj Release\obj\libsass\sass_context.obj Release\obj\libsass\sass_functions.obj Release\obj\libsass\sass_util.obj Release\obj\libsass\sass_values.obj Release\obj\libsass\source_map.obj Release\obj\libsass\subset_map.obj Release\obj\libsass\to_c.obj Release\obj\libsass\to_value.obj Release\obj\libsass\units.obj Release\obj\libsass\utf8_string.obj Release\obj\libsass\util.obj Release\obj\libsass\values.obj libsass.vcxproj -> E:\Users\FuYuHao\Desktop\sb\a\aaa\node_modules\node-sass\build\Release\\libsass.lib FinalizeBuildStatus: 正在删除文件“Release\obj\libsass\libsass.tlog\unsuccessfulbuild”。 正在对“Release\obj\libsass\libsass.tlog\libsass.lastbuildstate”执行 Touch 任务。 已完成生成项目“E:\Users\FuYuHao\Desktop\sb\a\aaa\node_modules\node-sass\build\src\libsass.vcxproj”(默认目标)的操作。 项目“E:\Users\FuYuHao\Desktop\sb\a\aaa\node_modules\node-sass\build\binding.vcxproj.metaproj”(2)正在节点 1 上生成“E:\Users\FuYuHao\Desktop\sb\a\aaa\node_modules\node-sass\build\binding.vcxproj”(4) (默认目标)。 PrepareForBuild: 正在创建目录“Release\obj\binding\”。 正在创建目录“Release\obj\binding\binding.tlog\”。 InitializeBuildStatus: 正在创建“Release\obj\binding\binding.tlog\unsuccessfulbuild”,因为已指定“AlwaysCreate”。 ClCompile: C:\Program Files (x86)\Microsoft Visual Studio\2017\BuildTools\VC\Tools\MSVC\14.16.27023\bin\HostX64\x64\CL.exe /c /I"C:\Users\FuYuHao\.node-gyp\10.14.1\include\node" /I"C:\Users\FuYuHao\.node-gyp\10.14.1\src" /I"C:\Use rs\FuYuHao\.node-gyp\10.14.1\deps\openssl\config" /I"C:\Users\FuYuHao\.node-gyp\10.14.1\deps\openssl\openssl\include" /I"C:\Users\FuYuHao\.node-gyp\10.14.1\deps\uv\include" /I"C:\Users\FuYuHao\.node-gyp\10.14.1\deps\zli b" /I"C:\Users\FuYuHao\.node-gyp\10.14.1\deps\v8\include" /I..\..\nan /I..\src\libsass\include /Z7 /nologo /W3 /WX- /diagnostics:classic /MP /Ox /Ob2 /Oi /Ot /Oy /GL /D NODE_GYP_MODULE_NAME=binding /D USING_UV_SHARED=1 /D USING_V8_SHARED=1 /D V8_DEPRECATION_WARNINGS=1 /D WIN32 /D _CRT_SECURE_NO_DEPRECATE /D _CRT_NONSTDC_NO_DEPRECATE /D _HAS_EXCEPTIONS=0 /D BUILDING_NODE_EXTENSION /D _WINDLL /GF /Gm- /MT /GS /Gy /fp:precise /Zc:wchar_t /Zc:forScope /Zc:inline /GR- /Fo"Release\obj\binding\\" /Fd"Release\obj\binding\vc141.pdb" /Gd /TP /wd4351 /wd4355 /wd4800 /wd4251 /wd4275 /wd4244 /wd4267 /FC /errorReport:queue /Zc:threadSafeInit- ..\src\binding.cpp . .\src\create_string.cpp ..\src\custom_function_bridge.cpp ..\src\custom_importer_bridge.cpp ..\src\sass_context_wrapper.cpp ..\src\sass_types\boolean.cpp ..\src\sass_types\color.cpp ..\src\sass_types\error.cpp ..\src\sa ss_types\factory.cpp ..\src\sass_types\list.cpp ..\src\sass_types\map.cpp ..\src\sass_types\null.cpp ..\src\sass_types\number.cpp ..\src\sass_types\string.cpp "E:\Users\FuYuHao\Desktop\sb\a\aaa\node_modules\node-gyp\src \win_delay_load_hook.cc" binding.cpp create_string.cpp custom_function_bridge.cpp custom_importer_bridge.cpp sass_context_wrapper.cpp boolean.cpp color.cpp error.cpp factory.cpp list.cpp map.cpp null.cpp number.cpp string.cpp win_delay_load_hook.cc Link: C:\Program Files (x86)\Microsoft Visual Studio\2017\BuildTools\VC\Tools\MSVC\14.16.27023\bin\HostX64\x64\link.exe /ERRORREPORT:QUEUE /OUT:"E:\Users\FuYuHao\Desktop\sb\a\aaa\node_modules\node-sass\build\Release\binding.n ode" /INCREMENTAL:NO /NOLOGO kernel32.lib user32.lib gdi32.lib winspool.lib comdlg32.lib advapi32.lib shell32.lib ole32.lib oleaut32.lib uuid.lib odbc32.lib DelayImp.lib "C:\Users\FuYuHao\.node-gyp\10.14.1\x64\node.lib" Delayimp.lib /DELAYLOAD:iojs.exe /DELAYLOAD:node.exe /MANIFEST /MANIFESTUAC:"level='asInvoker' uiAccess='false'" /manifest:embed /DEBUG /PDB:"E:\Users\FuYuHao\Desktop\sb\a\aaa\node_modules\node-sass\build\Release\bindi ng.pdb" /MAP /MAPINFO:EXPORTS /OPT:REF /OPT:ICF /TLBID:1 /RELEASE /DYNAMICBASE /NXCOMPAT /MACHINE:X64 /ignore:4199 /LTCG:INCREMENTAL /DLL Release\obj\binding\binding.obj Release\obj\binding\create_string.obj Release\obj\binding\custom_function_bridge.obj Release\obj\binding\custom_importer_bridge.obj Release\obj\binding\sass_context_wrapper.obj Release\obj\binding\boolean.obj Release\obj\binding\color.obj Release\obj\binding\error.obj Release\obj\binding\factory.obj Release\obj\binding\list.obj Release\obj\binding\map.obj Release\obj\binding\null.obj Release\obj\binding\number.obj Release\obj\binding\string.obj Release\obj\binding\win_delay_load_hook.obj "E:\Users\FuYuHao\Desktop\sb\a\aaa\node_modules\node-sass\build\Release\libsass.lib" C:\Users\FuYuHao\.node-gyp\10.14.1\x64\node.lib : fatal error LNK1107: 文件无效或损坏: 无法在 0x39F993 处读取 [E:\Users\FuYuHao\Desktop\sb\a\aaa\node_modules\node-sass\build\binding.vcxproj] 已完成生成项目“E:\Users\FuYuHao\Desktop\sb\a\aaa\node_modules\node-sass\build\binding.vcxproj”(默认目标)的操作 - 失败。 已完成生成项目“E:\Users\FuYuHao\Desktop\sb\a\aaa\node_modules\node-sass\build\binding.vcxproj.metaproj”(默认目标)的操作 - 失败。 已完成生成项目“E:\Users\FuYuHao\Desktop\sb\a\aaa\node_modules\node-sass\build\binding.sln”(默认目标)的操作 - 失败。 生成失败。 “E:\Users\FuYuHao\Desktop\sb\a\aaa\node_modules\node-sass\build\binding.sln”(默认目标) (1) -> “E:\Users\FuYuHao\Desktop\sb\a\aaa\node_modules\node-sass\build\binding.vcxproj.metaproj”(默认目标) (2) -> “E:\Users\FuYuHao\Desktop\sb\a\aaa\node_modules\node-sass\build\src\libsass.vcxproj”(默认目标) (3) -> (ClCompile 目标) -> cl : 命令行 warning D9025: 正在重写“/GR-”(用“/GR”) [E:\Users\FuYuHao\Desktop\sb\a\aaa\node_modules\node-sass\build\src\libsass.vcxproj] cl : 命令行 warning D9025: 正在重写“/GR-”(用“/GR”) [E:\Users\FuYuHao\Desktop\sb\a\aaa\node_modules\node-sass\build\src\libsass.vcxproj] cl : 命令行 warning D9025: 正在重写“/GR-”(用“/GR”) [E:\Users\FuYuHao\Desktop\sb\a\aaa\node_modules\node-sass\build\src\libsass.vcxproj] cl : 命令行 warning D9025: 正在重写“/GR-”(用“/GR”) [E:\Users\FuYuHao\Desktop\sb\a\aaa\node_modules\node-sass\build\src\libsass.vcxproj] cl : 命令行 warning D9025: 正在重写“/GR-”(用“/GR”) [E:\Users\FuYuHao\Desktop\sb\a\aaa\node_modules\node-sass\build\src\libsass.vcxproj] e:\users\fuyuhao\desktop\sb\a\aaa\node_modules\node-sass\src\libsass\src\json.cpp(26): warning C4005: “_CRT_NONSTDC_NO_DEPRECATE”: 宏重定义 [E:\Users\FuYuHao\Desktop\sb\a\aaa\node_modules\node-sass\build\src\libsass.vc xproj ] e:\users\fuyuhao\desktop\sb\a\aaa\node_modules\node-sass\src\libsass\src\sass2scss.cpp(9): warning C4005: “_CRT_NONSTDC_NO_DEPRECATE”: 宏重定义 [E:\Users\FuYuHao\Desktop\sb\a\aaa\node_modules\node-sass\build\src\libsas s.vcx proj] “E:\Users\FuYuHao\Desktop\sb\a\aaa\node_modules\node-sass\build\binding.sln”(默认目标) (1) -> “E:\Users\FuYuHao\Desktop\sb\a\aaa\node_modules\node-sass\build\binding.vcxproj.metaproj”(默认目标) (2) -> “E:\Users\FuYuHao\Desktop\sb\a\aaa\node_modules\node-sass\build\src\libsass.vcxproj”(默认目标) (3) -> cl : 命令行 warning D9025: 正在重写“/GR-”(用“/GR”) [E:\Users\FuYuHao\Desktop\sb\a\aaa\node_modules\node-sass\build\src\libsass.vcxproj] “E:\Users\FuYuHao\Desktop\sb\a\aaa\node_modules\node-sass\build\binding.sln”(默认目标) (1) -> “E:\Users\FuYuHao\Desktop\sb\a\aaa\node_modules\node-sass\build\binding.vcxproj.metaproj”(默认目标) (2) -> “E:\Users\FuYuHao\Desktop\sb\a\aaa\node_modules\node-sass\build\binding.vcxproj”(默认目标) (4) -> (Link 目标) -> C:\Users\FuYuHao\.node-gyp\10.14.1\x64\node.lib : fatal error LNK1107: 文件无效或损坏: 无法在 0x39F993 处读取 [E:\Users\FuYuHao\Desktop\sb\a\aaa\node_modules\node-sass\build\binding.vcxproj] 8 个警告 1 个错误 已用时间 00:00:24.13 gyp ERR! build error gyp ERR! stack Error: `C:\Program Files (x86)\Microsoft Visual Studio\2017\BuildTools\MSBuild\15.0\Bin\MSBuild.exe` failed with exit code: 1 gyp ERR! stack at ChildProcess.onExit (E:\Users\FuYuHao\Desktop\sb\a\aaa\node_modules\node-gyp\lib\build.js:262:23) gyp ERR! stack at ChildProcess.emit (events.js:182:13) gyp ERR! stack at Process.ChildProcess._handle.onexit (internal/child_process.js:240:12) gyp ERR! System Windows_NT 10.0.17763 gyp ERR! command "C:\\Program Files\\nodejs\\node.exe" "E:\\Users\\FuYuHao\\Desktop\\sb\\a\\aaa\\node_modules\\node-gyp\\bin\\node-gyp.js" "rebuild" "--verbose" "--libsass_ext=" "--libsass_cflags=" "--libsass_ldflags=" "--libsass_library=" gyp ERR! cwd E:\Users\FuYuHao\Desktop\sb\a\aaa\node_modules\node-sass gyp ERR! node -v v10.14.1 gyp ERR! node-gyp -v v3.8.0 gyp ERR! not ok Build failed with error code: 1 npm WARN optional SKIPPING OPTIONAL DEPENDENCY: fsevents@2.0.7 (node_modules\fsevents): npm WARN notsup SKIPPING OPTIONAL DEPENDENCY: Unsupported platform for fsevents@2.0.7: wanted {"os":"darwin","arch":"any"} (current: {"os":"win32","arch":"x64"}) npm WARN optional SKIPPING OPTIONAL DEPENDENCY: fsevents@1.2.9 (node_modules\watchpack\node_modules\fsevents): npm WARN notsup SKIPPING OPTIONAL DEPENDENCY: Unsupported platform for fsevents@1.2.9: wanted {"os":"darwin","arch":"any"} (current: {"os":"win32","arch":"x64"}) npm WARN optional SKIPPING OPTIONAL DEPENDENCY: fsevents@1.2.9 (node_modules\nodemon\node_modules\fsevents): npm WARN notsup SKIPPING OPTIONAL DEPENDENCY: Unsupported platform for fsevents@1.2.9: wanted {"os":"darwin","arch":"any"} (current: {"os":"win32","arch":"x64"}) npm ERR! code ELIFECYCLE npm ERR! errno 1 npm ERR! node-sass@4.12.0 postinstall: `node scripts/build.js` npm ERR! Exit status 1 npm ERR! npm ERR! Failed at the node-sass@4.12.0 postinstall script. npm ERR! This is probably not a problem with npm. There is likely additional logging output above. npm ERR! A complete log of this run can be found in: npm ERR! C:\Users\FuYuHao\AppData\Roaming\npm-cache\_logs\2019-05-29T14_01_39_903Z-debug.log PS E:\Users\FuYuHao\Desktop\sb\a\aaa> ```
ngnix+fastcgi+python服务器每隔20几分钟就报connection refused
正在搭建一个fake server,要求每秒钟支持7000个并发。server采用nginx/fastcgi/flup搭建,用spawn-fastcgi来管理fastcgi进程,后台的应用程序很简单,就是返回固定的一串字符串,用python写的。用jmeter打流量测试,发现开始20几分钟server运行很好,后面就会有断断续续的error产生,刚开始以为是应用程序反映不过来,后来就将fastcgi进程加到200,可还是会有这样的情况发生。nginx的error.log: 2011/09/30 23:47:54 [error] 31160#0: *35 connect() failed (111: Connection refused) while connecting to upstream, client: xx.xx.xx.xx, server: domain.com, request: "GET /dev/ HTTP/1.1", upstream: "fastcgi://127.0.0.1:9000", host: "domain.com 搞了很久,还是没解决,求那位大神指点迷津,感激涕零!
通过gevent实现UDP多任务出现的问题。
在运行代码时,如果控制台上一直不输入内容,那么从网络调试器发送过来的消息就会一直堵着而不会打印出来,只有等控制台向网络调试器发送消息后堵着的消息才会全部显示,这是为什么呢?本人小白,请大侠指教。。。谢谢啦。。。 ``` import socket import gevent from gevent import monkey monkey.patch_all() def recv(udp_socket): while True: recv_data= udp_socket.recvfrom(1024) print(recv_data[1],":",recv_data[0].decode("utf-8")) def send(udp_socket,client_addr): while True: send_data= input("请输入要发送的消息:") gevent.sleep(5) udp_socket.sendto(send_data.encode("utf-8"),client_addr) def main(): udp_socket= socket.socket(socket.AF_INET,socket.SOCK_DGRAM) client_addr= ("127.0.0.1",7788) udp_socket.bind(("127.0.0.1",8080)) g1=gevent.spawn(recv,udp_socket) g2=gevent.spawn(send,udp_socket,client_addr) gevent.joinall([g1,g2]) udp_socket.close() if __name__ == "__main__": main() ```
win10下 nodejs报错:error Windows_NT 10.0.14393
0 info it worked if it ends with ok 1 verbose cli [ 'D:\\Program Files\\nodejs\\node.exe', 1 verbose cli 'D:\\Program Files\\nodejs\\node_modules\\npm\\bin\\npm-cli.js', 1 verbose cli 'run', 1 verbose cli 'dev' ] 2 info using npm@3.10.9 3 info using node@v6.9.2 4 warn invalid config registry="registry" 5 warn invalid config Must be a full url with 'http://' 6 verbose run-script [ 'predev', 'dev', 'postdev' ] 7 info lifecycle vue@1.0.0~predev: vue@1.0.0 8 silly lifecycle vue@1.0.0~predev: no script for predev, continuing 9 info lifecycle vue@1.0.0~dev: vue@1.0.0 10 verbose lifecycle vue@1.0.0~dev: unsafe-perm in lifecycle true 11 verbose lifecycle vue@1.0.0~dev: PATH: D:\Program Files\nodejs\node_modules\npm\bin\node-gyp-bin;E:\WEB\vue\node_modules\.bin;C:\Program Files (x86)\Intel\iCLS Client\;C:\Program Files\Intel\iCLS Client\;C:\Windows\system32;C:\Windows;C:\Windows\System32\Wbem;C:\Windows\System32\WindowsPowerShell\v1.0\;C:\Program Files (x86)\Intel\Intel(R) Management Engine Components\DAL;C:\Program Files\Intel\Intel(R) Management Engine Components\DAL;C:\Program Files (x86)\Intel\Intel(R) Management Engine Components\IPT;C:\Program Files\Intel\Intel(R) Management Engine Components\IPT;C:\Program Files (x86)\NVIDIA Corporation\PhysX\Common;D:\Program Files\TortoiseSVN\bin;C:\WINDOWS\system32;C:\WINDOWS;C:\WINDOWS\System32\Wbem;C:\WINDOWS\System32\WindowsPowerShell\v1.0\;D:\Program Files (x86)\VisualSVN Server\bin;D:\Program Files\nodejs\;C:\Users\King\AppData\Local\Microsoft\WindowsApps;C:\Users\King\AppData\Roaming\npm 12 verbose lifecycle vue@1.0.0~dev: CWD: E:\WEB\vue 13 silly lifecycle vue@1.0.0~dev: Args: [ '/d /s /c', 'node build/dev-server.js' ] 14 silly lifecycle vue@1.0.0~dev: Returned: code: 1 signal: null 15 info lifecycle vue@1.0.0~dev: Failed to exec dev script 16 verbose stack Error: vue@1.0.0 dev: `node build/dev-server.js` 16 verbose stack Exit status 1 16 verbose stack at EventEmitter.<anonymous> (D:\Program Files\nodejs\node_modules\npm\lib\utils\lifecycle.js:255:16) 16 verbose stack at emitTwo (events.js:106:13) 16 verbose stack at EventEmitter.emit (events.js:191:7) 16 verbose stack at ChildProcess.<anonymous> (D:\Program Files\nodejs\node_modules\npm\lib\utils\spawn.js:40:14) 16 verbose stack at emitTwo (events.js:106:13) 16 verbose stack at ChildProcess.emit (events.js:191:7) 16 verbose stack at maybeClose (internal/child_process.js:877:16) 16 verbose stack at Process.ChildProcess._handle.onexit (internal/child_process.js:226:5) 17 verbose pkgid vue@1.0.0 18 verbose cwd E:\WEB\vue 19 error Windows_NT 10.0.14393 20 error argv "D:\\Program Files\\nodejs\\node.exe" "D:\\Program Files\\nodejs\\node_modules\\npm\\bin\\npm-cli.js" "run" "dev" 21 error node v6.9.2 22 error npm v3.10.9 23 error code ELIFECYCLE 24 error vue@1.0.0 dev: `node build/dev-server.js` 24 error Exit status 1 25 error Failed at the vue@1.0.0 dev script 'node build/dev-server.js'. 25 error Make sure you have the latest version of node.js and npm installed. 25 error If you do, this is most likely a problem with the vue package, 25 error not with npm itself. 25 error Tell the author that this fails on your system: 25 error node build/dev-server.js 25 error You can get information on how to open an issue for this project with: 25 error npm bugs vue 25 error Or if that isn't available, you can get their info via: 25 error npm owner ls vue 25 error There is likely additional logging output above. 26 verbose exit [ 1, true ] 全部内容如上,求各位大神支招
windows下运行npm run dev报错,查了很多资料,哪位大神指点下,感激~
0 info it worked if it ends with ok 1 verbose cli [ 'D:\\nodejs\\node.exe', 1 verbose cli 'D:\\nodejs\\node_global\\node_modules\\npm\\bin\\npm-cli.js', 1 verbose cli 'run', 1 verbose cli 'dev' ] 2 info using npm@5.0.0 3 info using node@v8.4.0 4 verbose run-script [ 'predev', 'dev', 'postdev' ] 5 info lifecycle vue_elmentui@1.0.0~predev: vue_elmentui@1.0.0 6 silly lifecycle vue_elmentui@1.0.0~predev: no script for predev, continuing 7 info lifecycle vue_elmentui@1.0.0~dev: vue_elmentui@1.0.0 8 verbose lifecycle vue_elmentui@1.0.0~dev: unsafe-perm in lifecycle true 9 verbose lifecycle vue_elmentui@1.0.0~dev: PATH: D:\nodejs\node_global\node_modules\npm\bin\node-gyp-bin;D:\vueElmentUI\node_modules\.bin;D:\cmder\bin;D:\cmder\vendor\git-for-windows\cmd;D:\cmder\vendor\conemu-maximus5\ConEmu\Scripts;D:\cmder\vendor\conemu-maximus5;D:\cmder\vendor\conemu-maximus5\ConEmu;C:\ProgramData\Oracle\Java\javapath;C:\Windows\system32;C:\Windows;C:\Windows\System32\Wbem;C:\Windows\System32\WindowsPowerShell\v1.0\;C:\Program Files (x86)\ATI Technologies\ATI.ACE\Core-Static;D:\svn\bin;C:\Program Files (x86)\Microsoft ASP.NET\ASP.NET Web Pages\v1.0\;C:\Program Files (x86)\Windows Kits\8.0\Windows Performance Toolkit\;C:\Program Files\Microsoft SQL Server\110\Tools\Binn\;C:\Program Files\Microsoft\Web Platform Installer\;C:\Program Files\Intel\WiFi\bin\;C:\Program Files\Common Files\Intel\WirelessCommon\;D:\Git\cmd;D:\java\bin;D:\MongoDB\bin;D:\MongoDB\bin;D:\nodejs\node_global;D:\cmder;D:\nodejs\node_global;D:\nodejs\;C:\Program Files\Intel\WiFi\bin\;C:\Program Files\Common Files\Intel\WirelessCommon\;C:\Users\xw\AppData\Roaming\npm;D:\cmder\vendor\git-for-windows\usr\bin;D:\cmder\vendor\git-for-windows\usr\share\vim\vim74;D:\cmder\ 10 verbose lifecycle vue_elmentui@1.0.0~dev: CWD: D:\vueElmentUI 11 silly lifecycle vue_elmentui@1.0.0~dev: Args: [ '/d /s /c', 'node build/dev-server.js' ] 12 info lifecycle vue_elmentui@1.0.0~dev: Failed to exec dev script 13 verbose stack Error: vue_elmentui@1.0.0 dev: `node build/dev-server.js` 13 verbose stack spawn ;d:\Git\cmd ENOENT 13 verbose stack at _errnoException (util.js:1041:11) 13 verbose stack at Process.ChildProcess._handle.onexit (internal/child_process.js:192:19) 13 verbose stack at onErrorNT (internal/child_process.js:374:16) 13 verbose stack at _combinedTickCallback (internal/process/next_tick.js:138:11) 13 verbose stack at process._tickCallback (internal/process/next_tick.js:180:9) 14 verbose pkgid vue_elmentui@1.0.0 15 verbose cwd D:\vueElmentUI 16 verbose Windows_NT 6.1.7601 17 verbose argv "D:\\nodejs\\node.exe" "D:\\nodejs\\node_global\\node_modules\\npm\\bin\\npm-cli.js" "run" "dev" 18 verbose node v8.4.0 19 verbose npm v5.0.0 20 error file ;d:\Git\cmd 21 error path ;d:\Git\cmd 22 error code ELIFECYCLE 23 error errno ENOENT 24 error syscall spawn ;d:\Git\cmd 25 error vue_elmentui@1.0.0 dev: `node build/dev-server.js` 25 error spawn ;d:\Git\cmd ENOENT 26 error Failed at the vue_elmentui@1.0.0 dev script. 26 error This is probably not a problem with npm. There is likely additional logging output above. 27 verbose exit [ 1, true ]
ubuntu下安装 hexo失败
执行 sudo npm install hexo -g时 报错 贴上报错 ``` npm WARN This failure might be due to the use of legacy binary "node" npm WARN For further explanations, please read /usr/share/doc/nodejs/README.Debian > dtrace-provider@0.6.0 install /usr/local/lib/node_modules/hexo/node_modules/hexo-log/node_modules/bunyan/node_modules/dtrace-provider > node scripts/install.js sh: 1: node: not found npm WARN This failure might be due to the use of legacy binary "node" npm WARN For further explanations, please read /usr/share/doc/nodejs/README.Debian npm WARN optional dep failed, continuing dtrace-provider@0.6.0 npm ERR! error rolling back Error: ENOTEMPTY, rmdir '/usr/local/lib/node_modules/hexo/node_modules/cheerio/node_modules/jsdom/node_modules/cssstyle/lib/properties' npm ERR! error rolling back hexo@3.2.0 { [Error: ENOTEMPTY, rmdir '/usr/local/lib/node_modules/hexo/node_modules/cheerio/node_modules/jsdom/node_modules/cssstyle/lib/properties'] npm ERR! error rolling back errno: 53, npm ERR! error rolling back code: 'ENOTEMPTY', npm ERR! error rolling back path: '/usr/local/lib/node_modules/hexo/node_modules/cheerio/node_modules/jsdom/node_modules/cssstyle/lib/properties' } npm ERR! spawn-sync@1.0.15 postinstall: `node postinstall` npm ERR! Exit status 127 npm ERR! npm ERR! Failed at the spawn-sync@1.0.15 postinstall script. npm ERR! This is most likely a problem with the spawn-sync package, npm ERR! not with npm itself. npm ERR! Tell the author that this fails on your system: npm ERR! node postinstall npm ERR! You can get their info via: npm ERR! npm owner ls spawn-sync npm ERR! There is likely additional logging output above. npm ERR! System Linux 3.19.0-51-generic npm ERR! command "/usr/bin/nodejs" "/usr/bin/npm" "install" "hexo" "-g" npm ERR! cwd /home/sjd/code npm ERR! node -v v0.10.25 npm ERR! npm -v 1.4.21 npm ERR! code ELIFECYCLE npm ERR! Error: ENOENT, open '/usr/local/lib/node_modules/hexo/node_modules/cheerio/node_modules/jsdom/node_modules/request/node_modules/hawk/lib/server.js' npm ERR! If you need help, you may report this *entire* log, npm ERR! including the npm and node versions, at: npm ERR! <http://github.com/npm/npm/issues> npm ERR! System Linux 3.19.0-51-generic npm ERR! command "/usr/bin/nodejs" "/usr/bin/npm" "install" "hexo" "-g" npm ERR! cwd /home/sjd/code npm ERR! node -v v0.10.25 npm ERR! npm -v 1.4.21 npm ERR! path /usr/local/lib/node_modules/hexo/node_modules/cheerio/node_modules/jsdom/node_modules/request/node_modules/hawk/lib/server.js npm ERR! code ENOENT npm ERR! errno 34 npm ERR! EEXIST, mkdir '/usr/local/lib/node_modules/hexo/node_modules/warehouse/node_modules/cuid/node_modules/core-js/library/fn/symbol' File exists: /usr/local/lib/node_modules/hexo/node_modules/warehouse/node_modules/cuid/node_modules/core-js/library/fn/symbol Move it away, and try again. npm ERR! System Linux 3.19.0-51-generic npm ERR! command "/usr/bin/nodejs" "/usr/bin/npm" "install" "hexo" "-g" npm ERR! cwd /home/sjd/code npm ERR! node -v v0.10.25 npm ERR! npm -v 1.4.21 npm ERR! path /usr/local/lib/node_modules/hexo/node_modules/warehouse/node_modules/cuid/node_modules/core-js/library/fn/symbol npm ERR! fstream_path /usr/local/lib/node_modules/hexo/node_modules/warehouse/node_modules/cuid/node_modules/core-js/library/fn/symbol/iterator.js npm ERR! fstream_type File npm ERR! fstream_class FileWriter npm ERR! code EEXIST npm ERR! errno 47 npm ERR! fstream_stack /usr/lib/nodejs/fstream/lib/writer.js:171:23 npm ERR! fstream_stack /usr/lib/nodejs/mkdirp/index.js:46:53 npm ERR! fstream_stack Object.oncomplete (fs.js:107:15) npm ERR! Error: ENOENT, lstat '/usr/local/lib/node_modules/hexo/node_modules/cheerio/node_modules/jsdom/node_modules/request/node_modules/aws4/node_modules/lru-cache/node_modules/yallist/LICENSE' npm ERR! If you need help, you may report this *entire* log, npm ERR! including the npm and node versions, at: npm ERR! <http://github.com/npm/npm/issues> npm ERR! System Linux 3.19.0-51-generic npm ERR! command "/usr/bin/nodejs" "/usr/bin/npm" "install" "hexo" "-g" npm ERR! cwd /home/sjd/code npm ERR! node -v v0.10.25 npm ERR! npm -v 1.4.21 npm ERR! path /usr/local/lib/node_modules/hexo/node_modules/cheerio/node_modules/jsdom/node_modules/request/node_modules/aws4/node_modules/lru-cache/node_modules/yallist/LICENSE npm ERR! fstream_path /usr/local/lib/node_modules/hexo/node_modules/cheerio/node_modules/jsdom/node_modules/request/node_modules/aws4/node_modules/lru-cache/node_modules/yallist/LICENSE npm ERR! fstream_type File npm ERR! fstream_class FileWriter npm ERR! code ENOENT npm ERR! errno 34 npm ERR! fstream_stack /usr/lib/nodejs/fstream/lib/writer.js:284:26 npm ERR! fstream_stack Object.oncomplete (evalmachine.<anonymous>:107:15) npm ERR! Error: ENOENT, lstat '/usr/local/lib/node_modules/hexo/node_modules/cheerio/node_modules/jsdom/node_modules/request/node_modules/form-data/node_modules/async/lib/async.js' npm ERR! If you need help, you may report this *entire* log, npm ERR! including the npm and node versions, at: npm ERR! <http://github.com/npm/npm/issues> npm ERR! System Linux 3.19.0-51-generic npm ERR! command "/usr/bin/nodejs" "/usr/bin/npm" "install" "hexo" "-g" npm ERR! cwd /home/sjd/code npm ERR! node -v v0.10.25 npm ERR! npm -v 1.4.21 npm ERR! path /usr/local/lib/node_modules/hexo/node_modules/cheerio/node_modules/jsdom/node_modules/request/node_modules/form-data/node_modules/async/lib/async.js npm ERR! fstream_path /usr/local/lib/node_modules/hexo/node_modules/cheerio/node_modules/jsdom/node_modules/request/node_modules/form-data/node_modules/async/lib/async.js npm ERR! fstream_type File npm ERR! fstream_class FileWriter npm ERR! code ENOENT npm ERR! errno 34 npm ERR! fstream_stack /usr/lib/nodejs/fstream/lib/writer.js:284:26 npm ERR! fstream_stack Object.oncomplete (evalmachine.<anonymous>:107:15) npm ERR! Error: ENOENT, lstat '/usr/local/lib/node_modules/hexo/node_modules/cheerio/node_modules/jsdom/node_modules/request/node_modules/bl/node_modules/readable-stream/doc/stream.markdown' npm ERR! If you need help, you may report this *entire* log, npm ERR! including the npm and node versions, at: npm ERR! <http://github.com/npm/npm/issues> ```
相见恨晚的超实用网站
搞学习 知乎:www.zhihu.com 简答题:http://www.jiandati.com/ 网易公开课:https://open.163.com/ted/ 网易云课堂:https://study.163.com/ 中国大学MOOC:www.icourse163.org 网易云课堂:study.163.com 哔哩哔哩弹幕网:www.bilibili.com 我要自学网:www.51zxw
爬虫福利二 之 妹子图网MM批量下载
爬虫福利一:27报网MM批量下载    点击 看了本文,相信大家对爬虫一定会产生强烈的兴趣,激励自己去学习爬虫,在这里提前祝:大家学有所成! 目标网站:妹子图网 环境:Python3.x 相关第三方模块:requests、beautifulsoup4 Re:各位在测试时只需要将代码里的变量 path 指定为你当前系统要保存的路径,使用 python xxx.py 或IDE运行即可。
字节跳动视频编解码面经
引言 本文主要是记录一下面试字节跳动的经历。 三四月份投了字节跳动的实习(图形图像岗位),然后hr打电话过来问了一下会不会opengl,c++,shador,当时只会一点c++,其他两个都不会,也就直接被拒了。 七月初内推了字节跳动的提前批,因为内推没有具体的岗位,hr又打电话问要不要考虑一下图形图像岗,我说实习投过这个岗位不合适,不会opengl和shador,然后hr就说秋招更看重基础。我当时
开源一个功能完整的SpringBoot项目框架
福利来了,给大家带来一个福利。 最近想了解一下有关Spring Boot的开源项目,看了很多开源的框架,大多是一些demo或者是一个未成形的项目,基本功能都不完整,尤其是用户权限和菜单方面几乎没有完整的。 想到我之前做的框架,里面通用模块有:用户模块,权限模块,菜单模块,功能模块也齐全了,每一个功能都是完整的。 打算把这个框架分享出来,供大家使用和学习。 为什么用框架? 框架可以学习整体
源码阅读(19):Java中主要的Map结构——HashMap容器(下1)
(接上文《源码阅读(18):Java中主要的Map结构——HashMap容器(中)》) 3.4.4、HashMap添加K-V键值对(红黑树方式) 上文我们介绍了在HashMap中table数组的某个索引位上,基于单向链表添加新的K-V键值对对象(HashMap.Node&lt;K, V&gt;类的实例),但是我们同时知道在某些的场景下,HashMap中table数据的某个索引位上,数据是按照红黑树
c++制作的植物大战僵尸,开源,一代二代结合游戏
    此游戏全部由本人自己制作完成。游戏大部分的素材来源于原版游戏素材,少部分搜集于网络,以及自己制作。 此游戏为同人游戏而且仅供学习交流使用,任何人未经授权,不得对本游戏进行更改、盗用等,否则后果自负。 目前有六种僵尸和六种植物,植物和僵尸的动画都是本人做的。qq:2117610943 开源代码下载 提取码:3vzm 点击下载--&gt; 11月28日 新增四种植物 统一植物画风,全部修
Java学习的正确打开方式
在博主认为,对于入门级学习java的最佳学习方法莫过于视频+博客+书籍+总结,前三者博主将淋漓尽致地挥毫于这篇博客文章中,至于总结在于个人,实际上越到后面你会发现学习的最好方式就是阅读参考官方文档其次就是国内的书籍,博客次之,这又是一个层次了,这里暂时不提后面再谈。博主将为各位入门java保驾护航,各位只管冲鸭!!!上天是公平的,只要不辜负时间,时间自然不会辜负你。 何谓学习?博主所理解的学习,它
程序员必须掌握的核心算法有哪些?
由于我之前一直强调数据结构以及算法学习的重要性,所以就有一些读者经常问我,数据结构与算法应该要学习到哪个程度呢?,说实话,这个问题我不知道要怎么回答你,主要取决于你想学习到哪些程度,不过针对这个问题,我稍微总结一下我学过的算法知识点,以及我觉得值得学习的算法。这些算法与数据结构的学习大多数是零散的,并没有一本把他们全部覆盖的书籍。下面是我觉得值得学习的一些算法以及数据结构,当然,我也会整理一些看过
Python——画一棵漂亮的樱花树(不同种樱花+玫瑰+圣诞树喔)
最近翻到一篇知乎,上面有不少用Python(大多是turtle库)绘制的树图,感觉很漂亮,我整理了一下,挑了一些我觉得不错的代码分享给大家(这些我都测试过,确实可以生成喔~) one 樱花树 动态生成樱花 效果图(这个是动态的): 实现代码 import turtle as T import random import time # 画樱花的躯干(60,t) def Tree(branch
linux系列之常用运维命令整理笔录
本博客记录工作中需要的linux运维命令,大学时候开始接触linux,会一些基本操作,可是都没有整理起来,加上是做开发,不做运维,有些命令忘记了,所以现在整理成博客,当然vi,文件操作等就不介绍了,慢慢积累一些其它拓展的命令,博客不定时更新 顺便拉下票,我在参加csdn博客之星竞选,欢迎投票支持,每个QQ或者微信每天都可以投5票,扫二维码即可,http://m234140.nofollow.ax.
Python 基础(一):入门必备知识
目录1 标识符2 关键字3 引号4 编码5 输入输出6 缩进7 多行8 注释9 数据类型10 运算符10.1 常用运算符10.2 运算符优先级 1 标识符 标识符是编程时使用的名字,用于给变量、函数、语句块等命名,Python 中标识符由字母、数字、下划线组成,不能以数字开头,区分大小写。 以下划线开头的标识符有特殊含义,单下划线开头的标识符,如:_xxx ,表示不能直接访问的类属性,需通过类提供
深度学习图像算法在内容安全领域的应用
互联网给人们生活带来便利的同时也隐含了大量不良信息,防范互联网平台有害内容传播引起了多方面的高度关注。本次演讲从技术层面分享网易易盾在内容安全领域的算法实践经验,包括深度学习图
程序员接私活怎样防止做完了不给钱?
首先跟大家说明一点,我们做 IT 类的外包开发,是非标品开发,所以很有可能在开发过程中会有这样那样的需求修改,而这种需求修改很容易造成扯皮,进而影响到费用支付,甚至出现做完了项目收不到钱的情况。 那么,怎么保证自己的薪酬安全呢? 我们在开工前,一定要做好一些证据方面的准备(也就是“讨薪”的理论依据),这其中最重要的就是需求文档和验收标准。一定要让需求方提供这两个文档资料作为开发的基础。之后开发
网页实现一个简单的音乐播放器(大佬别看。(⊙﹏⊙))
今天闲着无事,就想写点东西。然后听了下歌,就打算写个播放器。 于是乎用h5 audio的加上js简单的播放器完工了。 欢迎 改进 留言。 演示地点跳到演示地点 html代码如下`&lt;!DOCTYPE html&gt; &lt;html&gt; &lt;head&gt; &lt;title&gt;music&lt;/title&gt; &lt;meta charset="utf-8"&gt
Python十大装B语法
Python 是一种代表简单思想的语言,其语法相对简单,很容易上手。不过,如果就此小视 Python 语法的精妙和深邃,那就大错特错了。本文精心筛选了最能展现 Python 语法之精妙的十个知识点,并附上详细的实例代码。如能在实战中融会贯通、灵活使用,必将使代码更为精炼、高效,同时也会极大提升代码B格,使之看上去更老练,读起来更优雅。 1. for - else 什么?不是 if 和 else 才
数据库优化 - SQL优化
前面一篇文章从实例的角度进行数据库优化,通过配置一些参数让数据库性能达到最优。但是一些“不好”的SQL也会导致数据库查询变慢,影响业务流程。本文从SQL角度进行数据库优化,提升SQL运行效率。 判断问题SQL 判断SQL是否有问题时可以通过两个表象进行判断: 系统级别表象 CPU消耗严重 IO等待严重 页面响应时间过长
2019年11月中国大陆编程语言排行榜
2019年11月2日,我统计了某招聘网站,获得有效程序员招聘数据9万条。针对招聘信息,提取编程语言关键字,并统计如下: 编程语言比例 rank pl_ percentage 1 java 33.62% 2 c/c++ 16.42% 3 c_sharp 12.82% 4 javascript 12.31% 5 python 7.93% 6 go 7.25% 7
通俗易懂地给女朋友讲:线程池的内部原理
餐厅的约会 餐盘在灯光的照耀下格外晶莹洁白,女朋友拿起红酒杯轻轻地抿了一小口,对我说:“经常听你说线程池,到底线程池到底是个什么原理?”我楞了一下,心里想女朋友今天是怎么了,怎么突然问出这么专业的问题,但做为一个专业人士在女朋友面前也不能露怯啊,想了一下便说:“我先给你讲讲我前同事老王的故事吧!” 大龄程序员老王 老王是一个已经北漂十多年的程序员,岁数大了,加班加不动了,升迁也无望,于是拿着手里
经典算法(5)杨辉三角
写在前面: 我是 扬帆向海,这个昵称来源于我的名字以及女朋友的名字。我热爱技术、热爱开源、热爱编程。技术是开源的、知识是共享的。 这博客是对自己学习的一点点总结及记录,如果您对 Java、算法 感兴趣,可以关注我的动态,我们一起学习。 用知识改变命运,让我们的家人过上更好的生活。 目录一、杨辉三角的介绍二、杨辉三角的算法思想三、代码实现1.第一种写法2.第二种写法 一、杨辉三角的介绍 百度
腾讯算法面试题:64匹马8个跑道需要多少轮才能选出最快的四匹?
昨天,有网友私信我,说去阿里面试,彻底的被打击到了。问了为什么网上大量使用ThreadLocal的源码都会加上private static?他被难住了,因为他从来都没有考虑过这个问题。无独有偶,今天笔者又发现有网友吐槽了一道腾讯的面试题,我们一起来看看。 腾讯算法面试题:64匹马8个跑道需要多少轮才能选出最快的四匹? 在互联网职场论坛,一名程序员发帖求助到。二面腾讯,其中一个算法题:64匹
面试官:你连RESTful都不知道我怎么敢要你?
面试官:了解RESTful吗? 我:听说过。 面试官:那什么是RESTful? 我:就是用起来很规范,挺好的 面试官:是RESTful挺好的,还是自我感觉挺好的 我:都挺好的。 面试官:… 把门关上。 我:… 要干嘛?先关上再说。 面试官:我说出去把门关上。 我:what ?,夺门而去 文章目录01 前言02 RESTful的来源03 RESTful6大原则1. C-S架构2. 无状态3.统一的接
为啥国人偏爱Mybatis,而老外喜欢Hibernate/JPA呢?
关于SQL和ORM的争论,永远都不会终止,我也一直在思考这个问题。昨天又跟群里的小伙伴进行了一番讨论,感触还是有一些,于是就有了今天这篇文。 声明:本文不会下关于Mybatis和JPA两个持久层框架哪个更好这样的结论。只是摆事实,讲道理,所以,请各位看官勿喷。 一、事件起因 关于Mybatis和JPA孰优孰劣的问题,争论已经很多年了。一直也没有结论,毕竟每个人的喜好和习惯是大不相同的。我也看
项目中的if else太多了,该怎么重构?
介绍 最近跟着公司的大佬开发了一款IM系统,类似QQ和微信哈,就是聊天软件。我们有一部分业务逻辑是这样的 if (msgType = "文本") { // dosomething } else if(msgType = "图片") { // doshomething } else if(msgType = "视频") { // doshomething } else { // doshom...
致 Python 初学者
欢迎来到“Python进阶”专栏!来到这里的每一位同学,应该大致上学习了很多 Python 的基础知识,正在努力成长的过程中。在此期间,一定遇到了很多的困惑,对未来的学习方向感到迷茫。我非常理解你们所面临的处境。我从2007年开始接触 python 这门编程语言,从2009年开始单一使用 python 应对所有的开发工作,直至今天。回顾自己的学习过程,也曾经遇到过无数的困难,也曾经迷茫过、困惑过。开办这个专栏,正是为了帮助像我当年一样困惑的 Python 初学者走出困境、快速成长。希望我的经验能真正帮到你
Python 编程实用技巧
Python是一门很灵活的语言,也有很多实用的方法,有时候实现一个功能可以用多种方法实现,我这里总结了一些常用的方法,并会持续更新。
“狗屁不通文章生成器”登顶GitHub热榜,分分钟写出万字形式主义大作
一、垃圾文字生成器介绍 最近在浏览GitHub的时候,发现了这样一个骨骼清奇的雷人项目,而且热度还特别高。 项目中文名:狗屁不通文章生成器 项目英文名:BullshitGenerator 根据作者的介绍,他是偶尔需要一些中文文字用于GUI开发时测试文本渲染,因此开发了这个废话生成器。但由于生成的废话实在是太过富于哲理,所以最近已经被小伙伴们给玩坏了。 他的文风可能是这样的: 你发现,
程序员:我终于知道post和get的区别
IT界知名的程序员曾说:对于那些月薪三万以下,自称IT工程师的码农们,其实我们从来没有把他们归为我们IT工程师的队伍。他们虽然总是以IT工程师自居,但只是他们一厢情愿罢了。 此话一出,不知激起了多少(码农)程序员的愤怒,却又无可奈何,于是码农问程序员。 码农:你知道get和post请求到底有什么区别? 程序员:你看这篇就知道了。 码农:你月薪三万了? 程序员:嗯。 码农:你是怎么做到的? 程序员:
"狗屁不通文章生成器"登顶GitHub热榜,分分钟写出万字形式主义大作
前言 GitHub 被誉为全球最大的同性交友网站,……,陪伴我们已经走过 10+ 年时间,它托管了大量的软件代码,同时也承载了程序员无尽的欢乐。 上周给大家分享了一篇10个让你笑的合不拢嘴的Github项目,而且还拿了7万+个Star哦,有兴趣的朋友,可以看看, 印象最深刻的是 “ 呼吸不止,码字不停 ”: 老实交代,你是不是经常准备写个技术博客,打开word后瞬间灵感便秘,码不出字? 有什么
推荐几款比较实用的工具,网站
1.盘百度PanDownload 这个云盘工具是免费的,可以进行资源搜索,提速(偶尔会抽风????) 不要去某站买付费的???? PanDownload下载地址 2.BeJSON 这是一款拥有各种在线工具的网站,推荐它的主要原因是网站简洁,功能齐全,广告相比其他广告好太多了 bejson网站 3.二维码美化 这个网站的二维码美化很好看,网站界面也很...
《程序人生》系列-这个程序员只用了20行代码就拿了冠军
你知道的越多,你不知道的越多 点赞再看,养成习惯GitHub上已经开源https://github.com/JavaFamily,有一线大厂面试点脑图,欢迎Star和完善 前言 这一期不算《吊打面试官》系列的,所有没前言我直接开始。 絮叨 本来应该是没有这期的,看过我上期的小伙伴应该是知道的嘛,双十一比较忙嘛,要值班又要去帮忙拍摄年会的视频素材,还得搞个程序员一天的Vlog,还要写BU
相关热词 c# plc s1200 c#里氏转换原则 c# 主界面 c# do loop c#存为组套 模板 c# 停掉协程 c# rgb 读取图片 c# 图片颜色调整 最快 c#多张图片上传 c#密封类与密封方法
立即提问