webpack运营时候出错了

D:\xampp\htdocs\webpacktesst>webpack
Hash: 09b87ca2b2cef434796f
Version: webpack 1.13.2
Time: 3713ms
Asset Size Chunks Chunk Names
bundle.js 508 kB 0 [emitted] main
bundle.css 7.75 kB 0 [emitted] main
bundle.js.map 866 kB 0 [emitted] main
bundle.css.map 87 bytes 0 [emitted] main
[0] multi main 40 bytes {0} [built]
+ 116 hidden modules

ERROR in ./~/react-style-webpack-plugin/lib/emptyLoader.js!./~/extract-text-webpack-plugin/loader.js?{"remove":true}!./~/react-style-webpack-plugin/lib/entry.js!./index.js
Module build failed:
Child extract-text-webpack-plugin:
+ 2 hidden modules
Child extract-text-webpack-plugin:
+ 111 hidden modules

1个回答

Csdn user default icon
上传中...
上传图片
插入图片
抄袭、复制答案,以达到刷声望分或其他目的的行为,在CSDN问答是严格禁止的,一经发现立刻封号。是时候展现真正的技术了!
其他相关推荐
vue init webpack 新项目出错
错误信息如下: Error when evaluating filter condition: isNotTest Error when evaluating filter condition: isNotTest Error when evaluating filter condition: isNotTest Error when evaluating filter condition: isNotTest Error when evaluating filter condition: isNotTest Error when evaluating filter condition: isNotTest Error when evaluating filter condition: isNotTest && lint Error when evaluating filter condition: isNotTest Error when evaluating filter condition: isNotTest && unit Error when evaluating filter condition: isNotTest Error when evaluating filter condition: isNotTest Error when evaluating filter condition: lint Error when evaluating filter condition: lint Error when evaluating filter condition: unit || e2e Error when evaluating filter condition: unit && runner === 'karma' Error when evaluating filter condition: unit Error when evaluating filter condition: unit Error when evaluating filter condition: unit Error when evaluating filter condition: unit Error when evaluating filter condition: unit Error when evaluating filter condition: unit Error when evaluating filter condition: unit && runner === 'karma' Error when evaluating filter condition: unit && runner === 'jest' Error when evaluating filter condition: unit && runner === 'karma' Error when evaluating filter condition: unit && runner === 'jest' Error when evaluating filter condition: e2e Error when evaluating filter condition: e2e Error when evaluating filter condition: e2e Error when evaluating filter condition: e2e Error when evaluating filter condition: router vue-cli · Generated "jdfdfdfdf". -----------------------------------------不知道是什么原因,折腾了大半天,找不到解决方法。谢谢。
用npm安装webpack 时出错!
![图片说明](https://img-ask.csdn.net/upload/201704/19/1492578416_370500.png) 0 info it worked if it ends with ok 1 verbose cli [ 'D:\\nodejs\\node.exe', 1 verbose cli 'D:\\nodejs\\node_modules\\npm\\bin\\npm-cli.js', 1 verbose cli 'install', 1 verbose cli 'webpack', 1 verbose cli '-g' ] 2 info using npm@3.10.10 3 info using node@v6.10.2 4 silly loadCurrentTree Starting 5 silly install loadCurrentTree 6 silly install readGlobalPackageData 7 silly fetchPackageMetaData webpack 8 silly fetchNamedPackageData webpack 9 silly mapToRegistry name webpack 10 silly mapToRegistry using default registry 11 silly mapToRegistry registry https://registry.npmjs.org/ 12 silly mapToRegistry data Result { 12 silly mapToRegistry raw: 'webpack', 12 silly mapToRegistry scope: null, 12 silly mapToRegistry escapedName: 'webpack', 12 silly mapToRegistry name: 'webpack', 12 silly mapToRegistry rawSpec: '', 12 silly mapToRegistry spec: 'latest', 12 silly mapToRegistry type: 'tag' } 13 silly mapToRegistry uri https://registry.npmjs.org/webpack 14 verbose request uri https://registry.npmjs.org/webpack 15 verbose request no auth needed 16 info attempt registry request try #1 at 12:53:45 17 verbose request id 9de94cad0277d3c5 18 http request GET https://registry.npmjs.org/webpack 19 info retry will retry, error on last attempt: Error: unable to verify the first certificate 20 info attempt registry request try #2 at 12:54:01 21 http request GET https://registry.npmjs.org/webpack 22 info retry will retry, error on last attempt: Error: unable to verify the first certificate 23 info attempt registry request try #3 at 12:55:01 24 http request GET https://registry.npmjs.org/webpack 25 silly fetchPackageMetaData Error: unable to verify the first certificate 25 silly fetchPackageMetaData at Error (native) 25 silly fetchPackageMetaData at TLSSocket.<anonymous> (_tls_wrap.js:1092:38) 25 silly fetchPackageMetaData at emitNone (events.js:86:13) 25 silly fetchPackageMetaData at TLSSocket.emit (events.js:185:7) 25 silly fetchPackageMetaData at TLSSocket._finishInit (_tls_wrap.js:610:8) 25 silly fetchPackageMetaData at TLSWrap.ssl.onhandshakedone (_tls_wrap.js:440:38) 25 silly fetchPackageMetaData error for webpack { Error: unable to verify the first certificate 25 silly fetchPackageMetaData at Error (native) 25 silly fetchPackageMetaData at TLSSocket.<anonymous> (_tls_wrap.js:1092:38) 25 silly fetchPackageMetaData at emitNone (events.js:86:13) 25 silly fetchPackageMetaData at TLSSocket.emit (events.js:185:7) 25 silly fetchPackageMetaData at TLSSocket._finishInit (_tls_wrap.js:610:8) 25 silly fetchPackageMetaData at TLSWrap.ssl.onhandshakedone (_tls_wrap.js:440:38) code: 'UNABLE_TO_VERIFY_LEAF_SIGNATURE' } 26 silly rollbackFailedOptional Starting 27 silly rollbackFailedOptional Finishing 28 silly runTopLevelLifecycles Finishing 29 silly install printInstalled 30 verbose stack Error: unable to verify the first certificate 30 verbose stack at Error (native) 30 verbose stack at TLSSocket.<anonymous> (_tls_wrap.js:1092:38) 30 verbose stack at emitNone (events.js:86:13) 30 verbose stack at TLSSocket.emit (events.js:185:7) 30 verbose stack at TLSSocket._finishInit (_tls_wrap.js:610:8) 30 verbose stack at TLSWrap.ssl.onhandshakedone (_tls_wrap.js:440:38) 31 verbose cwd D:\ 32 error Windows_NT 10.0.14393 33 error argv "D:\\nodejs\\node.exe" "D:\\nodejs\\node_modules\\npm\\bin\\npm-cli.js" "install" "webpack" "-g" 34 error node v6.10.2 35 error npm v3.10.10 36 error code UNABLE_TO_VERIFY_LEAF_SIGNATURE 37 error unable to verify the first certificate 38 error If you need help, you may report this error at: 38 error <https://github.com/npm/npm/issues> 39 verbose exit [ 1, true ]
webpack打包出错,同一个项目在Linux中能够使用webpack,windows却不能
webpack打包出错,克隆的是同一个项目在Linux中能够使用webpack命令直接进行 打包,但是在windows10系统中却不能,在打包的时候出现如下错误: E:\webStromProject\electronDesktopTool>webpack Hash: 5f4db8ce4679dd9a03f4 Version: webpack 1.14.0 Time: 18782ms Asset Size Chunks Chunk Names bundle.js 5.89 MB 0 [emitted] main + 555 hidden modules WARNING in ./~/express/lib/view.js Critical dependencies: 42:48-69 the request of a dependency is an expression @ ./~/express/lib/view.js 42:48-69 WARNING in ./~/ws/lib/BufferUtil.js Module not found: Error: Cannot resolve module 'bufferutil' in E:\webStromProject\electronDesktopTool\node_modules\ws\lib @ ./~/ws/lib/BufferUtil.js 31:21-42 WARNING in ./~/ws/lib/Validation.js Module not found: Error: Cannot resolve module 'utf-8-validate' in E:\webStromProject\electronDesktopTool\node_modules\ws\lib @ ./~/ws/lib/Validation.js 10:22-47 WARNING in ./~/formidable/lib/incoming_form.js Critical dependencies: 1:43-50 require function is used in a way in which dependencies cannot be statically extracted @ ./~/formidable/lib/incoming_form.js 1:43-50 WARNING in ./~/formidable/lib/querystring_parser.js Critical dependencies: 1:43-50 require function is used in a way in which dependencies cannot be statically extracted @ ./~/formidable/lib/querystring_parser.js 1:43-50 WARNING in ./~/formidable/lib/file.js Critical dependencies: 1:43-50 require function is used in a way in which dependencies cannot be statically extracted @ ./~/formidable/lib/file.js 1:43-50 ERROR in ./~/express/index.js Module not found: Error: Cannot resolve 'file' or 'directory' ./lib-cov/express in E:\webStromProject\electronDesktopTool\node_modules\express @ ./~/express/index.js 3:4-32 ERROR in ./~/express/lib/view.js Module not found: Error: Cannot resolve module 'fs' in E:\webStromProject\electronDesktopTool\node_modules\express\lib @ ./~/express/lib/view.js 6:9-22 ERROR in ./~/connect/lib-cov/connect.js Module not found: Error: Cannot resolve module 'fs' in E:\webStromProject\electronDesktopTool\node_modules\connect\lib-cov @ ./~/connect/lib-cov/connect.js 32:162-175 ERROR in ./~/connect/lib/connect.js Module not found: Error: Cannot resolve module 'fs' in E:\webStromProject\electronDesktopTool\node_modules\connect\lib @ ./~/connect/lib/connect.js 18:9-22 ERROR in ./~/send/lib/send.js Module not found: Error: Cannot resolve module 'fs' in E:\webStromProject\electronDesktopTool\node_modules\send\lib @ ./~/send/lib/send.js 13:9-22 ERROR in ./~/connect/lib-cov/middleware/directory.js Module not found: Error: Cannot resolve module 'fs' in E:\webStromProject\electronDesktopTool\node_modules\connect\lib-cov\middleware @ ./~/connect/lib-cov/middleware/directory.js 71:9-22 ERROR in ./~/connect/lib-cov/middleware/errorHandler.js Module not found: Error: Cannot resolve module 'fs' in E:\webStromProject\electronDesktopTool\node_modules\connect\lib-cov\middleware @ ./~/connect/lib-cov/middleware/errorHandler.js 32:38-51 ERROR in ./~/connect/lib-cov/middleware/favicon.js Module not found: Error: Cannot resolve module 'fs' in E:\webStromProject\electronDesktopTool\node_modules\connect\lib-cov\middleware @ ./~/connect/lib-cov/middleware/favicon.js 21:9-22 ERROR in ./~/connect/lib/middleware/directory.js Module not found: Error: Cannot resolve module 'fs' in E:\webStromProject\electronDesktopTool\node_modules\connect\lib\middleware @ ./~/connect/lib/middleware/directory.js 17:9-22 ERROR in ./~/connect/lib/middleware/favicon.js Module not found: Error: Cannot resolve module 'fs' in E:\webStromProject\electronDesktopTool\node_modules\connect\lib\middleware @ ./~/connect/lib/middleware/favicon.js 13:9-22 ERROR in ./~/connect/lib/middleware/errorHandler.js Module not found: Error: Cannot resolve module 'fs' in E:\webStromProject\electronDesktopTool\node_modules\connect\lib\middleware @ ./~/connect/lib/middleware/errorHandler.js 13:9-22 ERROR in ./~/connect/lib-cov/middleware/cookieSession.js Module not found: Error: Cannot resolve module 'crc' in E:\webStromProject\electronDesktopTool\node_modules\connect\lib-cov\middleware @ ./~/connect/lib-cov/middleware/cookieSession.js 42:173-187 ERROR in ./~/connect/lib-cov/middleware/session.js Module not found: Error: Cannot resolve module 'crc' in E:\webStromProject\electronDesktopTool\node_modules\connect\lib-cov\middleware @ ./~/connect/lib-cov/middleware/session.js 92:310-324 ERROR in ./~/send/~/mime/mime.js Module not found: Error: Cannot resolve module 'fs' in E:\webStromProject\electronDesktopTool\node_modules\send\node_modules\mime @ ./~/send/~/mime/mime.js 2:9-22
使用windows系统时,webpack打包出错,提示需要一个表达式
> helloworld_electron@1.0.0 webpack E:\webStromProject\ExperimentalBookingManagementSystem-fe > webpack Hash: b8b8263db2c36e699d0b Version: webpack 1.14.0 Time: 13483ms Asset Size Chunks Chunk Names bundle.js 14.4 MB 0 [emitted] main + 1169 hidden modules WARNING in ./~/express/lib/view.js Critical dependencies: 42:48-69 the request of a dependency is an expression @ ./~/express/lib/view.js 42:48-69 WARNING in ./~/ws/lib/Validation.js Module not found: Error: Cannot resolve module 'utf-8-validate' in E:\webStromProject\ExperimentalBookingManagementSystem-fe \node_modules\ws\lib @ ./~/ws/lib/Validation.js 10:22-47 WARNING in ./~/ws/lib/BufferUtil.js Module not found: Error: Cannot resolve module 'bufferutil' in E:\webStromProject\ExperimentalBookingManagementSystem-fe\nod e_modules\ws\lib @ ./~/ws/lib/BufferUtil.js 35:21-42 WARNING in ./~/formidable/lib/incoming_form.js Critical dependencies: 1:43-50 require function is used in a way in which dependencies cannot be statically extracted @ ./~/formidable/lib/incoming_form.js 1:43-50 WARNING in ./~/formidable/lib/file.js Critical dependencies: 1:43-50 require function is used in a way in which dependencies cannot be statically extracted @ ./~/formidable/lib/file.js 1:43-50 WARNING in ./~/formidable/lib/querystring_parser.js Critical dependencies: 1:43-50 require function is used in a way in which dependencies cannot be statically extracted @ ./~/formidable/lib/querystring_parser.js 1:43-50 ERROR in ./~/express/index.js Module not found: Error: Cannot resolve 'file' or 'directory' ./lib-cov/express in E:\webStromProject\ExperimentalBookingMan agementSystem-fe\node_modules\express @ ./~/express/index.js 3:4-32 ERROR in ./~/express/lib/view.js Module not found: Error: Cannot resolve module 'fs' in E:\webStromProject\ExperimentalBookingManagementSystem-fe\node_module s\express\lib @ ./~/express/lib/view.js 6:9-22 ERROR in ./~/connect/lib-cov/connect.js Module not found: Error: Cannot resolve module 'fs' in E:\webStromProject\ExperimentalBookingManagementSystem-fe\node_module s\connect\lib-cov @ ./~/connect/lib-cov/connect.js 32:162-175 ERROR in ./~/connect/lib/connect.js Module not found: Error: Cannot resolve module 'fs' in E:\webStromProject\ExperimentalBookingManagementSystem-fe\node_module s\connect\lib @ ./~/connect/lib/connect.js 18:9-22 ERROR in ./~/send/lib/send.js Module not found: Error: Cannot resolve module 'fs' in E:\webStromProject\ExperimentalBookingManagementSystem-fe\node_module s\send\lib @ ./~/send/lib/send.js 13:9-22 ERROR in ./~/connect/lib-cov/middleware/directory.js Module not found: Error: Cannot resolve module 'fs' in E:\webStromProject\ExperimentalBookingManagementSystem-fe\node_module s\connect\lib-cov\middleware @ ./~/connect/lib-cov/middleware/directory.js 71:9-22 ERROR in ./~/connect/lib-cov/middleware/errorHandler.js Module not found: Error: Cannot resolve module 'fs' in E:\webStromProject\ExperimentalBookingManagementSystem-fe\node_module s\connect\lib-cov\middleware @ ./~/connect/lib-cov/middleware/errorHandler.js 32:38-51 ERROR in ./~/connect/lib-cov/middleware/favicon.js Module not found: Error: Cannot resolve module 'fs' in E:\webStromProject\ExperimentalBookingManagementSystem-fe\node_module s\connect\lib-cov\middleware @ ./~/connect/lib-cov/middleware/favicon.js 21:9-22 ERROR in ./~/connect/lib/middleware/directory.js Module not found: Error: Cannot resolve module 'fs' in E:\webStromProject\ExperimentalBookingManagementSystem-fe\node_module s\connect\lib\middleware @ ./~/connect/lib/middleware/directory.js 17:9-22 ERROR in ./~/connect/lib/middleware/errorHandler.js Module not found: Error: Cannot resolve module 'fs' in E:\webStromProject\ExperimentalBookingManagementSystem-fe\node_module s\connect\lib\middleware @ ./~/connect/lib/middleware/errorHandler.js 13:9-22 ERROR in ./~/connect/lib/middleware/favicon.js Module not found: Error: Cannot resolve module 'fs' in E:\webStromProject\ExperimentalBookingManagementSystem-fe\node_module s\connect\lib\middleware @ ./~/connect/lib/middleware/favicon.js 13:9-22 ERROR in ./~/connect/lib-cov/middleware/cookieSession.js Module not found: Error: Cannot resolve module 'crc' in E:\webStromProject\ExperimentalBookingManagementSystem-fe\node_modul es\connect\lib-cov\middleware @ ./~/connect/lib-cov/middleware/cookieSession.js 42:173-187 ERROR in ./~/connect/lib-cov/middleware/session.js Module not found: Error: Cannot resolve module 'crc' in E:\webStromProject\ExperimentalBookingManagementSystem-fe\node_modules\connect\lib-cov\middleware @ ./~/connect/lib-cov/middleware/session.js 92:310-324 ERROR in ./~/mime/mime.js Module not found: Error: Cannot resolve module 'fs' in E:\webStromProject\ExperimentalBookingManagementSystem-fe\node_modules\mime @ ./~/mime/mime.js 2:9-22
webpack vue.js 配置为什么会出错
为什么webpack 导入vue会出错.![图片说明](https://img-ask.csdn.net/upload/201808/07/1533614196_548680.png)![图片说明](https://img-ask.csdn.net/upload/201808/07/1533614220_224976.png)
cmd安装npm i webpack -g出现了报错,这该如何是好,怎么解决?
![图片说明](https://img-ask.csdn.net/upload/202001/16/1579155058_2935.png)
npm run dev啟動項目時報錯 `webpack-dev-server --inline --progress --config build/webpack.dev.conf.js`
uotation@1.0.0 dev: `webpack-dev-server --inline --progress --config build/webpack.dev.conf.js` npm ERR! Exit status 1 npm ERR! npm ERR! Failed at the quotation@1.0.0 dev script. npm ERR! This is probably not a problem with npm. There is likely additional logging output above. ``` //webpack.dev.conf.js 'use strict' const utils = require('./utils') const webpack = require('webpack') const config = require('../config') const merge = require('webpack-merge') const path = require('path') const baseWebpackConfig = require('./webpack.base.conf') const CopyWebpackPlugin = require('copy-webpack-plugin') const HtmlWebpackPlugin = require('html-webpack-plugin') const FriendlyErrorsPlugin = require('friendly-errors-webpack-plugin') const portfinder = require('portfinder') const HOST = process.env.HOST const PORT = process.env.PORT && Number(process.env.PORT) const devWebpackConfig = merge(baseWebpackConfig, { module: { rules: utils.styleLoaders({ sourceMap: config.dev.cssSourceMap, usePostCSS: true }) }, // cheap-module-eval-source-map is faster for development devtool: config.dev.devtool, // these devServer options should be customized in /config/index.js devServer: { clientLogLevel: 'warning', historyApiFallback: { rewrites: [ { from: /.*/, to: path.posix.join(config.dev.assetsPublicPath, 'index.html') }, ], }, hot: true, contentBase: false, // since we use CopyWebpackPlugin. compress: true, host: HOST || config.dev.host, port: PORT || config.dev.port, open: config.dev.autoOpenBrowser, overlay: config.dev.errorOverlay ? { warnings: false, errors: true } : false, publicPath: config.dev.assetsPublicPath, proxy: config.dev.proxyTable, quiet: true, // necessary for FriendlyErrorsPlugin watchOptions: { poll: config.dev.poll, } }, plugins: [ new webpack.DefinePlugin({ 'process.env': require('../config/dev.env') }), new webpack.HotModuleReplacementPlugin(), new webpack.NamedModulesPlugin(), // HMR shows correct file names in console on update. new webpack.NoEmitOnErrorsPlugin(), // https://github.com/ampedandwired/html-webpack-plugin new HtmlWebpackPlugin({ filename: 'index.html', template: 'index.html', inject: true }), // copy custom static assets new CopyWebpackPlugin([ { from: path.resolve(__dirname, '../static'), to: config.dev.assetsSubDirectory, ignore: ['.*'] } ]) ] }) module.exports = new Promise((resolve, reject) => { portfinder.basePort = process.env.PORT || config.dev.port portfinder.getPort((err, port) => { if (err) { reject(err) } else { // publish the new Port, necessary for e2e tests process.env.PORT = port // add port to devServer config devWebpackConfig.devServer.port = port // Add FriendlyErrorsPlugin devWebpackConfig.plugins.push(new FriendlyErrorsPlugin({ compilationSuccessInfo: { messages: [`Your application is running here: http://${devWebpackConfig.devServer.host}:${port}`], }, onErrors: config.dev.notifyOnErrors ? utils.createNotifierCallback() : undefined })) resolve(devWebpackConfig) } }) }) ``` ``` //webpack.base.conf.js 'use strict' const path = require('path') const utils = require('./utils') const config = require('../config') const vueLoaderConfig = require('./vue-loader.conf') function resolve (dir) { return path.join(__dirname, '..', dir) } module.exports = { context: path.resolve(__dirname, '../'), entry: { app: './src/main.js' }, output: { path: config.build.assetsRoot, filename: '[name].js', publicPath: process.env.NODE_ENV === 'production' ? config.build.assetsPublicPath : config.dev.assetsPublicPath }, resolve: { extensions: ['.js', '.vue', '.json'], alias: { 'vue$': 'vue/dist/vue.esm.js', '@': resolve('src'), } }, module: { rules: [ { test: /\.vue$/, loader: 'vue-loader', options: vueLoaderConfig }, { test: /\.js$/, loader: 'babel-loader', include: [resolve('src'), resolve('test'), resolve('node_modules/webpack-dev-server/client')] }, { test: /\.(png|jpe?g|gif|svg)(\?.*)?$/, loader: 'url-loader', options: { limit: 10000, name: utils.assetsPath('img/[name].[hash:7].[ext]') } }, { test: /\.(mp4|webm|ogg|mp3|wav|flac|aac)(\?.*)?$/, loader: 'url-loader', options: { limit: 10000, name: utils.assetsPath('media/[name].[hash:7].[ext]') } }, { test: /\.(woff2?|eot|ttf|otf)(\?.*)?$/, loader: 'url-loader', options: { limit: 10000, name: utils.assetsPath('fonts/[name].[hash:7].[ext]') } } ] }, node: { // prevent webpack from injecting useless setImmediate polyfill because Vue // source contains it (although only uses it if it's native). setImmediate: false, // prevent webpack from injecting mocks to Node native modules // that does not make sense for the client dgram: 'empty', fs: 'empty', net: 'empty', tls: 'empty', child_process: 'empty' } } ```
webpack运行报错,不知道什么原因
运行webpack的时候报错,求大神解答: ![图片说明](https://img-ask.csdn.net/upload/201703/20/1490010631_417497.png)
Error: Cannot find module 'webpack' ?
## 问题:使用webpack打包的时候,为什么会出现 Error: Cannot find module 'webpack'? > 我在网上搜了好多,说webpack@4.x 版本需要安装 webpack-cli ,但是我都已经安装了,仍然报这个错,求解决!!!!
webpack之后怎么运行打包文件
webpack之后怎么运行打包文件。。。。。。。。。。。。。。
关于webpack版本问题,求解决
npm install webpack@2.2 --save-dev命令执行后, 我使用webpack -v查看版本,但是现实的还是2.4的版本, 求怎么解决? ![图片说明](https://img-ask.csdn.net/upload/201704/25/1493083415_666836.png)
webpack如何安装,总是说webpack不是内部命令
尝试着学习webpack,但总是说webpack不是内部命令,我是这样做的(事先已经安好了node和npm): 1.先在命令行执行 npm config set prefix “d:\node\node_global”设置全局路径 2.再执行 npm install webpack -g 在node_gloal下生成文件如下图: ![图片说明](https://img-ask.csdn.net/upload/201608/07/1470552517_803506.png) 3.配置环境变量,新增NODE_PATH属性指向node_global/node_modules,并把这个路径同时添加到path里 4.新建文件夹webpackPractice,里面有两个文件 //entry.js document.write("It works."); //index.html <html> <head> <meta charset="utf-8"> </head> <body> <script type="text/javascript" src="bundle.js" charset="utf-8"></script> </body> </html> 5.用命令行把目录跳转到D:webpackTest 然后执行执行命令npm install --save-dev webpack 在这个文件夹下生成node_modules 6.执行 webpack webpack ./entry.js bundle.js 这时候就一直说 'webpack' 不是内部或外部命令,也不是可运行的程序 或批处理文件。 请教大神这怎么办啊?急急急
解決 安裝less-loader報錯 multi (webpack)-dev-server
iview 安裝less-loader報錯 multi (webpack)-dev-server 解決方式 可以刪除node_modules在npm install **npm install rimraf -g rimraf node_modules//簡單粗暴的方式 npm install**_
webpack。因为HtmlWebpackPlugin中的模板html使用了thymeleaf报错了
我的HtmlWebpackPlugin配置是 ```new HtmlWebpackPlugin({ template: '../template/sidebars.html', filename: '../../../templates/home/sidebars.html', imagePath:'http://static.test.koolink.com/www', xhtml:true, inject: false }) ``` sidebars.html的其中一段语法是这样的 ```<div class="visiter kl-container" th:fragment="visitors (maxShow)" th:if="${not #lists.isEmpty(visitors)}"> <div class="side-title"> <span class="fb">谁看过我</span> </div> <div class="list"> <div class="user" th:each="visit, vStat : ${visitors}" th:unless="${vStat.index > maxShow}"> <a href="#" target="_blank" kl:profile="${visit.visitor}" kl:homepage="@{/}"> <img class="sider-avatar" src="/images/avatar.png" th:if="${not #strings.isEmpty(visit.visitor.link)}" kl:thumbnail="sqr72" th:src="@{${visit.visitor.link}}" th:alt="${visit.visitor.name + 'Logo'}"/> <img class="sider-avatar" src="/images/avatar.png" th:if="${#strings.isEmpty(visit.visitor.link)}" th:alt="${visit.visitor.name + 'Logo'}"/> <div class="name" > <span class="name-text con-overflow" th:text="${visit.visitor.name}"></span> <svg class="kl global-icon-verified" th:if="${visit.visitor.sign > 1}" aria-hidden="true"> <use xlink:href="#kl-certification"></use> </svg> </div> <div class="info con-overflow" th:text="${visit.visitor.title}">CEO</div> </a> </div> </div> </div> ``` 报错是这样的 ```Html Webpack Plugin: <pre> Error: Child compilation failed: Module build failed: SyntaxError: Unexpected token ILLEGAL - Function - lodash.js:14843 [js]/[lodash]/lodash.js:14843:16 - lodash.js:494 apply [js]/[lodash]/lodash.js:494:27 - lodash.js:15227 [js]/[lodash]/lodash.js:15227:16 - lodash.js:496 apply [js]/[lodash]/lodash.js:496:27 - lodash.js:6600 [js]/[lodash]/lodash.js:6600:16 - lodash.js:14842 Function.template [js]/[lodash]/lodash.js:14842:20 - SyntaxError: Unexpected token ILLEGAL - compiler.js:76 [js]/[html-webpack-plugin]/lib/compiler.js:76:16 - Compiler.js:304 [js]/[webpack]/lib/Compiler.js:304:11 - Compiler.js:520 [js]/[webpack]/lib/Compiler.js:520:14 - Tapable.js:202 next [js]/[tapable]/lib/Tapable.js:202:11 - CachePlugin.js:62 Compiler.<anonymous> [js]/[webpack]/lib/CachePlugin.js:62:5 - Tapable.js:206 Compiler.applyPluginsAsyncSeries [js]/[tapable]/lib/Tapable.js:206:13 - Compiler.js:517 [js]/[webpack]/lib/Compiler.js:517:11 - Tapable.js:195 Compilation.applyPluginsAsyncSeries [js]/[tapable]/lib/Tapable.js:195:46 - Compilation.js:671 [js]/[webpack]/lib/Compilation.js:671:19 - Tapable.js:195 Compilation.applyPluginsAsyncSeries [js]/[tapable]/lib/Tapable.js:195:46 - Compilation.js:662 [js]/[webpack]/lib/Compilation.js:662:11 - Tapable.js:202 next [js]/[tapable]/lib/Tapable.js:202:11 - index.js:244 Compilation.<anonymous> [js]/[uglifyjs-webpack-plugin]/dist/index.js:244:6 - Tapable.js:206 Compilation.applyPluginsAsyncSeries [js]/[tapable]/lib/Tapable.js:206:13 - Compilation.js:657 [js]/[webpack]/lib/Compilation.js:657:10 - Tapable.js:195 Compilation.applyPluginsAsyncSeries [js]/[tapable]/lib/Tapable.js:195:46 - Compilation.js:653 sealPart2 [js]/[webpack]/lib/Compilation.js:653:9 - Tapable.js:195 Compilation.applyPluginsAsyncSeries [js]/[tapable]/lib/Tapable.js:195:46 - Compilation.js:596 Compilation.seal [js]/[webpack]/lib/Compilation.js:596:8 - Compiler.js:514 [js]/[webpack]/lib/Compiler.js:514:17 - Tapable.js:289 [js]/[tapable]/lib/Tapable.js:289:11 - Compilation.js:498 [js]/[webpack]/lib/Compilation.js:498:11 - Compilation.js:468 [js]/[webpack]/lib/Compilation.js:468:14 </pre> ``` 请问有什么办法解决吗
自己用webpack构建vue项目报错,求帮助万分感谢
神烦怎么也解决不了问题,用localhost能访问到的是目录 用node:{ fs: 'empty', net: 'empty', tls: 'empty', child_process: 'empty' }能减少几个报错信息 以下是我的配置 ``` const path = require('path'); const HTMLPlugin = require('html-webpack-plugin'); const VueLoaderPlugin = require('vue-loader/lib/plugin'); const webpack = require('webpack'); const isDev = process.env.NODE_ENV === 'development'; //package.json设置的对象全部存在process.env里面 const config = { target: 'web', entry: path.join(__dirname, 'src/index.js'),//设置入口,__dirname代表本文件所在的地址,也就是根目录 output: { filename: 'bundle.js', //打包的名字 path: path.join(__dirname, 'dist') //打包路径 }, plugins: [ // make sure to include the plugin for the magic new VueLoaderPlugin(), new webpack.DefinePlugin({ 'process.env': { NODE_ENV: isDev ? '"development"' : '"production"' //调用process.env.NODE_ENV 可以获取 环境 } }), new HTMLPlugin() ], module: { rules: [ { test: /\.vue$/, loader: 'vue-loader' }, { test: /\.css$/, use: [ 'style-loader', 'css-loader' ] }, { test: /\.styl$/, use: [ 'style-loader', 'css-loader', 'stylus-loader' ] }, { test: /\.(jpg|gif|jpeg|png|svg)$/, use: [{ loader: 'url-loader', options: { limit: 1024,//可以帮小于1024的图片转换base-64代码直接写在js里面,减少http请求 name: '[name].[ext]' //重命名 name图片原来的名字 ext文件扩展名 } }] } ] } }; if (isDev) { config.devServer = { port: '8200', host: '0.0.0.0', overlay: { errors: true, } } } module.exports = config; ``` 下面是报错信息 ERROR in ./node_modules/_fsevents@1.2.4@fsevents/node_modules/node-pre-gyp/lib/testbinary.js Module not found: Error: Can't resolve 'child_process' in 'D:\java\JetBrains\module\vue-app\vue-todo\node_modules\_fsevents@1.2.4@fsevents\node_modules\node-pre-gyp\lib' @ ./node_modules/_fsevents@1.2.4@fsevents/node_modules/node-pre-gyp/lib/testbinary.js 10:9-33 @ ./node_modules/_fsevents@1.2.4@fsevents/node_modules/node-pre-gyp/lib sync ^\.\/.*$ @ ./node_modules/_fsevents@1.2.4@fsevents/node_modules/node-pre-gyp/lib/node-pre-gyp.js @ ./node_modules/_fsevents@1.2.4@fsevents/fsevents.js @ ./node_modules/_chokidar@2.0.4@chokidar/lib/fsevents-handler.js @ ./node_modules/_chokidar@2.0.4@chokidar/index.js @ ./node_modules/_watchpack@1.6.0@watchpack/lib/DirectoryWatcher.js @ ./node_modules/_watchpack@1.6.0@watchpack/lib/watcherManager.js @ ./node_modules/_watchpack@1.6.0@watchpack/lib/watchpack.js @ (webpack)/lib/node/NodeWatchFileSystem.js @ (webpack)/lib/node/NodeEnvironmentPlugin.js @ (webpack)/lib/webpack.js @ multi ./node_modules/_webpack-dev-server@3.1.9@webpack-dev-server/client?http://0.0.0.0:8200 webpack ERROR in ./node_modules/_fsevents@1.2.4@fsevents/node_modules/node-pre-gyp/lib/util/compile.js Module not found: Error: Can't resolve 'child_process' in 'D:\java\JetBrains\module\vue-app\vue-todo\node_modules\_fsevents@1.2.4@fsevents\node_modules\node-pre-gyp\lib\util' @ ./node_modules/_fsevents@1.2.4@fsevents/node_modules/node-pre-gyp/lib/util/compile.js 9:9-33 @ ./node_modules/_fsevents@1.2.4@fsevents/node_modules/node-pre-gyp/lib sync ^\.\/.*$ @ ./node_modules/_fsevents@1.2.4@fsevents/node_modules/node-pre-gyp/lib/node-pre-gyp.js @ ./node_modules/_fsevents@1.2.4@fsevents/fsevents.js @ ./node_modules/_chokidar@2.0.4@chokidar/lib/fsevents-handler.js @ ./node_modules/_chokidar@2.0.4@chokidar/index.js @ ./node_modules/_watchpack@1.6.0@watchpack/lib/DirectoryWatcher.js @ ./node_modules/_watchpack@1.6.0@watchpack/lib/watcherManager.js @ ./node_modules/_watchpack@1.6.0@watchpack/lib/watchpack.js @ (webpack)/lib/node/NodeWatchFileSystem.js @ (webpack)/lib/node/NodeEnvironmentPlugin.js @ (webpack)/lib/webpack.js @ multi ./node_modules/_webpack-dev-server@3.1.9@webpack-dev-server/client?http://0.0.0.0:8200 webpack ERROR in ./node_modules/_fsevents@1.2.4@fsevents/node_modules/osenv/osenv.js Module not found: Error: Can't resolve 'child_process' in 'D:\java\JetBrains\module\vue-app\vue-todo\node_modules\_fsevents@1.2.4@fsevents\node_modules\osenv' @ ./node_modules/_fsevents@1.2.4@fsevents/node_modules/osenv/osenv.js 3:11-35 @ ./node_modules/_fsevents@1.2.4@fsevents/node_modules/nopt/lib/nopt.js @ ./node_modules/_fsevents@1.2.4@fsevents/node_modules/node-pre-gyp/lib/node-pre-gyp.js @ ./node_modules/_fsevents@1.2.4@fsevents/fsevents.js @ ./node_modules/_chokidar@2.0.4@chokidar/lib/fsevents-handler.js @ ./node_modules/_chokidar@2.0.4@chokidar/index.js @ ./node_modules/_watchpack@1.6.0@watchpack/lib/DirectoryWatcher.js @ ./node_modules/_watchpack@1.6.0@watchpack/lib/watcherManager.js @ ./node_modules/_watchpack@1.6.0@watchpack/lib/watchpack.js @ (webpack)/lib/node/NodeWatchFileSystem.js @ (webpack)/lib/node/NodeEnvironmentPlugin.js @ (webpack)/lib/webpack.js @ multi ./node_modules/_webpack-dev-server@3.1.9@webpack-dev-server/client?http://0.0.0.0:8200 webpack ERROR in ./node_modules/_worker-farm@1.6.0@worker-farm/lib/fork.js Module not found: Error: Can't resolve 'child_process' in 'D:\java\JetBrains\module\vue-app\vue-todo\node_modules\_worker-farm@1.6.0@worker-farm\lib' @ ./node_modules/_worker-farm@1.6.0@worker-farm/lib/fork.js 3:21-45 @ ./node_modules/_worker-farm@1.6.0@worker-farm/lib/farm.js @ ./node_modules/_worker-farm@1.6.0@worker-farm/lib/index.js @ ./node_modules/_uglifyjs-webpack-plugin@1.3.0@uglifyjs-webpack-plugin/dist/uglify/Runner.js @ ./node_modules/_uglifyjs-webpack-plugin@1.3.0@uglifyjs-webpack-plugin/dist/index.js @ ./node_modules/_uglifyjs-webpack-plugin@1.3.0@uglifyjs-webpack-plugin/dist/cjs.js @ (webpack)/lib/WebpackOptionsDefaulter.js @ (webpack)/lib/webpack.js @ multi ./node_modules/_webpack-dev-server@3.1.9@webpack-dev-server/client?http://0.0.0.0:8200 webpack ERROR in ./node_modules/_cacache@10.0.4@cacache/get.js Module not found: Error: Can't resolve 'fs' in 'D:\java\JetBrains\module\vue-app\vue-todo\node_modules\_cacache@10.0.4@cacache' @ ./node_modules/_cacache@10.0.4@cacache/get.js 5:11-24 @ ./node_modules/_cacache@10.0.4@cacache/locales/en.js @ ./node_modules/_cacache@10.0.4@cacache/index.js @ ./node_modules/_uglifyjs-webpack-plugin@1.3.0@uglifyjs-webpack-plugin/dist/uglify/Runner.js @ ./node_modules/_uglifyjs-webpack-plugin@1.3.0@uglifyjs-webpack-plugin/dist/index.js @ ./node_modules/_uglifyjs-webpack-plugin@1.3.0@uglifyjs-webpack-plugin/dist/cjs.js @ (webpack)/lib/WebpackOptionsDefaulter.js @ (webpack)/lib/webpack.js @ multi ./node_modules/_webpack-dev-server@3.1.9@webpack-dev-server/client?http://0.0.0.0:8200 webpack ERROR in ./node_modules/_chokidar@2.0.4@chokidar/index.js Module not found: Error: Can't resolve 'fs' in 'D:\java\JetBrains\module\vue-app\vue-todo\node_modules\_chokidar@2.0.4@chokidar' @ ./node_modules/_chokidar@2.0.4@chokidar/index.js 3:9-22 @ ./node_modules/_watchpack@1.6.0@watchpack/lib/DirectoryWatcher.js @ ./node_modules/_watchpack@1.6.0@watchpack/lib/watcherManager.js @ ./node_modules/_watchpack@1.6.0@watchpack/lib/watchpack.js @ (webpack)/lib/node/NodeWatchFileSystem.js @ (webpack)/lib/node/NodeEnvironmentPlugin.js @ (webpack)/lib/webpack.js @ multi ./node_modules/_webpack-dev-server@3.1.9@webpack-dev-server/client?http://0.0.0.0:8200 webpack ERROR in ./node_modules/_chokidar@2.0.4@chokidar/lib/fsevents-handler.js Module not found: Error: Can't resolve 'fs' in 'D:\java\JetBrains\module\vue-app\vue-todo\node_modules\_chokidar@2.0.4@chokidar\lib' @ ./node_modules/_chokidar@2.0.4@chokidar/lib/fsevents-handler.js 3:9-22 @ ./node_modules/_chokidar@2.0.4@chokidar/index.js @ ./node_modules/_watchpack@1.6.0@watchpack/lib/DirectoryWatcher.js @ ./node_modules/_watchpack@1.6.0@watchpack/lib/watcherManager.js @ ./node_modules/_watchpack@1.6.0@watchpack/lib/watchpack.js @ (webpack)/lib/node/NodeWatchFileSystem.js @ (webpack)/lib/node/NodeEnvironmentPlugin.js @ (webpack)/lib/webpack.js @ multi ./node_modules/_webpack-dev-server@3.1.9@webpack-dev-server/client?http://0.0.0.0:8200 webpack ERROR in ./node_modules/_chokidar@2.0.4@chokidar/lib/nodefs-handler.js Module not found: Error: Can't resolve 'fs' in 'D:\java\JetBrains\module\vue-app\vue-todo\node_modules\_chokidar@2.0.4@chokidar\lib' @ ./node_modules/_chokidar@2.0.4@chokidar/lib/nodefs-handler.js 3:9-22 @ ./node_modules/_chokidar@2.0.4@chokidar/index.js @ ./node_modules/_watchpack@1.6.0@watchpack/lib/DirectoryWatcher.js @ ./node_modules/_watchpack@1.6.0@watchpack/lib/watcherManager.js @ ./node_modules/_watchpack@1.6.0@watchpack/lib/watchpack.js @ (webpack)/lib/node/NodeWatchFileSystem.js @ (webpack)/lib/node/NodeEnvironmentPlugin.js @ (webpack)/lib/webpack.js @ multi ./node_modules/_webpack-dev-server@3.1.9@webpack-dev-server/client?http://0.0.0.0:8200 webpack ERROR in ./node_modules/_chownr@1.1.1@chownr/chownr.js Module not found: Error: Can't resolve 'fs' in 'D:\java\JetBrains\module\vue-app\vue-todo\node_modules\_chownr@1.1.1@chownr' @ ./node_modules/_chownr@1.1.1@chownr/chownr.js 2:11-24 @ ./node_modules/_cacache@10.0.4@cacache/lib/util/fix-owner.js @ ./node_modules/_cacache@10.0.4@cacache/lib/util/tmp.js @ ./node_modules/_cacache@10.0.4@cacache/locales/en.js @ ./node_modules/_cacache@10.0.4@cacache/index.js @ ./node_modules/_uglifyjs-webpack-plugin@1.3.0@uglifyjs-webpack-plugin/dist/uglify/Runner.js @ ./node_modules/_uglifyjs-webpack-plugin@1.3.0@uglifyjs-webpack-plugin/dist/index.js @ ./node_modules/_uglifyjs-webpack-plugin@1.3.0@uglifyjs-webpack-plugin/dist/cjs.js @ (webpack)/lib/WebpackOptionsDefaulter.js @ (webpack)/lib/webpack.js @ multi ./node_modules/_webpack-dev-server@3.1.9@webpack-dev-server/client?http://0.0.0.0:8200 webpack ERROR in ./node_modules/_copy-concurrently@1.0.5@copy-concurrently/copy.js Module not found: Error: Can't resolve 'fs' in 'D:\java\JetBrains\module\vue-app\vue-todo\node_modules\_copy-concurrently@1.0.5@copy-concurrently' @ ./node_modules/_copy-concurrently@1.0.5@copy-concurrently/copy.js 8:13-26 @ ./node_modules/_move-concurrently@1.0.1@move-concurrently/move.js @ ./node_modules/_cacache@10.0.4@cacache/lib/util/move-file.js @ ./node_modules/_cacache@10.0.4@cacache/lib/content/write.js @ ./node_modules/_cacache@10.0.4@cacache/put.js @ ./node_modules/_cacache@10.0.4@cacache/locales/en.js @ ./node_modules/_cacache@10.0.4@cacache/index.js @ ./node_modules/_uglifyjs-webpack-plugin@1.3.0@uglifyjs-webpack-plugin/dist/uglify/Runner.js @ ./node_modules/_uglifyjs-webpack-plugin@1.3.0@uglifyjs-webpack-plugin/dist/index.js @ ./node_modules/_uglifyjs-webpack-plugin@1.3.0@uglifyjs-webpack-plugin/dist/cjs.js @ (webpack)/lib/WebpackOptionsDefaulter.js @ (webpack)/lib/webpack.js @ multi ./node_modules/_webpack-dev-server@3.1.9@webpack-dev-server/client?http://0.0.0.0:8200 webpack ERROR in ./node_modules/_fs.realpath@1.0.0@fs.realpath/old.js Module not found: Error: Can't resolve 'fs' in 'D:\java\JetBrains\module\vue-app\vue-todo\node_modules\_fs.realpath@1.0.0@fs.realpath' @ ./node_modules/_fs.realpath@1.0.0@fs.realpath/old.js 24:9-22 @ ./node_modules/_fs.realpath@1.0.0@fs.realpath/index.js @ ./node_modules/_glob@7.1.3@glob/glob.js @ ./node_modules/_cacache@10.0.4@cacache/lib/verify.js @ ./node_modules/_cacache@10.0.4@cacache/verify.js @ ./node_modules/_cacache@10.0.4@cacache/locales/en.js @ ./node_modules/_cacache@10.0.4@cacache/index.js @ ./node_modules/_uglifyjs-webpack-plugin@1.3.0@uglifyjs-webpack-plugin/dist/uglify/Runner.js @ ./node_modules/_uglifyjs-webpack-plugin@1.3.0@uglifyjs-webpack-plugin/dist/index.js @ ./node_modules/_uglifyjs-webpack-plugin@1.3.0@uglifyjs-webpack-plugin/dist/cjs.js @ (webpack)/lib/WebpackOptionsDefaulter.js @ (webpack)/lib/webpack.js @ multi ./node_modules/_webpack-dev-server@3.1.9@webpack-dev-server/client?http://0.0.0.0:8200 webpack ERROR in ./node_modules/_fs.realpath@1.0.0@fs.realpath/index.js Module not found: Error: Can't resolve 'fs' in 'D:\java\JetBrains\module\vue-app\vue-todo\node_modules\_fs.realpath@1.0.0@fs.realpath' @ ./node_modules/_fs.realpath@1.0.0@fs.realpath/index.js 8:9-22 @ ./node_modules/_glob@7.1.3@glob/glob.js @ ./node_modules/_cacache@10.0.4@cacache/lib/verify.js @ ./node_modules/_cacache@10.0.4@cacache/verify.js @ ./node_modules/_cacache@10.0.4@cacache/locales/en.js @ ./node_modules/_cacache@10.0.4@cacache/index.js @ ./node_modules/_uglifyjs-webpack-plugin@1.3.0@uglifyjs-webpack-plugin/dist/uglify/Runner.js @ ./node_modules/_uglifyjs-webpack-plugin@1.3.0@uglifyjs-webpack-plugin/dist/index.js @ ./node_modules/_uglifyjs-webpack-plugin@1.3.0@uglifyjs-webpack-plugin/dist/cjs.js @ (webpack)/lib/WebpackOptionsDefaulter.js @ (webpack)/lib/webpack.js @ multi ./node_modules/_webpack-dev-server@3.1.9@webpack-dev-server/client?http://0.0.0.0:8200 webpack ERROR in ./node_modules/_fsevents@1.2.4@fsevents/fsevents.js Module not found: Error: Can't resolve 'fs' in 'D:\java\JetBrains\module\vue-app\vue-todo\node_modules\_fsevents@1.2.4@fsevents' @ ./node_modules/_fsevents@1.2.4@fsevents/fsevents.js 17:9-22 @ ./node_modules/_chokidar@2.0.4@chokidar/lib/fsevents-handler.js @ ./node_modules/_chokidar@2.0.4@chokidar/index.js @ ./node_modules/_watchpack@1.6.0@watchpack/lib/DirectoryWatcher.js @ ./node_modules/_watchpack@1.6.0@watchpack/lib/watcherManager.js @ ./node_modules/_watchpack@1.6.0@watchpack/lib/watchpack.js @ (webpack)/lib/node/NodeWatchFileSystem.js @ (webpack)/lib/node/NodeEnvironmentPlugin.js @ (webpack)/lib/webpack.js @ multi ./node_modules/_webpack-dev-server@3.1.9@webpack-dev-server/client?http://0.0.0.0:8200 webpack ERROR in ./node_modules/_fsevents@1.2.4@fsevents/node_modules/chownr/chownr.js Module not found: Error: Can't resolve 'fs' in 'D:\java\JetBrains\module\vue-app\vue-todo\node_modules\_fsevents@1.2.4@fsevents\node_modules\chownr' @ ./node_modules/_fsevents@1.2.4@fsevents/node_modules/chownr/chownr.js 4:9-22 @ ./node_modules/_fsevents@1.2.4@fsevents/node_modules/tar/lib/mkdir.js @ ./node_modules/_fsevents@1.2.4@fsevents/node_modules/tar/lib/unpack.js @ ./node_modules/_fsevents@1.2.4@fsevents/node_modules/tar/index.js @ ./node_modules/_fsevents@1.2.4@fsevents/node_modules/node-pre-gyp/lib/package.js @ ./node_modules/_fsevents@1.2.4@fsevents/node_modules/node-pre-gyp/lib sync ^\.\/.*$ @ ./node_modules/_fsevents@1.2.4@fsevents/node_modules/node-pre-gyp/lib/node-pre-gyp.js @ ./node_modules/_fsevents@1.2.4@fsevents/fsevents.js @ ./node_modules/_chokidar@2.0.4@chokidar/lib/fsevents-handler.js @ ./node_modules/_chokidar@2.0.4@chokidar/index.js @ ./node_modules/_watchpack@1.6.0@watchpack/lib/DirectoryWatcher.js @ ./node_modules/_watchpack@1.6.0@watchpack/lib/watcherManager.js @ ./node_modules/_watchpack@1.6.0@watchpack/lib/watchpack.js @ (webpack)/lib/node/NodeWatchFileSystem.js @ (webpack)/lib/node/NodeEnvironmentPlugin.js @ (webpack)/lib/webpack.js @ multi ./node_modules/_webpack-dev-server@3.1.9@webpack-dev-server/client?http://0.0.0.0:8200 webpack ERROR in ./node_modules/_fsevents@1.2.4@fsevents/node_modules/detect-libc/lib/detect-libc.js Module not found: Error: Can't resolve 'fs' in 'D:\java\JetBrains\module\vue-app\vue-todo\node_modules\_fsevents@1.2.4@fsevents\node_modules\detect-libc\lib' @ ./node_modules/_fsevents@1.2.4@fsevents/node_modules/detect-libc/lib/detect-libc.js 5:18-31 @ ./node_modules/_fsevents@1.2.4@fsevents/node_modules/node-pre-gyp/lib/util/versioning.js @ ./node_modules/_fsevents@1.2.4@fsevents/node_modules/node-pre-gyp/lib sync ^\.\/.*$ @ ./node_modules/_fsevents@1.2.4@fsevents/node_modules/node-pre-gyp/lib/node-pre-gyp.js @ ./node_modules/_fsevents@1.2.4@fsevents/fsevents.js @ ./node_modules/_chokidar@2.0.4@chokidar/lib/fsevents-handler.js @ ./node_modules/_chokidar@2.0.4@chokidar/index.js @ ./node_modules/_watchpack@1.6.0@watchpack/lib/DirectoryWatcher.js @ ./node_modules/_watchpack@1.6.0@watchpack/lib/watcherManager.js @ ./node_modules/_watchpack@1.6.0@watchpack/lib/watchpack.js @ (webpack)/lib/node/NodeWatchFileSystem.js @ (webpack)/lib/node/NodeEnvironmentPlugin.js @ (webpack)/lib/webpack.js @ multi ./node_modules/_webpack-dev-server@3.1.9@webpack-dev-server/client?http://0.0.0.0:8200 webpack ERROR in ./node_modules/_fsevents@1.2.4@fsevents/node_modules/fs-minipass/index.js Module not found: Error: Can't resolve 'fs' in 'D:\java\JetBrains\module\vue-app\vue-todo\node_modules\_fsevents@1.2.4@fsevents\node_modules\fs-minipass' @ ./node_modules/_fsevents@1.2.4@fsevents/node_modules/fs-minipass/index.js 4:11-24 @ ./node_modules/_fsevents@1.2.4@fsevents/node_modules/tar/lib/create.js @ ./node_modules/_fsevents@1.2.4@fsevents/node_modules/tar/index.js @ ./node_modules/_fsevents@1.2.4@fsevents/node_modules/node-pre-gyp/lib/package.js @ ./node_modules/_fsevents@1.2.4@fsevents/node_modules/node-pre-gyp/lib sync ^\.\/.*$ @ ./node_modules/_fsevents@1.2.4@fsevents/node_modules/node-pre-gyp/lib/node-pre-gyp.js @ ./node_modules/_fsevents@1.2.4@fsevents/fsevents.js @ ./node_modules/_chokidar@2.0.4@chokidar/lib/fsevents-handler.js @ ./node_modules/_chokidar@2.0.4@chokidar/index.js @ ./node_modules/_watchpack@1.6.0@watchpack/lib/DirectoryWatcher.js @ ./node_modules/_watchpack@1.6.0@watchpack/lib/watcherManager.js @ ./node_modules/_watchpack@1.6.0@watchpack/lib/watchpack.js @ (webpack)/lib/node/NodeWatchFileSystem.js @ (webpack)/lib/node/NodeEnvironmentPlugin.js @ (webpack)/lib/webpack.js @ multi ./node_modules/_webpack-dev-server@3.1.9@webpack-dev-server/client?http://0.0.0.0:8200 webpack ERROR in ./node_modules/_fsevents@1.2.4@fsevents/node_modules/fs.realpath/old.js Module not found: Error: Can't resolve 'fs' in 'D:\java\JetBrains\module\vue-app\vue-todo\node_modules\_fsevents@1.2.4@fsevents\node_modules\fs.realpath' @ ./node_modules/_fsevents@1.2.4@fsevents/node_modules/fs.realpath/old.js 24:9-22 @ ./node_modules/_fsevents@1.2.4@fsevents/node_modules/fs.realpath/index.js @ ./node_modules/_fsevents@1.2.4@fsevents/node_modules/glob/glob.js @ ./node_modules/_fsevents@1.2.4@fsevents/node_modules/rimraf/rimraf.js @ ./node_modules/_fsevents@1.2.4@fsevents/node_modules/node-pre-gyp/lib/util/napi.js @ ./node_modules/_fsevents@1.2.4@fsevents/node_modules/node-pre-gyp/lib/node-pre-gyp.js @ ./node_modules/_fsevents@1.2.4@fsevents/fsevents.js @ ./node_modules/_chokidar@2.0.4@chokidar/lib/fsevents-handler.js @ ./node_modules/_chokidar@2.0.4@chokidar/index.js @ ./node_modules/_watchpack@1.6.0@watchpack/lib/DirectoryWatcher.js @ ./node_modules/_watchpack@1.6.0@watchpack/lib/watcherManager.js @ ./node_modules/_watchpack@1.6.0@watchpack/lib/watchpack.js @ (webpack)/lib/node/NodeWatchFileSystem.js @ (webpack)/lib/node/NodeEnvironmentPlugin.js @ (webpack)/lib/webpack.js @ multi ./node_modules/_webpack-dev-server@3.1.9@webpack-dev-server/client?http://0.0.0.0:8200 webpack ERROR in ./node_modules/_fsevents@1.2.4@fsevents/node_modules/fs.realpath/index.js Module not found: Error: Can't resolve 'fs' in 'D:\java\JetBrains\module\vue-app\vue-todo\node_modules\_fsevents@1.2.4@fsevents\node_modules\fs.realpath' @ ./node_modules/_fsevents@1.2.4@fsevents/node_modules/fs.realpath/index.js 8:9-22 @ ./node_modules/_fsevents@1.2.4@fsevents/node_modules/glob/glob.js @ ./node_modules/_fsevents@1.2.4@fsevents/node_modules/rimraf/rimraf.js @ ./node_modules/_fsevents@1.2.4@fsevents/node_modules/node-pre-gyp/lib/util/napi.js @ ./node_modules/_fsevents@1.2.4@fsevents/node_modules/node-pre-gyp/lib/node-pre-gyp.js @ ./node_modules/_fsevents@1.2.4@fsevents/fsevents.js @ ./node_modules/_chokidar@2.0.4@chokidar/lib/fsevents-handler.js @ ./node_modules/_chokidar@2.0.4@chokidar/index.js @ ./node_modules/_watchpack@1.6.0@watchpack/lib/DirectoryWatcher.js @ ./node_modules/_watchpack@1.6.0@watchpack/lib/watcherManager.js @ ./node_modules/_watchpack@1.6.0@watchpack/lib/watchpack.js @ (webpack)/lib/node/NodeWatchFileSystem.js @ (webpack)/lib/node/NodeEnvironmentPlugin.js @ (webpack)/lib/webpack.js @ multi ./node_modules/_webpack-dev-server@3.1.9@webpack-dev-server/client?http://0.0.0.0:8200 webpack ERROR in ./node_modules/_fsevents@1.2.4@fsevents/node_modules/glob/glob.js Module not found: Error: Can't resolve 'fs' in 'D:\java\JetBrains\module\vue-app\vue-todo\node_modules\_fsevents@1.2.4@fsevents\node_modules\glob' @ ./node_modules/_fsevents@1.2.4@fsevents/node_modules/glob/glob.js 43:9-22 @ ./node_modules/_fsevents@1.2.4@fsevents/node_modules/rimraf/rimraf.js @ ./node_modules/_fsevents@1.2.4@fsevents/node_modules/node-pre-gyp/lib/util/napi.js @ ./node_modules/_fsevents@1.2.4@fsevents/node_modules/node-pre-gyp/lib/node-pre-gyp.js @ ./node_modules/_fsevents@1.2.4@fsevents/fsevents.js @ ./node_modules/_chokidar@2.0.4@chokidar/lib/fsevents-handler.js @ ./node_modules/_chokidar@2.0.4@chokidar/index.js @ ./node_modules/_watchpack@1.6.0@watchpack/lib/DirectoryWatcher.js @ ./node_modules/_watchpack@1.6.0@watchpack/lib/watcherManager.js @ ./node_modules/_watchpack@1.6.0@watchpack/lib/watchpack.js @ (webpack)/lib/node/NodeWatchFileSystem.js @ (webpack)/lib/node/NodeEnvironmentPlugin.js @ (webpack)/lib/webpack.js @ multi ./node_modules/_webpack-dev-server@3.1.9@webpack-dev-server/client?http://0.0.0.0:8200 webpack ERROR in ./node_modules/_fsevents@1.2.4@fsevents/node_modules/glob/sync.js Module not found: Error: Can't resolve 'fs' in 'D:\java\JetBrains\module\vue-app\vue-todo\node_modules\_fsevents@1.2.4@fsevents\node_modules\glob' @ ./node_modules/_fsevents@1.2.4@fsevents/node_modules/glob/sync.js 4:9-22 @ ./node_modules/_fsevents@1.2.4@fsevents/node_modules/glob/glob.js @ ./node_modules/_fsevents@1.2.4@fsevents/node_modules/rimraf/rimraf.js @ ./node_modules/_fsevents@1.2.4@fsevents/node_modules/node-pre-gyp/lib/util/napi.js @ ./node_modules/_fsevents@1.2.4@fsevents/node_modules/node-pre-gyp/lib/node-pre-gyp.js @ ./node_modules/_fsevents@1.2.4@fsevents/fsevents.js @ ./node_modules/_chokidar@2.0.4@chokidar/lib/fsevents-handler.js @ ./node_modules/_chokidar@2.0.4@chokidar/index.js @ ./node_modules/_watchpack@1.6.0@watchpack/lib/DirectoryWatcher.js @ ./node_modules/_watchpack@1.6.0@watchpack/lib/watcherManager.js @ ./node_modules/_watchpack@1.6.0@watchpack/lib/watchpack.js @ (webpack)/lib/node/NodeWatchFileSystem.js @ (webpack)/lib/node/NodeEnvironmentPlugin.js @ (webpack)/lib/webpack.js @ multi ./node_modules/_webpack-dev-server@3.1.9@webpack-dev-server/client?http://0.0.0.0:8200 webpack ERROR in ./node_modules/_fsevents@1.2.4@fsevents/node_modules/ignore-walk/index.js Module not found: Error: Can't resolve 'fs' in 'D:\java\JetBrains\module\vue-app\vue-todo\node_modules\_fsevents@1.2.4@fsevents\node_modules\ignore-walk' @ ./node_modules/_fsevents@1.2.4@fsevents/node_modules/ignore-walk/index.js 3:11-24 @ ./node_modules/_fsevents@1.2.4@fsevents/node_modules/npm-packlist/index.js @ ./node_modules/_fsevents@1.2.4@fsevents/node_modules/node-pre-gyp/lib/package.js @ ./node_modules/_fsevents@1.2.4@fsevents/node_modules/node-pre-gyp/lib sync ^\.\/.*$ @ ./node_modules/_fsevents@1.2.4@fsevents/node_modules/node-pre-gyp/lib/node-pre-gyp.js @ ./node_modules/_fsevents@1.2.4@fsevents/fsevents.js @ ./node_modules/_chokidar@2.0.4@chokidar/lib/fsevents-handler.js @ ./node_modules/_chokidar@2.0.4@chokidar/index.js @ ./node_modules/_watchpack@1.6.0@watchpack/lib/DirectoryWatcher.js @ ./node_modules/_watchpack@1.6.0@watchpack/lib/watcherManager.js @ ./node_modules/_watchpack@1.6.0@watchpack/lib/watchpack.js @ (webpack)/lib/node/NodeWatchFileSystem.js @ (webpack)/lib/node/NodeEnvironmentPlugin.js @ (webpack)/lib/webpack.js @ multi ./node_modules/_webpack-dev-server@3.1.9@webpack-dev-server/client?http://0.0.0.0:8200 webpack ERROR in ./node_modules/_fsevents@1.2.4@fsevents/node_modules/mkdirp/index.js Module not found: Error: Can't resolve 'fs' in 'D:\java\JetBrains\module\vue-app\vue-todo\node_modules\_fsevents@1.2.4@fsevents\node_modules\mkdirp' @ ./node_modules/_fsevents@1.2.4@fsevents/node_modules/mkdirp/index.js 2:9-22 @ ./node_modules/_fsevents@1.2.4@fsevents/node_modules/node-pre-gyp/lib/testpackage.js @ ./node_modules/_fsevents@1.2.4@fsevents/node_modules/node-pre-gyp/lib sync ^\.\/.*$ @ ./node_modules/_fsevents@1.2.4@fsevents/node_modules/node-pre-gyp/lib/node-pre-gyp.js @ ./node_modules/_fsevents@1.2.4@fsevents/fsevents.js @ ./node_modules/_chokidar@2.0.4@chokidar/lib/fsevents-handler.js @ ./node_modules/_chokidar@2.0.4@chokidar/index.js @ ./node_modules/_watchpack@1.6.0@watchpack/lib/DirectoryWatcher.js @ ./node_modules/_watchpack@1.6.0@watchpack/lib/watcherManager.js @ ./node_modules/_watchpack@1.6.0@watchpack/lib/watchpack.js @ (webpack)/lib/node/NodeWatchFileSystem.js @ (webpack)/lib/node/NodeEnvironmentPlugin.js @ (webpack)/lib/webpack.js @ multi ./node_modules/_webpack-dev-server@3.1.9@webpack-dev-server/client?http://0.0.0.0:8200 webpack ERROR in ./node_modules/_fsevents@1.2.4@fsevents/node_modules/needle/lib/multipart.js Module not found: Error: Can't resolve 'fs' in 'D:\java\JetBrains\module\vue-app\vue-todo\node_modules\_fsevents@1.2.4@fsevents\node_modules\needle\lib' @ ./node_modules/_fsevents@1.2.4@fsevents/node_modules/needle/lib/multipart.js 1:15-28 @ ./node_modules/_fsevents@1.2.4@fsevents/node_modules/needle/lib/needle.js @ ./node_modules/_fsevents@1.2.4@fsevents/node_modules/node-pre-gyp/lib/install.js @ ./node_modules/_fsevents@1.2.4@fsevents/node_modules/node-pre-gyp/lib sync ^\.\/.*$ @ ./node_modules/_fsevents@1.2.4@fsevents/node_modules/node-pre-gyp/lib/node-pre-gyp.js @ ./node_modules/_fsevents@1.2.4@fsevents/fsevents.js @ ./node_modules/_chokidar@2.0.4@chokidar/lib/fsevents-handler.js @ ./node_modules/_chokidar@2.0.4@chokidar/index.js @ ./node_modules/_watchpack@1.6.0@watchpack/lib/DirectoryWatcher.js @ ./node_modules/_watchpack@1.6.0@watchpack/lib/watcherManager.js @ ./node_modules/_watchpack@1.6.0@watchpack/lib/watchpack.js @ (webpack)/lib/node/NodeWatchFileSystem.js @ (webpack)/lib/node/NodeEnvironmentPlugin.js @ (webpack)/lib/webpack.js @ multi ./node_modules/_webpack-dev-server@3.1.9@webpack-dev-server/client?http://0.0.0.0:8200 webpack ERROR in ./node_modules/_fsevents@1.2.4@fsevents/node_modules/needle/lib/needle.js Module not found: Error: Can't resolve 'fs' in 'D:\java\JetBrains\module\vue-app\vue-todo\node_modules\_fsevents@1.2.4@fsevents\node_modules\needle\lib' @ ./node_modules/_fsevents@1.2.4@fsevents/node_modules/needle/lib/needle.js 8:18-31 @ ./node_modules/_fsevents@1.2.4@fsevents/node_modules/node-pre-gyp/lib/install.js @ ./node_modules/_fsevents@1.2.4@fsevents/node_modules/node-pre-gyp/lib sync ^\.\/.*$ @ ./node_modules/_fsevents@1.2.4@fsevents/node_modules/node-pre-gyp/lib/node-pre-gyp.js @ ./node_modules/_fsevents@1.2.4@fsevents/fsevents.js @ ./node_modules/_chokidar@2.0.4@chokidar/lib/fsevents-handler.js @ ./node_modules/_chokidar@2.0.4@chokidar/index.js @ ./node_modules/_watchpack@1.6.0@watchpack/lib/DirectoryWatcher.js @ ./node_modules/_watchpack@1.6.0@watchpack/lib/watcherManager.js @ ./node_modules/_watchpack@1.6.0@watchpack/lib/watchpack.js @ (webpack)/lib/node/NodeWatchFileSystem.js @ (webpack)/lib/node/NodeEnvironmentPlugin.js @ (webpack)/lib/webpack.js @ multi ./node_modules/_webpack-dev-server@3.1.9@webpack-dev-server/client?http://0.0.0.0:8200 webpack ERROR in ./node_modules/_fsevents@1.2.4@fsevents/node_modules/node-pre-gyp/lib/testbinary.js Module not found: Error: Can't resolve 'fs' in 'D:\java\JetBrains\module\vue-app\vue-todo\node_modules\_fsevents@1.2.4@fsevents\node_modules\node-pre-gyp\lib' @ ./node_modules/_fsevents@1.2.4@fsevents/node_modules/node-pre-gyp/lib/testbinary.js 7:9-22 @ ./node_modules/_fsevents@1.2.4@fsevents/node_modules/node-pre-gyp/lib sync ^\.\/.*$ @ ./node_modules/_fsevents@1.2.4@fsevents/node_modules/node-pre-gyp/lib/node-pre-gyp.js @ ./node_modules/_fsevents@1.2.4@fsevents/fsevents.js @ ./node_modules/_chokidar@2.0.4@chokidar/lib/fsevents-handler.js @ ./node_modules/_chokidar@2.0.4@chokidar/index.js @ ./node_modules/_watchpack@1.6.0@watchpack/lib/DirectoryWatcher.js @ ./node_modules/_watchpack@1.6.0@watchpack/lib/watcherManager.js @ ./node_modules/_watchpack@1.6.0@watchpack/lib/watchpack.js @ (webpack)/lib/node/NodeWatchFileSystem.js @ (webpack)/lib/node/NodeEnvironmentPlugin.js @ (webpack)/lib/webpack.js @ multi ./node_modules/_webpack-dev-server@3.1.9@webpack-dev-server/client?http://0.0.0.0:8200 webpack ERROR in ./node_modules/_fsevents@1.2.4@fsevents/node_modules/node-pre-gyp/lib/testpackage.js Module not found: Error: Can't resolve 'fs' in 'D:\java\JetBrains\module\vue-app\vue-todo\node_modules\_fsevents@1.2.4@fsevents\node_modules\node-pre-gyp\lib' @ ./node_modules/_fsevents@1.2.4@fsevents/node_modules/node-pre-gyp/lib/testpackage.js 7:9-22 @ ./node_modules/_fsevents@1.2.4@fsevents/node_modules/node-pre-gyp/lib sync ^\.\/.*$ @ ./node_modules/_fsevents@1.2.4@fsevents/node_modules/node-pre-gyp/lib/node-pre-gyp.js @ ./node_modules/_fsevents@1.2.4@fsevents/fsevents.js @ ./node_modules/_chokidar@2.0.4@chokidar/lib/fsevents-handler.js @ ./node_modules/_chokidar@2.0.4@chokidar/index.js @ ./node_modules/_watchpack@1.6.0@watchpack/lib/DirectoryWatcher.js @ ./node_modules/_watchpack@1.6.0@watchpack/lib/watcherManager.js @ ./node_modules/_watchpack@1.6.0@watchpack/lib/watchpack.js @ (webpack)/lib/node/NodeWatchFileSystem.js @ (webpack)/lib/node/NodeEnvironmentPlugin.js @ (webpack)/lib/webpack.js @ multi ./node_modules/_webpack-dev-server@3.1.9@webpack-dev-server/client?http://0.0.0.0:8200 webpack ERROR in ./node_modules/_fsevents@1.2.4@fsevents/node_modules/node-pre-gyp/lib/node-pre-gyp.js Module not found: Error: Can't resolve 'fs' in 'D:\java\JetBrains\module\vue-app\vue-todo\node_modules\_fsevents@1.2.4@fsevents\node_modules\node-pre-gyp\lib' @ ./node_modules/_fsevents@1.2.4@fsevents/node_modules/node-pre-gyp/lib/node-pre-gyp.js 13:9-22 @ ./node_modules/_fsevents@1.2.4@fsevents/fsevents.js @ ./node_modules/_chokidar@2.0.4@chokidar/lib/fsevents-handler.js @ ./node_modules/_chokidar@2.0.4@chokidar/index.js @ ./node_modules/_watchpack@1.6.0@watchpack/lib/DirectoryWatcher.js @ ./node_modules/_watchpack@1.6.0@watchpack/lib/watcherManager.js @ ./node_modules/_watchpack@1.6.0@watchpack/lib/watchpack.js @ (webpack)/lib/node/NodeWatchFileSystem.js @ (webpack)/lib/node/NodeEnvironmentPlugin.js @ (webpack)/lib/webpack.js @ multi ./node_modules/_webpack-dev-server@3.1.9@webpack-dev-server/client?http://0.0.0.0:8200 webpack ERROR in ./node_modules/_fsevents@1.2.4@fsevents/node_modules/node-pre-gyp/lib/pre-binding.js Module not found: Error: Can't resolve 'fs' in 'D:\java\JetBrains\module\vue-app\vue-todo\node_modules\_fsevents@1.2.4@fsevents\node_modules\node-pre-gyp\lib' @ ./node_modules/_fsevents@1.2.4@fsevents/node_modules/node-pre-gyp/lib/pre-binding.js 5:17-30 @ ./node_modules/_fsevents@1.2.4@fsevents/node_modules/node-pre-gyp/lib/node-pre-gyp.js @ ./node_modules/_fsevents@1.2.4@fsevents/fsevents.js @ ./node_modules/_chokidar@2.0.4@chokidar/lib/fsevents-handler.js @ ./node_modules/_chokidar@2.0.4@chokidar/index.js @ ./node_modules/_watchpack@1.6.0@watchpack/lib/DirectoryWatcher.js @ ./node_modules/_watchpack@1.6.0@watchpack/lib/watcherManager.js @ ./node_modules/_watchpack@1.6.0@watchpack/lib/watchpack.js @ (webpack)/lib/node/NodeWatchFileSystem.js @ (webpack)/lib/node/NodeEnvironmentPlugin.js @ (webpack)/lib/webpack.js @ multi ./node_modules/_webpack-dev-server@3.1.9@webpack-dev-server/client?http://0.0.0.0:8200 webpack ERROR in ./node_modules/_fsevents@1.2.4@fsevents/node_modules/node-pre-gyp/lib/clean.js Module not found: Error: Can't resolve 'fs' in 'D:\java\JetBrains\module\vue-app\vue-todo\node_modules\_fsevents@1.2.4@fsevents\node_modules\node-pre-gyp\lib' @ ./node_modules/_fsevents@1.2.4@fsevents/node_modules/node-pre-gyp/lib/clean.js 7:9-22 9:13-26 @ ./node_modules/_fsevents@1.2.4@fsevents/node_modules/node-pre-gyp/lib sync ^\.\/.*$ @ ./node_modules/_fsevents@1.2.4@fsevents/node_modules/node-pre-gyp/lib/node-pre-gyp.js @ ./node_modules/_fsevents@1.2.4@fsevents/fsevents.js @ ./node_modules/_chokidar@2.0.4@chokidar/lib/fsevents-handler.js @ ./node_modules/_chokidar@2.0.4@chokidar/index.js @ ./node_modules/_watchpack@1.6.0@watchpack/lib/DirectoryWatcher.js @ ./node_modules/_watchpack@1.6.0@watchpack/lib/watcherManager.js @ ./node_modules/_watchpack@1.6.0@watchpack/lib/watchpack.js @ (webpack)/lib/node/NodeWatchFileSystem.js @ (webpack)/lib/node/NodeEnvironmentPlugin.js @ (webpack)/lib/webpack.js @ multi ./node_modules/_webpack-dev-server@3.1.9@webpack-dev-server/client?http://0.0.0.0:8200 webpack ERROR in ./node_modules/_fsevents@1.2.4@fsevents/node_modules/node-pre-gyp/lib/unpublish.js Module not found: Error: Can't resolve 'fs' in 'D:\java\JetBrains\module\vue-app\vue-todo\node_modules\_fsevents@1.2.4@fsevents\node_modules\node-pre-gyp\lib' @ ./node_modules/_fsevents@1.2.4@fsevents/node_modules/node-pre-gyp/lib/unpublish.js 7:9-22 @ ./node_modules/_fsevents@1.2.4@fsevents/node_modules/node-pre-gyp/lib sync ^\.\/.*$ @ ./node_modules/_fsevents@1.2.4@fsevents/node_modules/node-pre-gyp/lib/node-pre-gyp.js @ ./node_modules/_fsevents@1.2.4@fsevents/fsevents.js @ ./node_modules/_chokidar@2.0.4@chokidar/lib/fsevents-handler.js @ ./node_modules/_chokidar@2.0.4@chokidar/index.js @ ./node_modules/_watchpack@1.6.0@watchpack/lib/DirectoryWatcher.js @ ./node_modules/_watchpack@1.6.0@watchpack/lib/watcherManager.js @ ./node_modules/_watchpack@1.6.0@watchpack/lib/watchpack.js @ (webpack)/lib/node/NodeWatchFileSystem.js @ (webpack)/lib/node/NodeEnvironmentPlugin.js @ (webpack)/lib/webpack.js @ multi ./node_modules/_webpack-dev-server@3.1.9@webpack-dev-server/client?http://0.0.0.0:8200 webpack ERROR in ./node_modules/_fsevents@1.2.4@fsevents/node_modules/node-pre-gyp/lib/package.js Module not found: Error: Can't resolve 'fs' in 'D:\java\JetBrains\module\vue-app\vue-todo\node_modules\_fsevents@1.2.4@fsevents\node_modules\node-pre-gyp\lib' @ ./node_modules/_fsevents@1.2.4@fsevents/node_modules/node-pre-gyp/lib/package.js 7:9-22 12:12-25 @ ./node_modules/_fsevents@1.2.4@fsevents/node_modules/node-pre-gyp/lib sync ^\.\/.*$ @ ./node_modules/_fsevents@1.2.4@fsevents/node_modules/node-pre-gyp/lib/node-pre-gyp.js @ ./node_modules/_fsevents@1.2.4@fsevents/fsevents.js @ ./node_modules/_chokidar@2.0.4@chokidar/lib/fsevents-handler.js @ ./node_modules/_chokidar@2.0.4@chokidar/index.js @ ./node_modules/_watchpack@1.6.0@watchpack/lib/DirectoryWatcher.js @ ./node_modules/_watchpack@1.6.0@watchpack/lib/watcherManager.js @ ./node_modules/_watchpack@1.6.0@watchpack/lib/watchpack.js @ (webpack)/lib/node/NodeWatchFileSystem.js @ (webpack)/lib/node/NodeEnvironmentPlugin.js @ (webpack)/lib/webpack.js @ multi ./node_modules/_webpack-dev-server@3.1.9@webpack-dev-server/client?http://0.0.0.0:8200 webpack ERROR in ./node_modules/_fsevents@1.2.4@fsevents/node_modules/npm-bundled/index.js Module not found: Error: Can't resolve 'fs' in 'D:\java\JetBrains\module\vue-app\vue-todo\node_modules\_fsevents@1.2.4@fsevents\node_modules\npm-bundled' @ ./node_modules/_fsevents@1.2.4@fsevents/node_modules/npm-bundled/index.js 10:11-24 @ ./node_modules/_fsevents@1.2.4@fsevents/node_modules/npm-packlist/index.js @ ./node_modules/_fsevents@1.2.4@fsevents/node_modules/node-pre-gyp/lib/package.js @ ./node_modules/_fsevents@1.2.4@fsevents/node_modules/node-pre-gyp/lib sync ^\.\/.*$ @ ./node_modules/_fsevents@1.2.4@fsevents/node_modules/node-pre-gyp/lib/node-pre-gyp.js @ ./node_modules/_fsevents@1.2.4@fsevents/fsevents.js @ ./node_modules/_chokidar@2.0.4@chokidar/lib/fsevents-handler.js @ ./node_modules/_chokidar@2.0.4@chokidar/index.js @ ./node_modules/_watchpack@1.6.0@watchpack/lib/DirectoryWatcher.js @ ./node_modules/_watchpack@1.6.0@watchpack/lib/watcherManager.js @ ./node_modules/_watchpack@1.6.0@watchpack/lib/watchpack.js @ (webpack)/lib/node/NodeWatchFileSystem.js @ (webpack)/lib/node/NodeEnvironmentPlugin.js @ (webpack)/lib/webpack.js @ multi ./node_modules/_webpack-dev-server@3.1.9@webpack-dev-server/client?http://0.0.0.0:8200 webpack ERROR in ./node_modules/_fsevents@1.2.4@fsevents/node_modules/rimraf/rimraf.js Module not found: Error: Can't resolve 'fs' in 'D:\java\JetBrains\module\vue-app\vue-todo\node_modules\_fsevents@1.2.4@fsevents\node_modules\rimraf' @ ./node_modules/_fsevents@1.2.4@fsevents/node_modules/rimraf/rimraf.js 6:9-22 @ ./node_modules/_fsevents@1.2.4@fsevents/node_modules/node-pre-gyp/lib/util/napi.js @ ./node_modules/_fsevents@1.2.4@fsevents/node_modules/node-pre-gyp/lib/node-pre-gyp.js @ ./node_modules/_fsevents@1.2.4@fsevents/fsevents.js @ ./node_modules/_chokidar@2.0.4@chokidar/lib/fsevents-handler.js @ ./node_modules/_chokidar@2.0.4@chokidar/index.js @ ./node_modules/_watchpack@1.6.0@watchpack/lib/DirectoryWatcher.js @ ./node_modules/_watchpack@1.6.0@watchpack/lib/watcherManager.js @ ./node_modules/_watchpack@1.6.0@watchpack/lib/watchpack.js @ (webpack)/lib/node/NodeWatchFileSystem.js @ (webpack)/lib/node/NodeEnvironmentPlugin.js @ (webpack)/lib/webpack.js @ multi ./node_modules/_webpack-dev-server@3.1.9@webpack-dev-server/client?http://0.0.0.0:8200 webpack ERROR in ./node_modules/_fsevents@1.2.4@fsevents/node_modules/tar/lib/replace.js Module not found: Error: Can't resolve 'fs' in 'D:\java\JetBrains\module\vue-app\vue-todo\node_modules\_fsevents@1.2.4@fsevents\node_modules\tar\lib' @ ./node_modules/_fsevents@1.2.4@fsevents/node_modules/tar/lib/replace.js 8:11-24 @ ./node_modules/_fsevents@1.2.4@fsevents/node_modules/tar/index.js @ ./node_modules/_fsevents@1.2.4@fsevents/node_modules/node-pre-gyp/lib/package.js @ ./node_modules/_fsevents@1.2.4@fsevents/node_modules/node-pre-gyp/lib sync ^\.\/.*$ @ ./node_modules/_fsevents@1.2.4@fsevents/node_modules/node-pre-gyp/lib/node-pre-gyp.js @ ./node_modules/_fsevents@1.2.4@fsevents/fsevents.js @ ./node_modules/_chokidar@2.0.4@chokidar/lib/fsevents-handler.js @ ./node_modules/_chokidar@2.0.4@chokidar/index.js @ ./node_modules/_watchpack@1.6.0@watchpack/lib/DirectoryWatcher.js @ ./node_modules/_watchpack@1.6.0@watchpack/lib/watcherManager.js @ ./node_modules/_watchpack@1.6.0@watchpack/lib/watchpack.js @ (webpack)/lib/node/NodeWatchFileSystem.js @ (webpack)/lib/node/NodeEnvironmentPlugin.js @ (webpack)/lib/webpack.js @ multi ./node_modules/_webpack-dev-server@3.1.9@webpack-dev-server/client?http://0.0.0.0:8200 webpack ERROR in ./node_modules/_fsevents@1.2.4@fsevents/node_modules/tar/lib/mkdir.js Module not found: Error: Can't resolve 'fs' in 'D:\java\JetBrains\module\vue-app\vue-todo\node_modules\_fsevents@1.2.4@fsevents\node_modules\tar\lib' @ ./node_modules/_fsevents@1.2.4@fsevents/node_modules/tar/lib/mkdir.js 8:11-24 @ ./node_modules/_fsevents@1.2.4@fsevents/node_modules/tar/lib/unpack.js @ ./node_modules/_fsevents@1.2.4@fsevents/node_modules/tar/index.js @ ./node_modules/_fsevents@1.2.4@fsevents/node_modules/node-pre-gyp/lib/package.js @ ./node_modules/_fsevents@1.2.4@fsevents/node_modules/node-pre-gyp/lib sync ^\.\/.*$ @ ./node_modules/_fsevents@1.2.4@fsevents/node_modules/node-pre-gyp/lib/node-pre-gyp.js @ ./node_modules/_fsevents@1.2.4@fsevents/fsevents.js @ ./node_modules/_chokidar@2.0.4@chokidar/lib/fsevents-handler.js @ ./node_modules/_chokidar@2.0.4@chokidar/index.js @ ./node_modules/_watchpack@1.6.0@watchpack/lib/DirectoryWatcher.js @ ./node_modules/_watchpack@1.6.0@watchpack/lib/watcherManager.js @ ./node_modules/_watchpack@1.6.0@watchpack/lib/watchpack.js @ (webpack)/lib/node/NodeWatchFileSystem.js @ (webpack)/lib/node/NodeEnvironmentPlugin.js @ (webpack)/lib/webpack.js @ multi ./node_modules/_webpack-dev-server@3.1.9@webpack-dev-server/client?http://0.0.0.0:8200 webpack ERROR in ./node_modules/_fsevents@1.2.4@fsevents/node_modules/tar/lib/write-entry.js Module not found: Error: Can't resolve 'fs' in 'D:\java\JetBrains\module\vue-app\vue-todo\node_modules\_fsevents@1.2.4@fsevents\node_modules\tar\lib' @ ./node_modules/_fsevents@1.2.4@fsevents/node_modules/tar/lib/write-entry.js 7:11-24 @ ./node_modules/_fsevents@1.2.4@fsevents/node_modules/tar/index.js @ ./node_modules/_fsevents@1.2.4@fsevents/node_modules/node-pre-gyp/lib/package.js @ ./node_modules/_fsevents@1.2.4@fsevents/node_modules/node-pre-gyp/lib sync ^\.\/.*$ @ ./node_modules/_fsevents@1.2.4@fsevents/node_modules/node-pre-gyp/lib/node-pre-gyp.js @ ./node_modules/_fsevents@1.2.4@fsevents/fsevents.js @ ./node_modules/_chokidar@2.0.4@chokidar/lib/fsevents-handler.js @ ./node_modules/_chokidar@2.0.4@chokidar/index.js @ ./node_modules/_watchpack@1.6.0@watchpack/lib/DirectoryWatcher.js @ ./node_modules/_watchpack@1.6.0@watchpack/lib/watcherManager.js @ ./node_modules/_watchpack@1.6.0@watchpack/lib/watchpack.js @ (webpack)/lib/node/NodeWatchFileSystem.js @ (webpack)/lib/node/NodeEnvironmentPlugin.js @ (webpack)/lib/webpack.js @ multi ./node_modules/_webpack-dev-server@3.1.9@webpack-dev-server/client?http://0.0.0.0:8200 webpack ERROR in ./node_modules/_fsevents@1.2.4@fsevents/node_modules/tar/lib/unpack.js Module not found: Error: Can't resolve 'fs' in 'D:\java\JetBrains\module\vue-app\vue-todo\node_modules\_fsevents@1.2.4@fsevents\node_modules\tar\lib' @ ./node_modules/_fsevents@1.2.4@fsevents/node_modules/tar/lib/unpack.js 6:11-24 @ ./node_modules/_fsevents@1.2.4@fsevents/node_modules/tar/index.js @ ./node_modules/_fsevents@1.2.4@fsevents/node_modules/node-pre-gyp/lib/package.js @ ./node_modules/_fsevents@1.2.4@fsevents/node_modules/node-pre-gyp/lib sync ^\.\/.*$ @ ./node_modules/_fsevents@1.2.4@fsevents/node_modules/node-pre-gyp/lib/node-pre-gyp.js @ ./node_modules/_fsevents@1.2.4@fsevents/fsevents.js @ ./node_modules/_chokidar@2.0.4@chokidar/lib/fsevents-handler.js @ ./node_modules/_chokidar@2.0.4@chokidar/index.js @ ./node_modules/_watchpack@1.6.0@watchpack/lib/DirectoryWatcher.js @ ./node_modules/_watchpack@1.6.0@watchpack/lib/watcherManager.js @ ./node_modules/_watchpack@1.6.0@watchpack/lib/watchpack.js @ (webpack)/lib/node/NodeWatchFileSystem.js @ (webpack)/lib/node/NodeEnvironmentPlugin.js @ (webpack)/lib/webpack.js @ multi ./node_modules/_webpack-dev-server@3.1.9@webpack-dev-server/client?http://0.0.0.0:8200 webpack ERROR in ./node_modules/_fsevents@1.2.4@fsevents/node_modules/tar/lib/pack.js Module not found: Error: Can't resolve 'fs' in 'D:\java\JetBrains\module\vue-app\vue-todo\node_modules\_fsevents@1.2.4@fsevents\node_modules\tar\lib' @ ./node_modules/_fsevents@1.2.4@fsevents/node_modules/tar/lib/pack.js 56:11-24 @ ./node_modules/_fsevents@1.2.4@fsevents/node_modules/tar/index.js @ ./node_modules/_fsevents@1.2.4@fsevents/node_modules/node-pre-gyp/lib/package.js @ ./node_modules/_fsevents@1.2.4@fsevents/node_modules/node-pre-gyp/lib sync ^\.\/.*$ @ ./node_modules/_fsevents@1.2.4@fsevents/node_modules/node-pre-gyp/lib/node-pre-gyp.js @ ./node_modules/_fsevents@1.2.4@fsevents/fsevents.js @ ./node_modules/_chokidar@2.0.4@chokidar/lib/fsevents-handler.js @ ./node_modules/_chokidar@2.0.4@chokidar/index.js @ ./node_modules/_watchpack@1.6.0@watchpack/lib/DirectoryWatcher.js @ ./node_modules/_watchpack@1.6.0@watchpack/lib/watcherManager.js @ ./node_modules/_watchpack@1.6.0@watchpack/lib/watchpack.js @ (webpack)/lib/node/NodeWatchFileSystem.js @ (webpack)/lib/node/NodeEnvironmentPlugin.js @ (webpack)/lib/webpack.js @ multi ./node_modules/_webpack-dev-server@3.1.9@webpack-dev-server/client?http://0.0.0.0:8200 webpack ERROR in ./node_modules/_fsevents@1.2.4@fsevents/node_modules/tar/lib/extract.js Module not found: Error: Can't resolve 'fs' in 'D:\java\JetBrains\module\vue-app\vue-todo\node_modules\_fsevents@1.2.4@fsevents\node_modules\tar\lib' @ ./node_modules/_fsevents@1.2.4@fsevents/node_modules/tar/lib/extract.js 6:11-24 @ ./node_modules/_fsevents@1.2.4@fsevents/node_modules/tar/index.js @ ./node_modules/_fsevents@1.2.4@fsevents/node_modules/node-pre-gyp/lib/package.js @ ./node_modules/_fsevents@1.2.4@fsevents/node_modules/node-pre-gyp/lib sync ^\.\/.*$ @ ./node_modules/_fsevents@1.2.4@fsevents/node_modules/node-pre-gyp/lib/node-pre-gyp.js @ ./node_modules/_fsevents@1.2.4@fsevents/fsevents.js @ ./node_modules/_chokidar@2.0.4@chokidar/lib/fsevents-handler.js @ ./node_modules/_chokidar@2.0.4@chokidar/index.js @ ./node_modules/_watchpack@1.6.0@watchpack/lib/DirectoryWatcher.js @ ./node_modules/_watchpack@1.6.0@watchpack/lib/watcherManager.js @ ./node_modules/_watchpack@1.6.0@watchpack/lib/watchpack.js @ (webpack)/lib/node/NodeWatchFileSystem.js @ (webpack)/lib/node/NodeEnvironmentPlugin.js @ (webpack)/lib/webpack.js @ multi ./node_modules/_webpack-dev-server@3.1.9@webpack-dev-server/client?http://0.0.0.0:8200 webpack ERROR in ./node_modules/_fsevents@1.2.4@fsevents/node_modules/tar/lib/list.js Module not found: Error: Can't resolve 'fs' in 'D:\java\JetBrains\module\vue-app\vue-todo\node_modules\_fsevents@1.2.4@fsevents\node_modules\tar\lib' @ ./node_modules/_fsevents@1.2.4@fsevents/node_modules/tar/lib/list.js 11:11-24 @ ./node_modules/_fsevents@1.2.4@fsevents/node_modules/tar/index.js @ ./node_modules/_fsevents@1.2.4@fsevents/node_modules/node-pre-gyp/lib/package.js @ ./node_modules/_fsevents@1.2.4@fsevents/node_modules/node-pre-gyp/lib sync ^\.\/.*$ @ ./node_modules/_fsevents@1.2.4@fsevents/node_modules/node-pre-gyp/lib/node-pre-gyp.js @ ./node_modules/_fsevents@1.2.4@fsevents/fsevents.js @ ./node_modules/_chokidar@2.0.4@chokidar/lib/fsevents-handler.js @ ./node_modules/_chokidar@2.0.4@chokidar/index.js @ ./node_modules/_watchpack@1.6.0@watchpack/lib/DirectoryWatcher.js @ ./node_modules/_watchpack@1.6.0@watchpack/lib/watcherManager.js @ ./node_modules/_watchpack@1.6.0@watchpack/lib/watchpack.js @ (webpack)/lib/node/NodeWatchFileSystem.js @ (webpack)/lib/node/NodeEnvironmentPlugin.js @ (webpack)/lib/webpack.js @ multi ./node_modules/_webpack-dev-server@3.1.9@webpack-dev-server/client?http://0.0.0.0:8200 webpack ERROR in ./node_modules/_fsevents@1.2.4@fsevents/node_modules/tar/lib/create.js Module not found: Error: Can't resolve 'fs' in 'D:\java\JetBrains\module\vue-app\vue-todo\node_modules\_fsevents@1.2.4@fsevents\node_modules\tar\lib' @ ./node_modules/_fsevents@1.2.4@fsevents/node_modules/tar/lib/create.js 7:11-24 @ ./node_modules/_fsevents@1.2.4@fsevents/node_modules/tar/index.js @ ./node_modules/_fsevents@1.2.4@fsevents/node_modules/node-pre-gyp/lib/package.js @ ./node_modules/_fsevents@1.2.4@fsevents/node_modules/node-pre-gyp/lib sync ^\.\/.*$ @ ./node_modules/_fsevents@1.2.4@fsevents/node_modules/node-pre-gyp/lib/node-pre-gyp.js @ ./node_modules/_fsevents@1.2.4@fsevents/fsevents.js @ ./node_modules/_chokidar@2.0.4@chokidar/lib/fsevents-handler.js @ ./node_modules/_chokidar@2.0.4@chokidar/index.js @ ./node_modules/_watchpack@1.6.0@watchpack/lib/DirectoryWatcher.js @ ./node_modules/_watchpack@1.6.0@watchpack/lib/watcherManager.js @ ./node_modules/_watchpack@1.6.0@watchpack/lib/watchpack.js @ (webpack)/lib/node/NodeWatchFileSystem.js @ (webpack)/lib/node/NodeEnvironmentPlugin.js @ (webpack)/lib/webpack.js @ multi ./node_modules/_webpack-dev-server@3.1.9@webpack-dev-server/client?http://0.0.0.0:8200 webpack ERROR in ./node_modules/_glob@7.1.3@glob/sync.js Module not found: Error: Can't resolve 'fs' in 'D:\java\JetBrains\module\vue-app\vue-todo\node_modules\_glob@7.1.3@glob' @ ./node_modules/_glob@7.1.3@glob/sync.js 4:9-22 @ ./node_modules/_glob@7.1.3@glob/glob.js @ ./node_modules/_cacache@10.0.4@cacache/lib/verify.js @ ./node_modules/_cacache@10.0.4@cacache/verify.js @ ./node_modules/_cacache@10.0.4@cacache/locales/en.js @ ./node_modules/_cacache@10.0.4@cacache/index.js @ ./node_modules/_uglifyjs-webpack-plugin@1.3.0@uglifyjs-webpack-plugin/dist/uglify/Runner.js @ ./node_modules/_uglifyjs-webpack-plugin@1.3.0@uglifyjs-webpack-plugin/dist/index.js @ ./node_modules/_uglifyjs-webpack-plugin@1.3.0@uglifyjs-webpack-plugin/dist/cjs.js @ (webpack)/lib/WebpackOptionsDefaulter.js @ (webpack)/lib/webpack.js @ multi ./node_modules/_webpack-dev-server@3.1.9@webpack-dev-server/client?http://0.0.0.0:8200 webpack ERROR in ./node_modules/_glob@7.1.3@glob/glob.js Module not found: Error: Can't resolve 'fs' in 'D:\java\JetBrains\module\vue-app\vue-todo\node_modules\_glob@7.1.3@glob' @ ./node_modules/_glob@7.1.3@glob/glob.js 43:9-22 @ ./node_modules/_cacache@10.0.4@cacache/lib/verify.js @ ./node_modules/_cacache@10.0.4@cacache/verify.js @ ./node_modules/_cacache@10.0.4@cacache/locales/en.js @ ./node_modules/_cacache@10.0.4@cacache/index.js @ ./node_modules/_uglifyjs-webpack-plugin@1.3.0@uglifyjs-webpack-plugin/dist/uglify/Runner.js @ ./node_modules/_uglifyjs-webpack-plugin@1.3.0@uglifyjs-webpack-plugin/dist/index.js @ ./node_modules/_uglifyjs-webpack-plugin@1.3.0@uglifyjs-webpack-plugin/dist/cjs.js @ (webpack)/lib/WebpackOptionsDefaulter.js @ (webpack)/lib/webpack.js @ multi ./node_modules/_webpack-dev-server@3.1.9@webpack-dev-server/client?http://0.0.0.0:8200 webpack ERROR in ./node_modules/_graceful-fs@4.1.11@graceful-fs/graceful-fs.js Module not found: Error: Can't resolve 'fs' in 'D:\java\JetBrains\module\vue-app\vue-todo\node_modules\_graceful-fs@4.1.11@graceful-fs' @ ./node_modules/_graceful-fs@4.1.11@graceful-fs/graceful-fs.js 1:9-22 @ ./node_modules/_enhanced-resolve@4.1.0@enhanced-resolve/lib/NodeJsInputFileSystem.js @ (webpack)/lib/node/NodeEnvironmentPlugin.js @ (webpack)/lib/webpack.js @ multi ./node_modules/_webpack-dev-server@3.1.9@webpack-dev-server/client?http://0.0.0.0:8200 webpack ERROR in ./node_modules/_graceful-fs@4.1.11@graceful-fs/fs.js Module not found: Error: Can't resolve 'fs' in 'D:\java\JetBrains\module\vue-app\vue-todo\node_modules\_graceful-fs@4.1.11@graceful-fs' @ ./node_modules/_graceful-fs@4.1.11@graceful-fs/fs.js 3:9-22 @ ./node_modules/_graceful-fs@4.1.11@graceful-fs/graceful-fs.js @ ./node_modules/_enhanced-resolve@4.1.0@enhanced-resolve/lib/NodeJsInputFileSystem.js @ (webpack)/lib/node/NodeEnvironmentPlugin.js @ (webpack)/lib/webpack.js @ multi ./node_modules/_webpack-dev-server@3.1.9@webpack-dev-server/client?http://0.0.0.0:8200 webpack ERROR in ./node_modules/_loader-runner@2.3.1@loader-runner/lib/LoaderRunner.js Module not found: Error: Can't resolve 'fs' in 'D:\java\JetBrains\module\vue-app\vue-todo\node_modules\_loader-runner@2.3.1@loader-runner\lib' @ ./node_modules/_loader-runner@2.3.1@loader-runner/lib/LoaderRunner.js 5:9-22 @ (webpack)/lib/NormalModule.js @ (webpack)/lib/AutomaticPrefetchPlugin.js @ (webpack)/lib/webpack.js @ multi ./node_modules/_webpack-dev-server@3.1.9@webpack-dev-server/client?http://0.0.0.0:8200 webpack ERROR in ./node_modules/_make-dir@1.3.0@make-dir/index.js Module not found: Error: Can't resolve 'fs' in 'D:\java\JetBrains\module\vue-app\vue-todo\node_modules\_make-dir@1.3.0@make-dir' @ ./node_modules/_make-dir@1.3.0@make-dir/index.js 2:11-24 @ ./node_modules/_find-cache-dir@1.0.0@find-cache-dir/index.js @ ./node_modules/_uglifyjs-webpack-plugin@1.3.0@uglifyjs-webpack-plugin/dist/uglify/Runner.js @ ./node_modules/_uglifyjs-webpack-plugin@1.3.0@uglifyjs-webpack-plugin/dist/index.js @ ./node_modules/_uglifyjs-webpack-plugin@1.3.0@uglifyjs-webpack-plugin/dist/cjs.js @ (webpack)/lib/WebpackOptionsDefaulter.js @ (webpack)/lib/webpack.js @ multi ./node_modules/_webpack-dev-server@3.1.9@webpack-dev-server/client?http://0.0.0.0:8200 webpack ERROR in ./node_modules/_mkdirp@0.5.1@mkdirp/index.js Module not found: Error: Can't resolve 'fs' in 'D:\java\JetBrains\module\vue-app\vue-todo\node_modules\_mkdirp@0.5.1@mkdirp' @ ./node_modules/_mkdirp@0.5.1@mkdirp/index.js 2:9-22 @ (webpack)/lib/node/NodeOutputFileSystem.js @ (webpack)/lib/node/NodeEnvironmentPlugin.js @ (webpack)/lib/webpack.js @ multi ./node_modules/_webpack-dev-server@3.1.9@webpack-dev-server/client?http://0.0.0.0:8200 webpack ERROR in ./node_modules/_move-concurrently@1.0.1@move-concurrently/move.js Module not found: Error: Can't resolve 'fs' in 'D:\java\JetBrains\module\vue-app\vue-todo\node_modules\_move-concurrently@1.0.1@move-concurrently' @ ./node_modules/_move-concurrently@1.0.1@move-concurrently/move.js 4:13-26 @ ./node_modules/_cacache@10.0.4@cacache/lib/util/move-file.js @ ./node_modules/_cacache@10.0.4@cacache/lib/content/write.js @ ./node_modules/_cacache@10.0.4@cacache/put.js @ ./node_modules/_cacache@10.0.4@cacache/locales/en.js @ ./node_modules/_cacache@10.0.4@cacache/index.js @ ./node_modules/_uglifyjs-webpack-plugin@1.3.0@uglifyjs-webpack-plugin/dist/uglify/Runner.js @ ./node_modules/_uglifyjs-webpack-plugin@1.3.0@uglifyjs-webpack-plugin/dist/index.js @ ./node_modules/_uglifyjs-webpack-plugin@1.3.0@uglifyjs-webpack-plugin/dist/cjs.js @ (webpack)/lib/WebpackOptionsDefaulter.js @ (webpack)/lib/webpack.js @ multi ./node_modules/_webpack-dev-server@3.1.9@webpack-dev-server/client?http://0.0.0.0:8200 webpack ERROR in ./node_modules/_path-exists@3.0.0@path-exists/index.js Module not found: Error: Can't resolve 'fs' in 'D:\java\JetBrains\module\vue-app\vue-todo\node_modules\_path-exists@3.0.0@path-exists' @ ./node_modules/_path-exists@3.0.0@path-exists/index.js 2:11-24 @ ./node_modules/_locate-path@2.0.0@locate-path/index.js @ ./node_modules/_find-up@2.1.0@find-up/index.js @ ./node_modules/_pkg-dir@2.0.0@pkg-dir/index.js @ ./node_modules/_find-cache-dir@1.0.0@find-cache-dir/index.js @ ./node_modules/_uglifyjs-webpack-plugin@1.3.0@uglifyjs-webpack-plugin/dist/uglify/Runner.js @ ./node_modules/_uglifyjs-webpack-plugin@1.3.0@uglifyjs-webpack-plugin/dist/index.js @ ./node_modules/_uglifyjs-webpack-plugin@1.3.0@uglifyjs-webpack-plugin/dist/cjs.js @ (webpack)/lib/WebpackOptionsDefaulter.js @ (webpack)/lib/webpack.js @ multi ./node_modules/_webpack-dev-server@3.1.9@webpack-dev-server/client?http://0.0.0.0:8200 webpack ERROR in ./node_modules/_rimraf@2.6.2@rimraf/rimraf.js Module not found: Error: Can't resolve 'fs' in 'D:\java\JetBrains\module\vue-app\vue-todo\node_modules\_rimraf@2.6.2@rimraf' @ ./node_modules/_rimraf@2.6.2@rimraf/rimraf.js 6:9-22 @ ./node_modules/_cacache@10.0.4@cacache/lib/util/tmp.js @ ./node_modules/_cacache@10.0.4@cacache/locales/en.js @ ./node_modules/_cacache@10.0.4@cacache/index.js @ ./node_modules/_uglifyjs-webpack-plugin@1.3.0@uglifyjs-webpack-plugin/dist/uglify/Runner.js @ ./node_modules/_uglifyjs-webpack-plugin@1.3.0@uglifyjs-webpack-plugin/dist/index.js @ ./node_modules/_uglifyjs-webpack-plugin@1.3.0@uglifyjs-webpack-plugin/dist/cjs.js @ (webpack)/lib/WebpackOptionsDefaulter.js @ (webpack)/lib/webpack.js @ multi ./node_modules/_webpack-dev-server@3.1.9@webpack-dev-server/client?http://0.0.0.0:8200 webpack ERROR in ./node_modules/_schema-utils@0.4.7@schema-utils/src/validateOptions.js Module not found: Error: Can't resolve 'fs' in 'D:\java\JetBrains\module\vue-app\vue-todo\node_modules\_schema-utils@0.4.7@schema-utils\src' @ ./node_modules/_schema-utils@0.4.7@schema-utils/src/validateOptions.js 8:11-24 @ ./node_modules/_schema-utils@0.4.7@schema-utils/src/index.js @ (webpack)/lib/BannerPlugin.js @ (webpack)/lib/webpack.js @ multi ./node_modules/_webpack-dev-server@3.1.9@webpack-dev-server/client?http://0.0.0.0:8200 webpack ERROR in ./node_modules/_snapdragon@0.8.2@snapdragon/lib/source-maps.js Module not found: Error: Can't resolve 'fs' in 'D:\java\JetBrains\module\vue-app\vue-todo\node_modules\_snapdragon@0.8.2@snapdragon\lib' @ ./node_modules/_snapdragon@0.8.2@snapdragon/lib/source-maps.js 3:9-22 @ ./node_modules/_snapdragon@0.8.2@snapdragon/lib/compiler.js @ ./node_modules/_snapdragon@0.8.2@snapdragon/index.js @ ./node_modules/_micromatch@3.1.10@micromatch/lib/utils.js @ ./node_modules/_micromatch@3.1.10@micromatch/index.js @ (webpack)/lib/optimize/SideEffectsFlagPlugin.js @ (webpack)/lib/webpack.js @ multi ./node_modules/_webpack-dev-server@3.1.9@webpack-dev-server/client?http://0.0.0.0:8200 webpack ERROR in ./node_modules/_uglify-es@3.3.9@uglify-es/tools/node.js Module not found: Error: Can't resolve 'fs' in 'D:\java\JetBrains\module\vue-app\vue-todo\node_modules\_uglify-es@3.3.9@uglify-es\tools' @ ./node_modules/_uglify-es@3.3.9@uglify-es/tools/node.js 1:9-22 @ ./node_modules/_uglifyjs-webpack-plugin@1.3.0@uglifyjs-webpack-plugin/dist/uglify/minify.js @ ./node_modules/_uglifyjs-webpack-plugin@1.3.0@uglifyjs-webpack-plugin/dist/uglify/Runner.js @ ./node_modules/_uglifyjs-webpack-plugin@1.3.0@uglifyjs-webpack-plugin/dist/index.js @ ./node_modules/_uglifyjs-webpack-plugin@1.3.0@uglifyjs-webpack-plugin/dist/cjs.js @ (webpack)/lib/WebpackOptionsDefaulter.js @ (webpack)/lib/webpack.js @ multi ./node_modules/_webpack-dev-server@3.1.9@webpack-dev-server/client?http://0.0.0.0:8200 webpack ERROR in (webpack)/lib/debug/ProfilingPlugin.js Module not found: Error: Can't resolve 'fs' in 'D:\java\JetBrains\module\vue-app\vue-todo\node_modules\_webpack@4.20.2@webpack\lib\debug' @ (webpack)/lib/debug/ProfilingPlugin.js 1:11-24 @ (webpack)/lib/webpack.js @ multi ./node_modules/_webpack-dev-server@3.1.9@webpack-dev-server/client?http://0.0.0.0:8200 webpack ERROR in (webpack)/lib/node/NodeMainTemplateAsync.runtime.js Module not found: Error: Can't resolve 'fs' in 'D:\java\JetBrains\module\vue-app\vue-todo\node_modules\_webpack@4.20.2@webpack\lib\node' @ (webpack)/lib/node/NodeMainTemplateAsync.runtime.js 10:2-15 28:3-16 @ (webpack)/lib/node/NodeMainTemplatePlugin.js @ (webpack)/lib/node/NodeTemplatePlugin.js @ (webpack)/lib/webpack.js @ multi ./node_modules/_webpack-dev-server@3.1.9@webpack-dev-server/client?http://0.0.0.0:8200 webpack ERROR in (webpack)/lib/node/NodeOutputFileSystem.js Module not found: Error: Can't resolve 'fs' in 'D:\java\JetBrains\module\vue-app\vue-todo\node_modules\_webpack@4.20.2@webpack\lib\node' @ (webpack)/lib/node/NodeOutputFileSystem.js 7:11-24 @ (webpack)/lib/node/NodeEnvironmentPlugin.js @ (webpack)/lib/webpack.js @ multi ./node_modules/_webpack-dev-server@3.1.9@webpack-dev-server/client?http://0.0.0.0:8200 webpack ERROR in ./node_modules/_y18n@4.0.0@y18n/index.js Module not found: Error: Can't resolve 'fs' in 'D:\java\JetBrains\module\vue-app\vue-todo\node_modules\_y18n@4.0.0@y18n' @ ./node_modules/_y18n@4.0.0@y18n/index.js 1:9-22 @ ./node_modules/_cacache@10.0.4@cacache/lib/util/y.js @ ./node_modules/_cacache@10.0.4@cacache/locales/en.js @ ./node_modules/_cacache@10.0.4@cacache/index.js @ ./node_modules/_uglifyjs-webpack-plugin@1.3.0@uglifyjs-webpack-plugin/dist/uglify/Runner.js @ ./node_modules/_uglifyjs-webpack-plugin@1.3.0@uglifyjs-webpack-plugin/dist/index.js @ ./node_modules/_uglifyjs-webpack-plugin@1.3.0@uglifyjs-webpack-plugin/dist/cjs.js @ (webpack)/lib/WebpackOptionsDefaulter.js @ (webpack)/lib/webpack.js @ multi ./node_modules/_webpack-dev-server@3.1.9@webpack-dev-server/client?http://0.0.0.0:8200 webpack ERROR in (webpack)/lib/NormalModule.js Module not found: Error: Can't resolve 'module' in 'D:\java\JetBrains\module\vue-app\vue-todo\node_modules\_webpack@4.20.2@webpack\lib' @ (webpack)/lib/NormalModule.js 7:21-38 @ (webpack)/lib/AutomaticPrefetchPlugin.js @ (webpack)/lib/webpack.js @ multi ./node_modules/_webpack-dev-server@3.1.9@webpack-dev-server/client?http://0.0.0.0:8200 webpack ERROR in (webpack)/lib/node/NodeTargetPlugin.js Module not found: Error: Can't resolve 'module' in 'D:\java\JetBrains\module\vue-app\vue-todo\node_modules\_webpack@4.20.2@webpack\lib\node' @ (webpack)/lib/node/NodeTargetPlugin.js 11:1-18 @ (webpack)/lib/WebpackOptionsApply.js @ (webpack)/lib/webpack.js @ multi ./node_modules/_webpack-dev-server@3.1.9@webpack-dev-server/client?http://0.0.0.0:8200 webpack Child html-webpack-plugin for "index.html": 1 asset Entrypoint undefined = index.html [0] ./node_modules/_html-webpack-plugin@3.2.0@html-webpack-plugin/lib/loader.js!./node_modules/_html-webpack-plugin@3.2.0@html-webpack-plugin/default_index.ejs 392 bytes {0} [b uilt] [1] ./node_modules/_lodash@4.17.11@lodash/lodash.js 527 KiB {0} [built] [2] (webpack)/buildin/global.js 509 bytes {0} [built] [3] (webpack)/buildin/module.js 519 bytes {0} [built] i 「wdm」: Failed to compile.
在终端执行webpack调用webpack.config.js 时,报错
### 在终端执行webpack调用webpack.config.js 时,报错,求大佬解决 ### 这是我 webpack.config.js 的代码 ``` JavaScript const path = require('path') module.exports = { entry: './src/main.js', output: { path: path.join(__dirname, './dist'), filename: 'bundle.js' }, mode: 'development' } ``` ### 这是我 package.json 的内容 ``` { "name": "webpack-b", "version": "1.0.0", "description": "", "main": "index.js", "scripts": { "test": "echo \"Error: no test specified\" && exit 1" }, "keywords": [], "author": "", "license": "ISC", "devDependencies": { "jquery": "^3.3.1", "webpack": "^4.20.2", "webpack-cli": "^3.1.2" } } ``` 这是目录结构 ![图片说明](https://img-ask.csdn.net/upload/201810/09/1539066890_92808.png) 这是我报错的信息 ![图片说明](https://img-ask.csdn.net/upload/201810/09/1539066961_249766.png) #### 但是如果我在package.json的 script 中加上 ``` javascript "scripts": { "test": "echo \"Error: no test specified\" && exit 1", "dev": "webpack --mode development ./src/main.js --output ./dist/bundle.js" }, ```` 然后在终端执行 npm run dev,却是成功的,求解 ![图片说明](https://img-ask.csdn.net/upload/201810/09/1539067218_230104.png)
webpack4.x中mini-css-webpack-plugin的使用
webapck4.x中废弃了extract-text-webpack-plugin,说建议使用mini-css-webpack-plugin,当我在使用这个的时候发现这里面不能单独修改css文件的中引用图片的publicPath属性,然后打包后css文件中的url指向就出现了问题,我想知道webpack4.x中如何解决这一问题
npm安装webpack失败!!!
node.js已经安装好了 npm也已经安装。安装的时候一路确定没有做路径的修改。 ![图片说明](https://img-ask.csdn.net/upload/201709/27/1506504327_787644.png) 项目放在D盘下面 也用npm生成了package.json文件 ![图片说明](https://img-ask.csdn.net/upload/201709/27/1506504408_978490.png) 最后我在安装全局webpack的时候失败!无论在哪安装都是报这个错.... ![图片说明](https://img-ask.csdn.net/upload/201709/27/1506504460_937589.png) 也不知道哪错了 心累┭┮﹏┭┮ 求大神指点。。。
webpack配置less问题 这里我真不知道如何配置了,请教下
{ test: /\.css$/, use: ExtractTextPlugin.extract({ fallback: "style-loader", use: [{ loader: "css-loader", options: { modules: true } }, { loader: "postcss-loader" }], }) }] 这里是局部截图,我已经安装了依赖 less less-loader 可是这里我该如何配置 ,我用的 webpack3.55
终于明白阿里百度这样的大公司,为什么面试经常拿ThreadLocal考验求职者了
点击上面↑「爱开发」关注我们每晚10点,捕获技术思考和创业资源洞察什么是ThreadLocalThreadLocal是一个本地线程副本变量工具类,各个线程都拥有一份线程私...
程序员必须掌握的核心算法有哪些?
由于我之前一直强调数据结构以及算法学习的重要性,所以就有一些读者经常问我,数据结构与算法应该要学习到哪个程度呢?,说实话,这个问题我不知道要怎么回答你,主要取决于你想学习到哪些程度,不过针对这个问题,我稍微总结一下我学过的算法知识点,以及我觉得值得学习的算法。这些算法与数据结构的学习大多数是零散的,并没有一本把他们全部覆盖的书籍。下面是我觉得值得学习的一些算法以及数据结构,当然,我也会整理一些看过...
Linux(服务器编程):15---两种高效的事件处理模式(reactor模式、proactor模式)
前言 同步I/O模型通常用于实现Reactor模式 异步I/O模型则用于实现Proactor模式 最后我们会使用同步I/O方式模拟出Proactor模式 一、Reactor模式 Reactor模式特点 它要求主线程(I/O处理单元)只负责监听文件描述符上是否有事件发生,有的话就立即将时间通知工作线程(逻辑单元)。除此之外,主线程不做任何其他实质性的工作 读写数据,接受新的连接,以及处...
阿里面试官问我:如何设计秒杀系统?我的回答让他比起大拇指
你知道的越多,你不知道的越多 点赞再看,养成习惯 GitHub上已经开源 https://github.com/JavaFamily 有一线大厂面试点脑图和个人联系方式,欢迎Star和指教 前言 Redis在互联网技术存储方面使用如此广泛,几乎所有的后端技术面试官都要在Redis的使用和原理方面对小伙伴们进行360°的刁难。 作为一个在互联网公司面一次拿一次Offer的面霸,打败了...
五年程序员记流水账式的自白。
不知觉已中码龄已突破五年,一路走来从起初铁憨憨到现在的十九线程序员,一路成长,虽然不能成为高工,但是也能挡下一面,从15年很火的android开始入坑,走过java、.Net、QT,目前仍处于android和.net交替开发中。 毕业到现在一共就职过两家公司,目前是第二家,公司算是半个创业公司,所以基本上都会身兼多职。比如不光要写代码,还要写软著、软著评测、线上线下客户对接需求收集...
C语言魔塔游戏
很早就很想写这个,今天终于写完了。 游戏截图: 编译环境: VS2017 游戏需要一些图片,如果有想要的或者对游戏有什么看法的可以加我的QQ 2985486630 讨论,如果暂时没有回应,可以在博客下方留言,到时候我会看到。 下面我来介绍一下游戏的主要功能和实现方式 首先是玩家的定义,使用结构体,这个名字是可以自己改变的 struct gamerole { char n...
一文详尽系列之模型评估指标
点击上方“Datawhale”,选择“星标”公众号第一时间获取价值内容在机器学习领域通常会根据实际的业务场景拟定相应的不同的业务指标,针对不同机器学习问题如回归、分类、排...
究竟你适不适合买Mac?
我清晰的记得,刚买的macbook pro回到家,开机后第一件事情,就是上了淘宝网,花了500元钱,找了一个上门维修电脑的师傅,上门给我装了一个windows系统。。。。。。 表砍我。。。 当时买mac的初衷,只是想要个固态硬盘的笔记本,用来运行一些复杂的扑克软件。而看了当时所有的SSD笔记本后,最终决定,还是买个好(xiong)看(da)的。 已经有好几个朋友问我mba怎么样了,所以今天尽量客观...
程序员一般通过什么途径接私活?
二哥,你好,我想知道一般程序猿都如何接私活,我也想接,能告诉我一些方法吗? 上面是一个读者“烦不烦”问我的一个问题。其实不止是“烦不烦”,还有很多读者问过我类似这样的问题。 我接的私活不算多,挣到的钱也没有多少,加起来不到 20W。说实话,这个数目说出来我是有点心虚的,毕竟太少了,大家轻喷。但我想,恰好配得上“一般程序员”这个称号啊。毕竟苍蝇再小也是肉,我也算是有经验的人了。 唾弃接私活、做外...
压测学习总结(1)——高并发性能指标:QPS、TPS、RT、吞吐量详解
一、QPS,每秒查询 QPS:Queries Per Second意思是“每秒查询率”,是一台服务器每秒能够相应的查询次数,是对一个特定的查询服务器在规定时间内所处理流量多少的衡量标准。互联网中,作为域名系统服务器的机器的性能经常用每秒查询率来衡量。 二、TPS,每秒事务 TPS:是TransactionsPerSecond的缩写,也就是事务数/秒。它是软件测试结果的测量单位。一个事务是指一...
Python爬虫爬取淘宝,京东商品信息
小编是一个理科生,不善长说一些废话。简单介绍下原理然后直接上代码。 使用的工具(Python+pycharm2019.3+selenium+xpath+chromedriver)其中要使用pycharm也可以私聊我selenium是一个框架可以通过pip下载 pip installselenium -ihttps://pypi.tuna.tsinghua.edu.cn/simple/ ...
阿里程序员写了一个新手都写不出的低级bug,被骂惨了。
这种新手都不会范的错,居然被一个工作好几年的小伙子写出来,差点被当场开除了。
Java工作4年来应聘要16K最后没要,细节如下。。。
前奏: 今天2B哥和大家分享一位前几天面试的一位应聘者,工作4年26岁,统招本科。 以下就是他的简历和面试情况。 基本情况: 专业技能: 1、&nbsp;熟悉Sping了解SpringMVC、SpringBoot、Mybatis等框架、了解SpringCloud微服务 2、&nbsp;熟悉常用项目管理工具:SVN、GIT、MAVEN、Jenkins 3、&nbsp;熟悉Nginx、tomca...
2020年,冯唐49岁:我给20、30岁IT职场年轻人的建议
点击“技术领导力”关注∆每天早上8:30推送 作者|Mr.K 编辑| Emma 来源|技术领导力(ID:jishulingdaoli) 前天的推文《冯唐:职场人35岁以后,方法论比经验重要》,收到了不少读者的反馈,觉得挺受启发。其实,冯唐写了不少关于职场方面的文章,都挺不错的。可惜大家只记住了“春风十里不如你”、“如何避免成为油腻腻的中年人”等不那么正经的文章。 本文整理了冯...
程序员该看的几部电影
1、骇客帝国(1999) 概念:在线/离线,递归,循环,矩阵等 剧情简介: 不久的将来,网络黑客尼奥对这个看似正常的现实世界产生了怀疑。 他结识了黑客崔妮蒂,并见到了黑客组织的首领墨菲斯。 墨菲斯告诉他,现实世界其实是由一个名叫“母体”的计算机人工智能系统控制,人们就像他们饲养的动物,没有自由和思想,而尼奥就是能够拯救人类的救世主。 可是,救赎之路从来都不会一帆风顺,到底哪里才是真实的世界?如何...
Python绘图,圣诞树,花,爱心 | Turtle篇
每周每日,分享Python实战代码,入门资料,进阶资料,基础语法,爬虫,数据分析,web网站,机器学习,深度学习等等。 公众号回复【进群】沟通交流吧,QQ扫码进群学习吧 微信群 QQ群 1.画圣诞树 import turtle screen = turtle.Screen() screen.setup(800,600) circle = turtle.Turtle()...
作为一个程序员,CPU的这些硬核知识你必须会!
CPU对每个程序员来说,是个既熟悉又陌生的东西? 如果你只知道CPU是中央处理器的话,那可能对你并没有什么用,那么作为程序员的我们,必须要搞懂的就是CPU这家伙是如何运行的,尤其要搞懂它里面的寄存器是怎么一回事,因为这将让你从底层明白程序的运行机制。 随我一起,来好好认识下CPU这货吧 把CPU掰开来看 对于CPU来说,我们首先就要搞明白它是怎么回事,也就是它的内部构造,当然,CPU那么牛的一个东...
还记得那个提速8倍的IDEA插件吗?VS Code版本也发布啦!!
去年,阿里云发布了本地 IDE 插件 Cloud Toolkit,仅 IntelliJ IDEA 一个平台,就有 15 万以上的开发者进行了下载,体验了一键部署带来的开发便利。时隔一年的今天,阿里云正式发布了 Visual Studio Code 版本,全面覆盖前端开发者,帮助前端实现一键打包部署,让开发提速 8 倍。 VSCode 版本的插件,目前能做到什么? 安装插件之后,开发者可以立即体验...
破14亿,Python分析我国存在哪些人口危机!
一、背景 二、爬取数据 三、数据分析 1、总人口 2、男女人口比例 3、人口城镇化 4、人口增长率 5、人口老化(抚养比) 6、各省人口 7、世界人口 四、遇到的问题 遇到的问题 1、数据分页,需要获取从1949-2018年数据,观察到有近20年参数:LAST20,由此推测获取近70年的参数可设置为:LAST70 2、2019年数据没有放上去,可以手动添加上去 3、将数据进行 行列转换 4、列名...
2019年除夕夜的有感而发
天气:小雨(加小雪) 温度:3摄氏度 空气:严重污染(399) 风向:北风 风力:微风 现在是除夕夜晚上十点钟,再有两个小时就要新的一年了; 首先要说的是我没患病,至少现在是没有患病;但是心情确像患了病一样沉重; 现在这个时刻应该大部分家庭都在看春晚吧,或许一家人团团圆圆的坐在一起,或许因为某些特殊原因而不能团圆;但不管是身在何处,身处什么境地,我都想对每一个人说一句:新年快乐! 不知道csdn这...
听说想当黑客的都玩过这个Monyer游戏(1~14攻略)
第零关 进入传送门开始第0关(游戏链接) 请点击链接进入第1关: 连接在左边→ ←连接在右边 看不到啊。。。。(只能看到一堆大佬做完的留名,也能看到菜鸡的我,在后面~~) 直接fn+f12吧 &lt;span&gt;连接在左边→&lt;/span&gt; &lt;a href="first.php"&gt;&lt;/a&gt; &lt;span&gt;←连接在右边&lt;/span&gt; o...
在家远程办公效率低?那你一定要收好这个「在家办公」神器!
相信大家都已经收到国务院延长春节假期的消息,接下来,在家远程办公可能将会持续一段时间。 但是问题来了。远程办公不是人在电脑前就当坐班了,相反,对于沟通效率,文件协作,以及信息安全都有着极高的要求。有着非常多的挑战,比如: 1在异地互相不见面的会议上,如何提高沟通效率? 2文件之间的来往反馈如何做到及时性?如何保证信息安全? 3如何规划安排每天工作,以及如何进行成果验收? ...... ...
作为一个程序员,内存和磁盘的这些事情,你不得不知道啊!!!
截止目前,我已经分享了如下几篇文章: 一个程序在计算机中是如何运行的?超级干货!!! 作为一个程序员,CPU的这些硬核知识你必须会! 作为一个程序员,内存的这些硬核知识你必须懂! 这些知识可以说是我们之前都不太重视的基础知识,可能大家在上大学的时候都学习过了,但是嘞,当时由于老师讲解的没那么有趣,又加上这些知识本身就比较枯燥,所以嘞,大家当初几乎等于没学。 再说啦,学习这些,也看不出来有什么用啊!...
2020年的1月,我辞掉了我的第一份工作
其实,这篇文章,我应该早点写的,毕竟现在已经2月份了。不过一些其它原因,或者是我的惰性、还有一些迷茫的念头,让自己迟迟没有试着写一点东西,记录下,或者说是总结下自己前3年的工作上的经历、学习的过程。 我自己知道的,在写自己的博客方面,我的文笔很一般,非技术类的文章不想去写;另外我又是一个还比较热衷于技术的人,而平常复杂一点的东西,如果想写文章写的清楚点,是需要足够...
别低估自己的直觉,也别高估自己的智商
所有群全部吵翻天,朋友圈全部沦陷,公众号疯狂转发。这两周没怎么发原创,只发新闻,可能有人注意到了。我不是懒,是文章写了却没发,因为大家的关注力始终在这次的疫情上面,发了也没人看。当然,我...
这个世界上人真的分三六九等,你信吗?
偶然间,在知乎上看到一个问题 一时间,勾起了我深深的回忆。 以前在厂里打过两次工,做过家教,干过辅导班,做过中介。零下几度的晚上,贴过广告,满脸、满手地长冻疮。 再回首那段岁月,虽然苦,但让我学会了坚持和忍耐。让我明白了,在这个世界上,无论环境多么的恶劣,只要心存希望,星星之火,亦可燎原。 下文是原回答,希望能对你能有所启发。 如果我说,这个世界上人真的分三六九等,...
节后首个工作日,企业们集体开晨会让钉钉挂了
By 超神经场景描述:昨天 2 月 3 日,是大部分城市号召远程工作的第一天,全国有接近 2 亿人在家开始远程办公,钉钉上也有超过 1000 万家企业活跃起来。关键词:十一出行 人脸...
Java基础知识点梳理
虽然已经在实际工作中经常与java打交道,但是一直没系统地对java这门语言进行梳理和总结,掌握的知识也比较零散。恰好利用这段时间重新认识下java,并对一些常见的语法和知识点做个总结与回顾,一方面为了加深印象,方便后面查阅,一方面为了掌握好Android打下基础。
2020年全新Java学习路线图,含配套视频,学完即为中级Java程序员!!
新的一年来临,突如其来的疫情打破了平静的生活! 在家的你是否很无聊,如果无聊就来学习吧! 世上只有一种投资只赚不赔,那就是学习!!! 传智播客于2020年升级了Java学习线路图,硬核升级,免费放送! 学完你就是中级程序员,能更快一步找到工作! 一、Java基础 JavaSE基础是Java中级程序员的起点,是帮助你从小白到懂得编程的必经之路。 在Java基础板块中有6个子模块的学...
B 站上有哪些很好的学习资源?
哇说起B站,在小九眼里就是宝藏般的存在,放年假宅在家时一天刷6、7个小时不在话下,更别提今年的跨年晚会,我简直是跪着看完的!! 最早大家聚在在B站是为了追番,再后来我在上面刷欧美新歌和漂亮小姐姐的舞蹈视频,最近两年我和周围的朋友们已经把B站当作学习教室了,而且学习成本还免费,真是个励志的好平台ヽ(.◕ฺˇд ˇ◕ฺ;)ノ 下面我们就来盘点一下B站上优质的学习资源: 综合类 Oeasy: 综合...
相关热词 c#导入fbx c#中屏蔽键盘某个键 c#正态概率密度 c#和数据库登陆界面设计 c# 高斯消去法 c# codedom c#读取cad文件文本 c# 控制全局鼠标移动 c# temp 目录 bytes初始化 c#
立即提问