linux中maven的.m2文件夹在哪。

在windows系统中maven的本地仓库在user/主机名字/.m2....
在linux系统中.m2文件是在哪呢

1个回答

终端输入:~$ ls -a找到.m2文件夹,一般默认应该在主目录下的/~m2文件夹里

Csdn user default icon
上传中...
上传图片
插入图片
抄袭、复制答案,以达到刷声望分或其他目的的行为,在CSDN问答是严格禁止的,一经发现立刻封号。是时候展现真正的技术了!
其他相关推荐
关于maven的使用问题 , 没有 .m2 文件夹

我使用的是非安装版的maven 配置好环境变量以后 , 根据网上说的执行了 mvn -help:system 但是执行后还是没有 .m2 文件夹 现在 CMD 的相关命令都可以使用 , 但是没有 .m2文件夹 顺便问一下 1.其他人传给我 maven jar 包文件夹怎么使用 ? 放在 .m2 文件夹里就可以了吗?(我没有这个文件夹怎么办?) 2.eclipse 里怎么使用 maven ?

myeclipse10创建maven,pom.xml报错org.apache.maven.archiver.MavenArchiver.getManifest

pom.xml报错,org.apache.maven.archiver.MavenArchiver.getManifest(org.apache.maven.project.MavenProject, org.apache.maven.archiver.MavenArchiveConfiguration)我在百度上搜了方法,在help选 install new sofware 然添加链接。但是下载不来下,还时在报错, ,大神们这怎么解决啊,这个问题困了我两天了,头疼啊!![图片说明](https://img-ask.csdn.net/upload/201901/30/1548860838_416589.png) 难道还跟我用的myeclipse有关吗,我用的时myeclipse10

maven配置私服打包报错Failed to execute goal org.apache.maven.plugins:maven-compiler-plugin:3.5:compile

直接使用阿里云镜像仓库打包没问题,替换为私服镜像仓库后报错: 就是pom.xml中的plugin报错 ``` <plugin> <groupId>org.apache.maven.plugins</groupId> <artifactId>maven-compiler-plugin</artifactId> <version>3.5</version> <configuration> <source>1.8</source> <target>1.8</target> <encoding>UTF-8</encoding> </configuration> </plugin> ``` 网上找了半天说这个指定的jdk版本的问题,查了一下版本没问题都是1.8 报错内容: [ERROR] Failed to execute goal org.apache.maven.plugins:maven-compiler-plugin:3.5:compile (default-compile) on project mytest-web: Execution default-compile of goal org.apache.maven.plugins:maven-compiler-plugin:3.5:compile failed: Plugin org.apache.maven.plugins:maven-compiler-plugin:3.5 or one of its dependencies could not be resolved: Failed to collect dependencies at org.apache.maven.plugins:maven-compiler-plugin:jar:3.5 -> org.apache.maven:maven-toolchain:jar:2.2.1 -> org.apache.maven:maven-core:jar:2.2.1 -> commons-cli:commons-cli:jar:1.2: Failed to read artifact descriptor for commons-cli:commons-cli:jar:1.2: Failure to find org.apache:apache:pom:4 in http://localhost:8081/nexus/content/groups/public/ was cached in the local repository, resolution will not be reattempted until the update interval of public has elapsed or updates are forced -> [Help 1] org.apache.maven.lifecycle.LifecycleExecutionException: Failed to execute goal org.apache.maven.plugins:maven-compiler-plugin:3.5:compile (default-compile) on project mytest-web: Execution default-compile of goal org.apache.maven.plugins:maven-compiler-plugin:3.5:compile failed: Plugin org.apache.maven.plugins:maven-compiler-plugin:3.5 or one of its dependencies could not be resolved: Failed to collect dependencies at org.apache.maven.plugins:maven-compiler-plugin:jar:3.5 -> org.apache.maven:maven-toolchain:jar:2.2.1 -> org.apache.maven:maven-core:jar:2.2.1 -> commons-cli:commons-cli:jar:1.2 at org.apache.maven.lifecycle.internal.MojoExecutor.execute(MojoExecutor.java:213) at org.apache.maven.lifecycle.internal.MojoExecutor.execute(MojoExecutor.java:154) at org.apache.maven.lifecycle.internal.MojoExecutor.execute(MojoExecutor.java:146) at org.apache.maven.lifecycle.internal.LifecycleModuleBuilder.buildProject(LifecycleModuleBuilder.java:117) at org.apache.maven.lifecycle.internal.LifecycleModuleBuilder.buildProject(LifecycleModuleBuilder.java:81) at org.apache.maven.lifecycle.internal.builder.singlethreaded.SingleThreadedBuilder.build(SingleThreadedBuilder.java:51) at org.apache.maven.lifecycle.internal.LifecycleStarter.execute(LifecycleStarter.java:128) at org.apache.maven.DefaultMaven.doExecute(DefaultMaven.java:309) at org.apache.maven.DefaultMaven.doExecute(DefaultMaven.java:194) at org.apache.maven.DefaultMaven.execute(DefaultMaven.java:107) at org.apache.maven.cli.MavenCli.execute(MavenCli.java:993) at org.apache.maven.cli.MavenCli.doMain(MavenCli.java:345) at org.apache.maven.cli.MavenCli.main(MavenCli.java:191) at sun.reflect.NativeMethodAccessorImpl.invoke0(Native Method) at sun.reflect.NativeMethodAccessorImpl.invoke(NativeMethodAccessorImpl.java:62) at sun.reflect.DelegatingMethodAccessorImpl.invoke(DelegatingMethodAccessorImpl.java:43) at java.lang.reflect.Method.invoke(Method.java:498) at org.codehaus.plexus.classworlds.launcher.Launcher.launchEnhanced(Launcher.java:289) at org.codehaus.plexus.classworlds.launcher.Launcher.launch(Launcher.java:229) at org.codehaus.plexus.classworlds.launcher.Launcher.mainWithExitCode(Launcher.java:415) at org.codehaus.plexus.classworlds.launcher.Launcher.main(Launcher.java:356) Caused by: org.apache.maven.plugin.PluginExecutionException: Execution default-compile of goal org.apache.maven.plugins:maven-compiler-plugin:3.5:compile failed: Plugin org.apache.maven.plugins:maven-compiler-plugin:3.5 or one of its dependencies could not be resolved: Failed to collect dependencies at org.apache.maven.plugins:maven-compiler-plugin:jar:3.5 -> org.apache.maven:maven-toolchain:jar:2.2.1 -> org.apache.maven:maven-core:jar:2.2.1 -> commons-cli:commons-cli:jar:1.2 at org.apache.maven.plugin.DefaultBuildPluginManager.executeMojo(DefaultBuildPluginManager.java:106) at org.apache.maven.lifecycle.internal.MojoExecutor.execute(MojoExecutor.java:208) ... 20 more Caused by: org.apache.maven.plugin.PluginResolutionException: Plugin org.apache.maven.plugins:maven-compiler-plugin:3.5 or one of its dependencies could not be resolved: Failed to collect dependencies at org.apache.maven.plugins:maven-compiler-plugin:jar:3.5 -> org.apache.maven:maven-toolchain:jar:2.2.1 -> org.apache.maven:maven-core:jar:2.2.1 -> commons-cli:commons-cli:jar:1.2 at org.apache.maven.plugin.internal.DefaultPluginDependenciesResolver.resolveInternal(DefaultPluginDependenciesResolver.java:214) at org.apache.maven.plugin.internal.DefaultPluginDependenciesResolver.resolve(DefaultPluginDependenciesResolver.java:149) at org.apache.maven.plugin.internal.DefaultMavenPluginManager.createPluginRealm(DefaultMavenPluginManager.java:402) at org.apache.maven.plugin.internal.DefaultMavenPluginManager.setupPluginRealm(DefaultMavenPluginManager.java:374) at org.apache.maven.plugin.DefaultBuildPluginManager.getPluginRealm(DefaultBuildPluginManager.java:231) at org.apache.maven.plugin.DefaultBuildPluginManager.executeMojo(DefaultBuildPluginManager.java:102) ... 21 more Caused by: org.eclipse.aether.collection.DependencyCollectionException: Failed to collect dependencies at org.apache.maven.plugins:maven-compiler-plugin:jar:3.5 -> org.apache.maven:maven-toolchain:jar:2.2.1 -> org.apache.maven:maven-core:jar:2.2.1 -> commons-cli:commons-cli:jar:1.2 at org.eclipse.aether.internal.impl.DefaultDependencyCollector.collectDependencies(DefaultDependencyCollector.java:300) at org.eclipse.aether.internal.impl.DefaultRepositorySystem.collectDependencies(DefaultRepositorySystem.java:325) at org.apache.maven.plugin.internal.DefaultPluginDependenciesResolver.resolveInternal(DefaultPluginDependenciesResolver.java:202) ... 26 more Caused by: org.eclipse.aether.resolution.ArtifactDescriptorException: Failed to read artifact descriptor for commons-cli:commons-cli:jar:1.2 at org.apache.maven.repository.internal.DefaultArtifactDescriptorReader.loadPom(DefaultArtifactDescriptorReader.java:330) at org.apache.maven.repository.internal.DefaultArtifactDescriptorReader.readArtifactDescriptor(DefaultArtifactDescriptorReader.java:199) at org.eclipse.aether.internal.impl.DefaultDependencyCollector.resolveCachedArtifactDescriptor(DefaultDependencyCollector.java:544) at org.eclipse.aether.internal.impl.DefaultDependencyCollector.getArtifactDescriptorResult(DefaultDependencyCollector.java:528) at org.eclipse.aether.internal.impl.DefaultDependencyCollector.processDependency(DefaultDependencyCollector.java:418) at org.eclipse.aether.internal.impl.DefaultDependencyCollector.processDependency(DefaultDependencyCollector.java:372) at org.eclipse.aether.internal.impl.DefaultDependencyCollector.process(DefaultDependencyCollector.java:360) at org.eclipse.aether.internal.impl.DefaultDependencyCollector.doRecurse(DefaultDependencyCollector.java:513) at org.eclipse.aether.internal.impl.DefaultDependencyCollector.processDependency(DefaultDependencyCollector.java:467) at org.eclipse.aether.internal.impl.DefaultDependencyCollector.processDependency(DefaultDependencyCollector.java:372) at org.eclipse.aether.internal.impl.DefaultDependencyCollector.process(DefaultDependencyCollector.java:360) at org.eclipse.aether.internal.impl.DefaultDependencyCollector.doRecurse(DefaultDependencyCollector.java:513) at org.eclipse.aether.internal.impl.DefaultDependencyCollector.processDependency(DefaultDependencyCollector.java:467) at org.eclipse.aether.internal.impl.DefaultDependencyCollector.processDependency(DefaultDependencyCollector.java:372) at org.eclipse.aether.internal.impl.DefaultDependencyCollector.process(DefaultDependencyCollector.java:360) at org.eclipse.aether.internal.impl.DefaultDependencyCollector.collectDependencies(DefaultDependencyCollector.java:263) ... 28 more Caused by: org.apache.maven.model.resolution.UnresolvableModelException: Failure to find org.apache:apache:pom:4 in http://localhost:8081/nexus/content/groups/public/ was cached in the local repository, resolution will not be reattempted until the update interval of public has elapsed or updates are forced at org.apache.maven.repository.internal.DefaultModelResolver.resolveModel(DefaultModelResolver.java:178) at org.apache.maven.repository.internal.DefaultModelResolver.resolveModel(DefaultModelResolver.java:224) at org.apache.maven.model.building.DefaultModelBuilder.readParentExternally(DefaultModelBuilder.java:1051) at org.apache.maven.model.building.DefaultModelBuilder.readParent(DefaultModelBuilder.java:829) at org.apache.maven.model.building.DefaultModelBuilder.build(DefaultModelBuilder.java:331) at org.apache.maven.repository.internal.DefaultArtifactDescriptorReader.loadPom(DefaultArtifactDescriptorReader.java:321) ... 43 more Caused by: org.eclipse.aether.resolution.ArtifactResolutionException: Failure to find org.apache:apache:pom:4 in http://localhost:8081/nexus/content/groups/public/ was cached in the local repository, resolution will not be reattempted until the update interval of public has elapsed or updates are forced at org.eclipse.aether.internal.impl.DefaultArtifactResolver.resolve(DefaultArtifactResolver.java:453) at org.eclipse.aether.internal.impl.DefaultArtifactResolver.resolveArtifacts(DefaultArtifactResolver.java:255) at org.eclipse.aether.internal.impl.DefaultArtifactResolver.resolveArtifact(DefaultArtifactResolver.java:232) at org.apache.maven.repository.internal.DefaultModelResolver.resolveModel(DefaultModelResolver.java:174) ... 48 more Caused by: org.eclipse.aether.transfer.ArtifactNotFoundException: Failure to find org.apache:apache:pom:4 in http://localhost:8081/nexus/content/groups/public/ was cached in the local repository, resolution will not be reattempted until the update interval of public has elapsed or updates are forced at org.eclipse.aether.internal.impl.DefaultUpdateCheckManager.newException(DefaultUpdateCheckManager.java:240) at org.eclipse.aether.internal.impl.DefaultUpdateCheckManager.checkArtifact(DefaultUpdateCheckManager.java:215) at org.eclipse.aether.internal.impl.DefaultArtifactResolver.gatherDownloads(DefaultArtifactResolver.java:594) at org.eclipse.aether.internal.impl.DefaultArtifactResolver.performDownloads(DefaultArtifactResolver.java:512) at org.eclipse.aether.internal.impl.DefaultArtifactResolver.resolve(DefaultArtifactResolver.java:430) ... 51 more [ERROR] [ERROR] Re-run Maven using the -X switch to enable full debug logging. [ERROR] [ERROR] For more information about the errors and possible solutions, please read the following articles: [ERROR] [Help 1] http://cwiki.apache.org/confluence/display/MAVEN/PluginResolutionException

用maven进行install的时候报错Error injecting: org.apache.maven.plugin.install.InstallMojo

[code="java"] ------------------------------------------------------- T E S T S ------------------------------------------------------- There are no tests to run. Results : Tests run: 0, Failures: 0, Errors: 0, Skipped: 0 [INFO] [INFO] --- maven-war-plugin:2.1.1:war (default-war) @ llemaicai --- [INFO] Packaging webapp [INFO] Assembling webapp [llemaicai] in [E:\dev\maicai\pro\llemaicai\target\llemaicai] [INFO] Processing war project [INFO] Copying webapp resources [E:\dev\maicai\pro\llemaicai\src\main\webapp] [INFO] Webapp assembled in [35 msecs] [INFO] Building war: E:\dev\maicai\pro\llemaicai\target\llemaicai.war [WARNING] Warning: selected war files include a WEB-INF/web.xml which will be ignored (webxml attribute is missing from war task, or ignoreWebxml attribute is specified as 'true') [INFO] [INFO] --- maven-install-plugin:2.3.1:install (default-install) @ llemaicai --- [WARNING] The POM for org.codehaus.plexus:plexus-digest:jar:1.0 is invalid, transitive dependencies (if any) will not be available, enable debug logging for more details 2013-2-20 14:41:14 org.sonatype.guice.bean.reflect.LoadedClass 警告: Error injecting: org.apache.maven.plugin.install.InstallMojo java.lang.NoClassDefFoundError: org/codehaus/plexus/digest/DigesterException at java.lang.Class.getDeclaredConstructors0(Native Method) at java.lang.Class.privateGetDeclaredConstructors(Class.java:2389) at java.lang.Class.getDeclaredConstructors(Class.java:1836) at com.google.inject.spi.InjectionPoint.forConstructorOf(InjectionPoint.java:243) at com.google.inject.internal.ConstructorBindingImpl.create(ConstructorBindingImpl.java:96) at com.google.inject.internal.InjectorImpl.createUninitializedBinding(InjectorImpl.java:628) at com.google.inject.internal.InjectorImpl.createJustInTimeBinding(InjectorImpl.java:835) at com.google.inject.internal.InjectorImpl.createJustInTimeBindingRecursive(InjectorImpl.java:769) at com.google.inject.internal.InjectorImpl.getJustInTimeBinding(InjectorImpl.java:254) at com.google.inject.internal.InjectorImpl.getBindingOrThrow(InjectorImpl.java:205) at com.google.inject.internal.InjectorImpl.getInternalFactory(InjectorImpl.java:843) at com.google.inject.internal.InjectorImpl.getProviderOrThrow(InjectorImpl.java:957) at com.google.inject.internal.InjectorImpl.getProvider(InjectorImpl.java:990) at com.google.inject.internal.InjectorImpl.getProvider(InjectorImpl.java:951) at com.google.inject.internal.InjectorImpl.getInstance(InjectorImpl.java:1003) at org.sonatype.guice.bean.reflect.AbstractDeferredClass.get(AbstractDeferredClass.java:47) at com.google.inject.internal.InternalFactoryToProviderAdapter.get(InternalFactoryToProviderAdapter.java:40) at com.google.inject.internal.InjectorImpl$4$1.call(InjectorImpl.java:968) at com.google.inject.internal.InjectorImpl.callInContext(InjectorImpl.java:1014) at com.google.inject.internal.InjectorImpl$4.get(InjectorImpl.java:964) at com.google.inject.Scopes$1$1.get(Scopes.java:59) at org.sonatype.guice.bean.locators.LazyBeanEntry.getValue(LazyBeanEntry.java:79) at org.sonatype.guice.plexus.locators.LazyPlexusBean.getValue(LazyPlexusBean.java:53) at org.codehaus.plexus.DefaultPlexusContainer.lookup(DefaultPlexusContainer.java:243) at org.codehaus.plexus.DefaultPlexusContainer.lookup(DefaultPlexusContainer.java:235) at org.apache.maven.plugin.internal.DefaultMavenPluginManager.getConfiguredMojo(DefaultMavenPluginManager.java:455) at org.apache.maven.plugin.DefaultBuildPluginManager.executeMojo(DefaultBuildPluginManager.java:92) at org.apache.maven.lifecycle.internal.MojoExecutor.execute(MojoExecutor.java:209) at org.apache.maven.lifecycle.internal.MojoExecutor.execute(MojoExecutor.java:153) at org.apache.maven.lifecycle.internal.MojoExecutor.execute(MojoExecutor.java:145) at org.apache.maven.lifecycle.internal.LifecycleModuleBuilder.buildProject(LifecycleModuleBuilder.java:84) at org.apache.maven.lifecycle.internal.LifecycleModuleBuilder.buildProject(LifecycleModuleBuilder.java:59) at org.apache.maven.lifecycle.internal.LifecycleStarter.singleThreadedBuild(LifecycleStarter.java:183) at org.apache.maven.lifecycle.internal.LifecycleStarter.execute(LifecycleStarter.java:161) at org.apache.maven.DefaultMaven.doExecute(DefaultMaven.java:319) at org.apache.maven.DefaultMaven.execute(DefaultMaven.java:156) at org.apache.maven.cli.MavenCli.execute(MavenCli.java:537) at org.apache.maven.cli.MavenCli.doMain(MavenCli.java:196) at org.apache.maven.cli.MavenCli.main(MavenCli.java:141) at sun.reflect.NativeMethodAccessorImpl.invoke0(Native Method) at sun.reflect.NativeMethodAccessorImpl.invoke(NativeMethodAccessorImpl.java:39) at sun.reflect.DelegatingMethodAccessorImpl.invoke(DelegatingMethodAccessorImpl.java:25) at java.lang.reflect.Method.invoke(Method.java:597) at org.codehaus.plexus.classworlds.launcher.Launcher.launchEnhanced(Launcher.java:290) at org.codehaus.plexus.classworlds.launcher.Launcher.launch(Launcher.java:230) at org.codehaus.plexus.classworlds.launcher.Launcher.mainWithExitCode(Launcher.java:409) at org.codehaus.plexus.classworlds.launcher.Launcher.main(Launcher.java:352) Caused by: java.lang.ClassNotFoundException: org.codehaus.plexus.digest.DigesterException at org.codehaus.plexus.classworlds.strategy.SelfFirstStrategy.loadClass(SelfFirstStrategy.java:50) at org.codehaus.plexus.classworlds.realm.ClassRealm.loadClass(ClassRealm.java:244) at org.codehaus.plexus.classworlds.realm.ClassRealm.loadClass(ClassRealm.java:230) ... 47 more [INFO] ------------------------------------------------------------------------ [INFO] BUILD FAILURE [INFO] ------------------------------------------------------------------------ [INFO] Total time: 1.669s [INFO] Finished at: Wed Feb 20 14:41:14 CST 2013 [INFO] Final Memory: 4M/15M [INFO] ------------------------------------------------------------------------ [ERROR] Failed to execute goal org.apache.maven.plugins:maven-install-plugin:2.3.1:install (default-install) on project llemaicai: Execution default-install of goal org.apache.maven.plugins:maven-install-plugin:2.3.1:install failed: Unable to load the mojo 'install' in the plugin 'org.apache.maven.plugins:maven-install-plugin:2.3.1'. A required class is missing: org/codehaus/plexus/digest/DigesterException [ERROR] ----------------------------------------------------- [ERROR] realm = plugin>org.apache.maven.plugins:maven-install-plugin:2.3.1 [ERROR] strategy = org.codehaus.plexus.classworlds.strategy.SelfFirstStrategy [ERROR] urls[0] = file:/D:/javalib/repository/org/apache/maven/plugins/maven-install-plugin/2.3.1/maven-install-plugin-2.3.1.jar [ERROR] urls[1] = file:/D:/javalib/repository/junit/junit/3.8.1/junit-3.8.1.jar [ERROR] urls[2] = file:/D:/javalib/repository/org/codehaus/plexus/plexus-utils/2.0.5/plexus-utils-2.0.5.jar [ERROR] urls[3] = file:/D:/javalib/repository/org/codehaus/plexus/plexus-digest/1.0/plexus-digest-1.0.jar [ERROR] Number of foreign imports: 1 [ERROR] import: Entry[import from realm ClassRealm[maven.api, parent: null]] [ERROR] [ERROR] -----------------------------------------------------: org.codehaus.plexus.digest.DigesterException [ERROR] -> [Help 1] [ERROR] [ERROR] To see the full stack trace of the errors, re-run Maven with the -e switch. [ERROR] Re-run Maven using the -X switch to enable full debug logging. [ERROR] [ERROR] For more information about the errors and possible solutions, please read the following articles: [ERROR] [Help 1] http://cwiki.apache.org/confluence/display/MAVEN/PluginContainerException [/code]

请问为什么maven项目的setting.xml要复制一份在C盘的.m2的文件下面啊?

请问为什么maven项目的setting.xml要复制一份在C盘的.m2的文件下面啊?

org.apache.maven.plugins:maven-compiler.plugin:3.8.1包无法添加?

![图片说明](https://img-ask.csdn.net/upload/202003/14/1584147761_775843.png) idea建springboot项目,目前一切都能运行,但右侧 maven栏一直提示 org.apache.maven.plugins:maven-compiler.plugin:3.8.1包没有,一直也无法添加和下载,改怎么办

pom文件中引用org.apache.maven.plugins报错

错误:Plugin execution not covered by lifecycle configuration: org.apache.maven.plugins:maven-compiler-plugin:3.1:testCompile (execution: default-testCompile, phase: test-compile)

jenkins maven远程部署

![图片说明](https://img-ask.csdn.net/upload/201710/27/1509087429_618686.png) ![图片说明](https://img-ask.csdn.net/upload/201710/27/1509087443_359545.png) ![图片说明](https://img-ask.csdn.net/upload/201710/27/1509087453_672195.png) ![图片说明](https://img-ask.csdn.net/upload/201710/27/1509087461_96994.png) 大佬们这个错误是什么鬼。。。说我maven里面没有 但是有啊 我没有弄私服 这个repository 是我将我w7电脑上的打包解压到liunx的 个人感觉是这个repository有问题。但是我也不知道错在哪里 ``` Building in workspace /root/.jenkins/workspace/yht_user_web Reverting /root/.jenkins/workspace/yht_user_web/. to depth infinity with ignoreExternals: true Updating svn://120.27.216.28/svn/yht/yht_user/yht_user_web at revision '2017-10-27T14:37:21.785 +0800' Using sole credentials lidingpeng/****** in realm ‘<svn://120.27.216.28:3690> /my/svn/svnrepos’ At revision 32 No changes for svn://120.27.216.28/svn/yht/yht_user/yht_user_web since the previous build Parsing POMs ERROR: Failed to parse POMs org.apache.maven.project.ProjectBuildingException: Some problems were encountered while processing the POMs: [FATAL] Non-resolvable parent POM: Could not find artifact com.yht.user:yht_user:pom:0.0.1-SNAPSHOT and 'parent.relativePath' points at wrong local POM @ line 4, column 10 at org.apache.maven.project.DefaultProjectBuilder.build(DefaultProjectBuilder.java:364) at hudson.maven.MavenEmbedder.buildProjects(MavenEmbedder.java:361) at hudson.maven.MavenEmbedder.readProjects(MavenEmbedder.java:331) at hudson.maven.MavenModuleSetBuild$PomParser.invoke(MavenModuleSetBuild.java:1328) at hudson.maven.MavenModuleSetBuild$PomParser.invoke(MavenModuleSetBuild.java:1125) at hudson.FilePath.act(FilePath.java:1018) at hudson.FilePath.act(FilePath.java:996) at hudson.maven.MavenModuleSetBuild$MavenModuleSetBuildExecution.parsePoms(MavenModuleSetBuild.java:986) at hudson.maven.MavenModuleSetBuild$MavenModuleSetBuildExecution.doRun(MavenModuleSetBuild.java:691) at hudson.model.AbstractBuild$AbstractBuildExecution.run(AbstractBuild.java:534) at hudson.model.Run.execute(Run.java:1741) at hudson.maven.MavenModuleSetBuild.run(MavenModuleSetBuild.java:543) at hudson.model.ResourceController.execute(ResourceController.java:98) at hudson.model.Executor.run(Executor.java:410) Finished: FAILURE ```

无法执行目标org.apache.maven.plugins:maven-war-plugin:2.2:war(default-war)项目simpleSpringRestWeb:组装WAR时出错:webxml

<div class="post-text" itemprop="text"> <p>Im trying to setup everything so I could run a <strong>code coverage on maven</strong> and after creating a report with it I wanted to view the <strong>results on sonarQube dashboard</strong>.</p> <p>Im a complete newbie on those tools so I was trying to research and managed to get some tutorials to get things running. SonarQube is working fine although code coverage is not. </p> <p>(the code is mostly in php with some css, etc...)</p> <p>Im Using: <strong>Apache Maven 3.6.0</strong>, <strong>SonarQube 7.5</strong>, <strong>PHP 7.3.1</strong>, <strong>jacoco 0.8.3</strong>, <strong>coverage</strong>.<br> (I think thats all)</p> <p><strong>My POM file:</strong></p> <pre><code>&lt;project xmlns="http://maven.apache.org/POM/4.0.0" xmlns:xsi="http://www.w3.org/2001/XMLSchema-instance" xsi:schemaLocation="http://maven.apache.org/POM/4.0.0 http://maven.apache.org/xsd/maven-4.0.0.xsd"&gt; &lt;modelVersion&gt;4.0.0&lt;/modelVersion&gt; &lt;modelVersion&gt;4.0.0&lt;/modelVersion&gt; &lt;groupId&gt;com.mytutorial&lt;/groupId&gt; &lt;artifactId&gt;simpleSpringRestWeb&lt;/artifactId&gt; &lt;version&gt;1.0-SNAPSHOT&lt;/version&gt; &lt;packaging&gt;war&lt;/packaging&gt; &lt;name&gt;simpleSpringRestWeb&lt;/name&gt; &lt;url&gt;http://maven.apache.org&lt;/url&gt; &lt;properties&gt; &lt;javac.src.version&gt;1.7&lt;/javac.src.version&gt; &lt;javac.target.version&gt;1.7&lt;/javac.target.version&gt; &lt;test.coverage.rate&gt;100&lt;/test.coverage.rate&gt; &lt;cobertura.skip&gt;false&lt;/cobertura.skip&gt; &lt;cobertura.skip&gt;false&lt;/cobertura.skip&gt; &lt;/properties&gt; &lt;dependencies&gt; &lt;dependency&gt; &lt;groupId&gt;net.sourceforge.cobertura&lt;/groupId&gt; &lt;artifactId&gt;cobertura&lt;/artifactId&gt; &lt;version&gt;2.1.1&lt;/version&gt; &lt;scope&gt;test&lt;/scope&gt; &lt;/dependency&gt; &lt;dependency&gt; &lt;groupId&gt;org.codehaus.mojo&lt;/groupId&gt; &lt;artifactId&gt;cobertura-maven-plugin&lt;/artifactId&gt; &lt;version&gt;2.7&lt;/version&gt; &lt;scope&gt;test&lt;/scope&gt; &lt;/dependency&gt; &lt;/dependencies&gt; &lt;reporting&gt; &lt;plugins&gt; &lt;plugin&gt; &lt;groupId&gt;org.apache.maven.plugins&lt;/groupId&gt; &lt;artifactId&gt;maven-project-info-reports-plugin&lt;/artifactId&gt; &lt;version&gt;2.7&lt;/version&gt; &lt;configuration&gt; &lt;dependencyLocationsEnabled&gt;false&lt;/dependencyLocationsEnabled&gt; &lt;/configuration&gt; &lt;/plugin&gt; &lt;plugin&gt; &lt;groupId&gt;org.apache.maven.plugins&lt;/groupId&gt; &lt;artifactId&gt;maven-war-plugin&lt;/artifactId&gt; &lt;version&gt;3.2.2&lt;/version&gt; &lt;configuration&gt; &lt;failOnMissingWebXml&gt;false&lt;/failOnMissingWebXml&gt; &lt;/configuration&gt; &lt;/plugin&gt; &lt;plugin&gt; &lt;groupId&gt;org.apache.maven.plugins&lt;/groupId&gt; &lt;artifactId&gt;maven-surefire-plugin&lt;/artifactId&gt; &lt;version&gt;3.0.0-M3&lt;/version&gt; &lt;/plugin&gt; &lt;plugin&gt; &lt;groupId&gt;org.apache.maven.plugins&lt;/groupId&gt; &lt;artifactId&gt;maven-site-plugin&lt;/artifactId&gt; &lt;version&gt;3.7.1&lt;/version&gt; &lt;/plugin&gt; &lt;plugin&gt; &lt;groupId&gt;org.codehaus.mojo&lt;/groupId&gt; &lt;artifactId&gt;cobertura-maven-plugin&lt;/artifactId&gt; &lt;version&gt;2.7&lt;/version&gt; &lt;configuration&gt; &lt;formats&gt; &lt;format&gt;xml&lt;/format&gt; &lt;format&gt;html&lt;/format&gt; &lt;/formats&gt; &lt;/configuration&gt; &lt;reportSets&gt; &lt;reportSet&gt; &lt;id&gt;cobertura-report&lt;/id&gt; &lt;reports&gt; &lt;report&gt;clean&lt;/report&gt; &lt;report&gt;cobertura&lt;/report&gt; &lt;/reports&gt; &lt;/reportSet&gt; &lt;/reportSets&gt; &lt;/plugin&gt; &lt;/plugins&gt; </code></pre> <p> </p> <p><strong>sonar-project.properties:</strong><br> -Dproject.settings=./sonar-project.properties<br> sonar.cobertura.reportPaths=C:/simple-maven-project-with-tests-master/target/surefire-reports</p> <p>using <code>mvn install</code> results in Build Failure<br> <a href="https://i.stack.imgur.com/AsQNn.png" rel="nofollow noreferrer">mvn install output1</a> <a href="https://i.stack.imgur.com/ePF9t.png" rel="nofollow noreferrer">mvn install output2</a></p> <p>using <code>mvn clean package</code> results in Build Failure<br> <a href="https://i.stack.imgur.com/fPzgV.png" rel="nofollow noreferrer">mvn clean package output1</a> <a href="https://i.stack.imgur.com/q6urg.png" rel="nofollow noreferrer">mvn clean package output2</a></p> <p>used someone tip (link below) <code>mvn -Dmaven.test.skip=true your-plugin:your-goal</code> <a href="https://i.stack.imgur.com/AUyHc.png" rel="nofollow noreferrer">output result</a></p> <blockquote> <p><a href="https://stackoverflow.com/questions/8803073/how-to-run-a-maven-goal-when-there-is-tests-failures">How to run a maven goal when there is tests failures?</a></p> </blockquote> <hr> <p>I already searched everywhere I could, managed to fix some problems but this one... not at all. I have been tryng to get a solution for days now and at this point Im too confused and dont know what else I can do.</p> <p>Sorry for the long post and please notice me if I didnt give any important information.</p> <p>Regards!</p> </div>

创建Maven项目 pom.xml文件报错

创建maven项目 pom.xml文件提示错误: Failure to transfer org.apache.maven.surefire:surefire:pom:2.10 from http://repo.maven.apache.org/maven2 was cached in the local repository, resolution will not be reattempted until the update interval of central has elapsed or updates are forced. Original error: Could not transfer artifact org.apache.maven.surefire:surefire:pom:2.10 from/to central (http://repo.maven.apache.org/maven2): java.net.ConnectException: connection timed out to http://repo.maven.apache.org/maven2/org/apache/maven/surefire/surefire/2.10/surefire-2.10.pom 在网上搜索后给出的解决方法是 打开maven的本地库...\repository\org\apache\maven\plugins\maven-surefire-plugin\2.10会发现:里面少只有一个maven-surefire-plugin-2.10.pom.lastUpdated,而没有maven-surefire-plugin-2.10.jar 解决方法: 1.删除maven-surefire-plugin-2.7.1.pom.lastUpdated文件 2.右键点击project -> Maven - Update Dependencies 但我的本地库有aven-surefire-plugin-2.10.jar以及相关文件 没有maven-surefire-plugin-2.10.pom.lastUpdated文件 怎么还报这样的错误 在网上搜索好长时间 一直没有解决 求大神指点!! 谢谢

关于ideal2019版本配置maven问题

![图片说明](https://img-ask.csdn.net/upload/201909/13/1568352987_566484.png) 今天配置idea时候,我是用的是idea2019版本以及maven3.6的版本,以前用的是老版本没有问题,但是我觉得这不是版本的问题存在,我在cmd里面输入命令mvn -v是没有任何问题的系统可以看见![图片说明](https://img-ask.csdn.net/upload/201909/13/1568353130_795335.png) 但是一创建maven项目以后就报这个错误,我真的很无助,昨晚已经搞了好久,今天又重新安装了一遍maven还是不行,能给各位大佬提供解决思路的唯有我的错误日志,![图片说明](https://img-ask.csdn.net/upload/201909/13/1568353190_197996.png) 而且我确定一定以及肯定是,我的maven的本地仓库配置以及ideal里面maven版本的地址没有一点的问题。 1) No implementation for org.apache.maven.model.path.PathTranslator was bound. while locating org.apache.maven.model.path.PathTranslator for field at org.apache.maven.model.interpolation.AbstractStringBasedModelInterpolator.pathTranslator(Unknown Source) at org.codehaus.plexus.DefaultPlexusContainer$1.configure(DefaultPlexusContainer.java:350) 2) No implementation for org.apache.maven.model.path.UrlNormalizer was bound. while locating org.apache.maven.model.path.UrlNormalizer for field at org.apache.maven.model.interpolation.AbstractStringBasedModelInterpolator.urlNormalizer(Unknown Source) at org.codehaus.plexus.DefaultPlexusContainer$1.configure(DefaultPlexusContainer.java:350) 2 errors java.lang.RuntimeException: com.google.inject.CreationException: Unable to create injector, see the following errors: 1) No implementation for org.apache.maven.model.path.PathTranslator was bound. while locating org.apache.maven.model.path.PathTranslator for field at org.apache.maven.model.interpolation.AbstractStringBasedModelInterpolator.pathTranslator(Unknown Source) at org.codehaus.plexus.DefaultPlexusContainer$1.configure(DefaultPlexusContainer.java:350) 2) No implementation for org.apache.maven.model.path.UrlNormalizer was bound. while locating org.apache.maven.model.path.UrlNormalizer for field at org.apache.maven.model.interpolation.AbstractStringBasedModelInterpolator.urlNormalizer(Unknown Source) at org.codehaus.plexus.DefaultPlexusContainer$1.configure(DefaultPlexusContainer.java:350) 2 errors at com.google.inject.internal.Errors.throwCreationExceptionIfErrorsExist(Errors.java:543) at com.google.inject.internal.InternalInjectorCreator.initializeStatically(InternalInjectorCreator.java:159) at com.google.inject.internal.InternalInjectorCreator.build(InternalInjectorCreator.java:106) at com.google.inject.Guice.createInjector(Guice.java:87) at com.google.inject.Guice.createInjector(Guice.java:69) at com.google.inject.Guice.createInjector(Guice.java:59) at org.codehaus.plexus.DefaultPlexusContainer.addComponent(DefaultPlexusContainer.java:344) at org.codehaus.plexus.DefaultPlexusContainer.addComponent(DefaultPlexusContainer.java:332) at org.jetbrains.idea.maven.server.Maven3XServerEmbedder.customizeComponents(Maven3XServerEmbedder.java:573) at org.jetbrains.idea.maven.server.Maven3XServerEmbedder.customize(Maven3XServerEmbedder.java:542) at java.base/jdk.internal.reflect.NativeMethodAccessorImpl.invoke0(Native Method) at java.base/jdk.internal.reflect.NativeMethodAccessorImpl.invoke(NativeMethodAccessorImpl.java:62) at java.base/jdk.internal.reflect.DelegatingMethodAccessorImpl.invoke(DelegatingMethodAccessorImpl.java:43) at java.base/java.lang.reflect.Method.invoke(Method.java:566) at java.rmi/sun.rmi.server.UnicastServerRef.dispatch(UnicastServerRef.java:359) at java.rmi/sun.rmi.transport.Transport$1.run(Transport.java:200) at java.rmi/sun.rmi.transport.Transport$1.run(Transport.java:197) at java.base/java.security.AccessController.doPrivileged(Native Method) at java.rmi/sun.rmi.transport.Transport.serviceCall(Transport.java:196) at java.rmi/sun.rmi.transport.tcp.TCPTransport.handleMessages(TCPTransport.java:562) at java.rmi/sun.rmi.transport.tcp.TCPTransport$ConnectionHandler.run0(TCPTransport.java:796) at java.rmi/sun.rmi.transport.tcp.TCPTransport$ConnectionHandler.lambda$run$0(TCPTransport.java:677) at java.base/java.security.AccessController.doPrivileged(Native Method) at java.rmi/sun.rmi.transport.tcp.TCPTransport$ConnectionHandler.run(TCPTransport.java:676) at java.base/java.util.concurrent.ThreadPoolExecutor.runWorker(ThreadPoolExecutor.java:1128) at java.base/java.util.concurrent.ThreadPoolExecutor$Worker.run(ThreadPoolExecutor.java:628) at java.base/java.lang.Thread.run(Thread.java:834) at java.rmi/sun.rmi.transport.StreamRemoteCall.exceptionReceivedFromServer(StreamRemoteCall.java:283) at java.rmi/sun.rmi.transport.StreamRemoteCall.executeCall(StreamRemoteCall.java:260) at java.rmi/sun.rmi.server.UnicastRef.invoke(UnicastRef.java:161) at java.rmi/java.rmi.server.RemoteObjectInvocationHandler.invokeRemoteMethod(RemoteObjectInvocationHandler.java:209) at java.rmi/java.rmi.server.RemoteObjectInvocationHandler.invoke(RemoteObjectInvocationHandler.java:161) at com.sun.proxy.$Proxy135.customize(Unknown Source) at java.base/jdk.internal.reflect.NativeMethodAccessorImpl.invoke0(Native Method) at java.base/jdk.internal.reflect.NativeMethodAccessorImpl.invoke(NativeMethodAccessorImpl.java:62) at java.base/jdk.internal.reflect.DelegatingMethodAccessorImpl.invoke(DelegatingMethodAccessorImpl.java:43) at java.base/java.lang.reflect.Method.invoke(Method.java:566) at com.intellij.execution.rmi.RemoteUtil.invokeRemote(RemoteUtil.java:175) at com.intellij.execution.rmi.RemoteUtil.access$200(RemoteUtil.java:38) at com.intellij.execution.rmi.RemoteUtil$1$1$1.compute(RemoteUtil.java:156) at com.intellij.openapi.util.ClassLoaderUtil.computeWithClassLoader(ClassLoaderUtil.java:45) at com.intellij.execution.rmi.RemoteUtil.executeWithClassLoader(RemoteUtil.java:227) at com.intellij.execution.rmi.RemoteUtil$1$1.invoke(RemoteUtil.java:153) at com.sun.proxy.$Proxy135.customize(Unknown Source) at org.jetbrains.idea.maven.server.MavenEmbedderWrapper.doCustomize(MavenEmbedderWrapper.java:92) at org.jetbrains.idea.maven.server.MavenEmbedderWrapper.lambda$customizeForResolve$1(MavenEmbedderWrapper.java:65) at org.jetbrains.idea.maven.server.RemoteObjectWrapper.perform(RemoteObjectWrapper.java:76) at org.jetbrains.idea.maven.server.MavenEmbedderWrapper.customizeForResolve(MavenEmbedderWrapper.java:64) at org.jetbrains.idea.maven.project.MavenProjectsTree.resolve(MavenProjectsTree.java:1261) at org.jetbrains.idea.maven.project.MavenProjectsProcessorResolvingTask.perform(MavenProjectsProcessorResolvingTask.java:45) at org.jetbrains.idea.maven.project.MavenProjectsProcessor.doProcessPendingTasks(MavenProjectsProcessor.java:140) at org.jetbrains.idea.maven.project.MavenProjectsProcessor.access$000(MavenProjectsProcessor.java:33) at org.jetbrains.idea.maven.project.MavenProjectsProcessor$2.run(MavenProjectsProcessor.java:114) at org.jetbrains.idea.maven.utils.MavenUtil.lambda$runInBackground$5(MavenUtil.java:468) at com.intellij.openapi.application.impl.ApplicationImpl$1.run(ApplicationImpl.java:294) at java.base/java.util.concurrent.Executors$RunnableAdapter.call(Executors.java:515) at java.base/java.util.concurrent.FutureTask.run(FutureTask.java:264) at java.base/java.util.concurrent.ThreadPoolExecutor.runWorker(ThreadPoolExecutor.java:1128) at java.base/java.util.concurrent.ThreadPoolExecutor$Worker.run(ThreadPoolExecutor.java:628) at java.base/java.lang.Thread.run(Thread.java:834) 这么说吧,如若帮我解决了这个问题,微信加我 我给你发个红包算是我的心意了,求求大佬们,好无助,解决了好久没

maven 打包报如下错误

org.apache.maven.lifecycle.LifecycleExecutionException: Failed to execute goal org.apache.maven.plugins:maven-compiler-plugin:2.5.1:compile (default-compile) on project ship-base-web: Compilation failure at org.apache.maven.lifecycle.internal.MojoExecutor.execute(MojoExecutor.java:212) at org.apache.maven.lifecycle.internal.MojoExecutor.execute(MojoExecutor.java:153) at org.apache.maven.lifecycle.internal.MojoExecutor.execute(MojoExecutor.java:145) at org.apache.maven.lifecycle.internal.LifecycleModuleBuilder.buildProject(LifecycleModuleBuilder.java:116) at org.apache.maven.lifecycle.internal.LifecycleModuleBuilder.buildProject(LifecycleModuleBuilder.java:80) at org.apache.maven.lifecycle.internal.builder.singlethreaded.SingleThreadedBuilder.build(SingleThreadedBuilder.java:51) at org.apache.maven.lifecycle.internal.LifecycleStarter.execute(LifecycleStarter.java:128) at org.apache.maven.DefaultMaven.doExecute(DefaultMaven.java:307) at org.apache.maven.DefaultMaven.doExecute(DefaultMaven.java:193) at org.apache.maven.DefaultMaven.execute(DefaultMaven.java:106) at org.apache.maven.cli.MavenCli.execute(MavenCli.java:862) at org.apache.maven.cli.MavenCli.doMain(MavenCli.java:286) at org.apache.maven.cli.MavenCli.main(MavenCli.java:197) at sun.reflect.NativeMethodAccessorImpl.invoke0(Native Method) at sun.reflect.NativeMethodAccessorImpl.invoke(NativeMethodAccessorImpl.java:57) at sun.reflect.DelegatingMethodAccessorImpl.invoke(DelegatingMethodAccessorImpl.java:43) at java.lang.reflect.Method.invoke(Method.java:606) at org.codehaus.plexus.classworlds.launcher.Launcher.launchEnhanced(Launcher.java:289) at org.codehaus.plexus.classworlds.launcher.Launcher.launch(Launcher.java:229) at org.codehaus.plexus.classworlds.launcher.Launcher.mainWithExitCode(Launcher.java:415) at org.codehaus.plexus.classworlds.launcher.Launcher.main(Launcher.java:356) Caused by: org.apache.maven.plugin.CompilationFailureException: Compilation failure at org.apache.maven.plugin.AbstractCompilerMojo.execute(AbstractCompilerMojo.java:729) at org.apache.maven.plugin.CompilerMojo.execute(CompilerMojo.java:128) at org.apache.maven.plugin.DefaultBuildPluginManager.executeMojo(DefaultBuildPluginManager.java:134) at org.apache.maven.lifecycle.internal.MojoExecutor.execute(MojoExecutor.java:208) ... 20 more [ERROR] [ERROR] Re-run Maven using the -X switch to enable full debug logging. [ERROR] [ERROR] For more information about the errors and possible solutions, please read the following articles: [ERROR] [Help 1] http://cwiki.apache.org/confluence/display/MAVEN/MojoFailureException

eclipse 中创建Maven 报错,求解决方案

CoreException: Could not calculate build plan: Plugin org.apache.maven.plugins:maven-compiler-plugin:3.1 or one of its dependencies could not be resolved: Failed to read artifact descriptor for org.apache.maven.plugins:maven-compiler-plugin:jar:3.1: ArtifactResolutionException: Failure to transfer org.apache.maven.plugins:maven-compiler-plugin:pom:3.1 from https://repo.maven.apache.org/maven2 was cached in the local repository, resolution will not be reattempted until the update interval of central has elapsed or updates are forced. Original error: Could not transfer artifact org.apache.maven.plugins:maven-compiler-plugin:pom:3.1 from/to central (https://repo.maven.apache.org/maven2): repo.maven.apache.org

maven打包本地jar包出现问题,求解答

maven本地仓库install外部的jar包,出现这个错误 [WARNING] Failed to retrieve plugin descriptor for org.apache.maven.plugins:maven-clean-plugin:2.5: Plugin org.apache.maven.plugins:maven-clean-plugin:2.5 or one of its dependencies could not be resolved: Failed to read artifact descriptor for org.apache.maven.plugins:maven-clean-plugin:jar:2.5 Downloading from central: https://repo.maven.apache.org/maven2/org/apache/maven/plugins/maven-install-plugin/2.4/maven-install-plugin-2.4.pom [WARNING] Failed to retrieve plugin descriptor for org.apache.maven.plugins:maven-install-plugin:2.4: Plugin org.apache.maven.plugins:maven-install-plugin:2.4 or one of its dependencies could not be resolved: Failed to read artifact descriptor for org.apache.maven.plugins:maven-install-plugin:jar:2.4 Downloading from central: https://repo.maven.apache.org/maven2/org/apache/maven/plugins/maven-site-plugin/3.3/maven-site-plugin-3.3.pom [WARNING] Failed to retrieve plugin descriptor for org.apache.maven.plugins:maven-site-plugin:3.3: Plugin org.apache.maven.plugins:maven-site-plugin:3.3 or one of its dependencies could not be resolved: Failed to read artifact descriptor for org.apache.maven.plugins:maven-site-plugin:jar:3.3 Downloading from central: https://repo.maven.apache.org/maven2/org/apache/maven/plugins/maven-antrun-plugin/1.3/maven-antrun-plugin-1.3.pom [WARNING] Failed to retrieve plugin descriptor for org.apache.maven.plugins:maven-antrun-plugin:1.3: Plugin org.apache.maven.plugins:maven-antrun-plugin:1.3 or one of its dependencies could not be resolved: Failed to read artifact descriptor for org.apache.maven.plugins:maven-antrun-plugin:jar:1.3 Downloading from central: https://repo.maven.apache.org/maven2/org/apache/maven/plugins/maven-assembly-plugin/2.2-beta-5/maven-assembly-plugin-2.2-beta-5.pom [WARNING] Failed to retrieve plugin descriptor for org.apache.maven.plugins:maven-assembly-plugin:2.2-beta-5: Plugin org.apache.maven.plugins:maven-assembly-plugin:2.2-beta-5 or one of its dependencies could not be resolved: Failed to read artifact descriptor for org.apache.maven.plugins:maven-assembly-plugin:jar:2.2-beta-5 Downloading from central: https://repo.maven.apache.org/maven2/org/apache/maven/plugins/maven-dependency-plugin/2.8/maven-dependency-plugin-2.8.pom [WARNING] Failed to retrieve plugin descriptor for org.apache.maven.plugins:maven-dependency-plugin:2.8: Plugin org.apache.maven.plugins:maven-dependency-plugin:2.8 or one of its dependencies could not be resolved: Failed to read artifact descriptor for org.apache.maven.plugins:maven-dependency-plugin:jar:2.8 Downloading from central: https://repo.maven.apache.org/maven2/org/apache/maven/plugins/maven-release-plugin/2.5.3/maven-release-plugin-2.5.3.pom [WARNING] Failed to retrieve plugin descriptor for org.apache.maven.plugins:maven-release-plugin:2.5.3: Plugin org.apache.maven.plugins:maven-release-plugin:2.5.3 or one of its dependencies could not be resolved: Failed to read artifact descriptor for org.apache.maven.plugins:maven-release-plugin:jar:2.5.3 Downloading from central: https://repo.maven.apache.org/maven2/org/codehaus/mojo/maven-metadata.xml Downloading from central: https://repo.maven.apache.org/maven2/org/apache/maven/plugins/maven-metadata.xml [WARNING] Could not transfer metadata org.apache.maven.plugins/maven-metadata.xml from/to central (https://repo.maven.apache.org/maven2): Received fatal alert: protocol_version [WARNING] Could not transfer metadata org.codehaus.mojo/maven-metadata.xml from/to central (https://repo.maven.apache.org/maven2): Received fatal alert: protocol_version [WARNING] Failure to transfer org.apache.maven.plugins/maven-metadata.xml from https://repo.maven.apache.org/maven2 was cached in the local repository, resolution will not be reattempted until the update interval of central has elapsed or updates are forced. Original error: Could not transfer metadata org.apache.maven.plugins/maven-metadata.xml from/to central (https://repo.maven.apache.org/maven2): Received fatal alert: protocol_version [WARNING] Failure to transfer org.codehaus.mojo/maven-metadata.xml from https://repo.maven.apache.org/maven2 was cached in the local repository, resolution will not be reattempted until the update interval of central has elapsed or updates are forced. Original error: Could not transfer metadata org.codehaus.mojo/maven-metadata.xml from/to central (https://repo.maven.apache.org/maven2): Received fatal alert: protocol_version [INFO] ------------------------------------------------------------------------ [INFO] BUILD FAILURE [INFO] ------------------------------------------------------------------------ [INFO] Total time: 6.191 s [INFO] Finished at: 2018-07-25T21:57:45+08:00 [INFO] ------------------------------------------------------------------------ [ERROR] No plugin found for prefix 'install' in the current project and in the plugin groups [org.apache.maven.plugins, org.codehaus.mojo] available from the repositories [local (C:\Users\Administrator\.m2\repository), central (https://repo.maven.apache.org/maven2)] -> [Help 1] [ERROR] [ERROR] To see the full stack trace of the errors, re-run Maven with the -e switch. [ERROR] Re-run Maven using the -X switch to enable full debug logging. [ERROR] [ERROR] For more information about the errors and possible solutions, please read the following articles: [ERROR] [Help 1] http://cwiki.apache.org/confluence/display/MAVEN/NoPluginFoundForPrefixException

IDEA 的maven出错 Unable to import maven project

maven也自己下了,配置也都照着网上配了,环境变量什么的都弄了,IDEA的maven也照着网上配了 这是错误日志 java.lang.RuntimeException: Cannot reconnect. at org.jetbrains.idea.maven.server.RemoteObjectWrapper.perform(RemoteObjectWrapper.java:82) at org.jetbrains.idea.maven.server.MavenServerManager.applyProfiles(MavenServerManager.java:550) at org.jetbrains.idea.maven.project.MavenProjectReader.applyProfiles(MavenProjectReader.java:397) at org.jetbrains.idea.maven.project.MavenProjectReader.doReadProjectModel(MavenProjectReader.java:103) at org.jetbrains.idea.maven.project.MavenProjectReader.readProject(MavenProjectReader.java:62) at org.jetbrains.idea.maven.project.MavenProject.read(MavenProject.java:639) at org.jetbrains.idea.maven.project.MavenProjectsTree.doUpdate(MavenProjectsTree.java:554) at org.jetbrains.idea.maven.project.MavenProjectsTree.doAdd(MavenProjectsTree.java:499) at org.jetbrains.idea.maven.project.MavenProjectsTree.update(MavenProjectsTree.java:460) at org.jetbrains.idea.maven.project.MavenProjectsTree.updateAll(MavenProjectsTree.java:431) at org.jetbrains.idea.maven.project.MavenProjectsProcessorReadingTask.perform(MavenProjectsProcessorReadingTask.java:60) at org.jetbrains.idea.maven.project.MavenProjectsProcessor.doProcessPendingTasks(MavenProjectsProcessor.java:132) at org.jetbrains.idea.maven.project.MavenProjectsProcessor.access$000(MavenProjectsProcessor.java:32) at org.jetbrains.idea.maven.project.MavenProjectsProcessor$2.run(MavenProjectsProcessor.java:107) at org.jetbrains.idea.maven.utils.MavenUtil.lambda$runInBackground$5(MavenUtil.java:460) at com.intellij.openapi.application.impl.ApplicationImpl$1.run(ApplicationImpl.java:330) at java.util.concurrent.Executors$RunnableAdapter.call(Executors.java:511) at java.util.concurrent.FutureTask.run(FutureTask.java:266) at java.util.concurrent.ThreadPoolExecutor.runWorker(ThreadPoolExecutor.java:1142) at java.util.concurrent.ThreadPoolExecutor$Worker.run(ThreadPoolExecutor.java:617) at java.lang.Thread.run(Thread.java:745) Caused by: java.rmi.RemoteException: Cannot start maven service; nested exception is: com.intellij.execution.ExecutionException: at org.jetbrains.idea.maven.server.MavenServerManager.create(MavenServerManager.java:175) at org.jetbrains.idea.maven.server.MavenServerManager.create(MavenServerManager.java:80) at org.jetbrains.idea.maven.server.RemoteObjectWrapper.getOrCreateWrappee(RemoteObjectWrapper.java:41) at org.jetbrains.idea.maven.server.MavenServerManager$7.execute(MavenServerManager.java:553) at org.jetbrains.idea.maven.server.MavenServerManager$7.execute(MavenServerManager.java:550) at org.jetbrains.idea.maven.server.RemoteObjectWrapper.perform(RemoteObjectWrapper.java:76) ... 20 more Caused by: com.intellij.execution.ExecutionException: at com.intellij.execution.rmi.RemoteProcessSupport.acquire(RemoteProcessSupport.java:166) at org.jetbrains.idea.maven.server.MavenServerManager.create(MavenServerManager.java:172) ... 25 more 2017-10-27 13:52:43,319 [ 628599] ERROR - #org.jetbrains.idea.maven - IntelliJ IDEA 2017.2.5 Build #IU-172.4343.14 2017-10-27 13:52:43,319 [ 628599] ERROR - #org.jetbrains.idea.maven - JDK: 1.8.0_152-release 2017-10-27 13:52:43,319 [ 628599] ERROR - #org.jetbrains.idea.maven - VM: OpenJDK 64-Bit Server VM 2017-10-27 13:52:43,319 [ 628599] ERROR - #org.jetbrains.idea.maven - Vendor: JetBrains s.r.o 2017-10-27 13:52:43,319 [ 628599] ERROR - #org.jetbrains.idea.maven - OS: Windows 10 2017-10-27 13:52:43,319 [ 628599] ERROR - #org.jetbrains.idea.maven - Last Action: ShowSettings

新建Maven项目报错,提示连接不上中央存储库

CoreException: Could not calculate build plan: Plugin org.apache.maven.plugins:maven-compiler-plugin:2.3.2 or one of its dependencies could not be resolved: Failed to read artifact descriptor for org.apache.maven.plugins:maven-compiler-plugin:jar:2.3.2: ArtifactResolutionException: Failure to transfer org.apache.maven.plugins:maven-compiler-plugin:pom:2.3.2 from http://repo.maven.apache.org/maven2 was cached in the local repository, resolution will not be reattempted until the update interval of central has elapsed or updates are forced. Original error: Could not transfer artifact org.apache.maven.plugins:maven-compiler-plugin:pom:2.3.2 from/to central (http://repo.maven.apache.org/maven2): null to http://repo.maven.apache.org/maven2/org/apache/maven/plugins/maven-compiler-plugin/2.3.2/maven-compiler-plugin-2.3.2.pom

maven编译问题, 着了魔一样的Compilation failure

被这个问题困扰好几天了, 目前已经处于崩溃状态, 实在是没有办法了,有人能解决这个问题吗, 我真的跪谢了. 环境变量 JAVA_HOME:D:\Program Files\Java\jdk1.7.0_79 ------------------------------------------------------ pom.xml插件配置如下: ...... <jdk.version>1.7</jdk.version> ...... <!-- Compiler 插件, 设定JDK版本 --> <plugin> <groupId>org.apache.maven.plugins</groupId> <artifactId>maven-compiler-plugin</artifactId> <version>2.5.1</version> <configuration> <source>${jdk.version}</source> <target>${jdk.version}</target> <showWarnings>true</showWarnings> </configuration> </plugin> ---------------------------------------------- 报错信息如下: org.apache.maven.lifecycle.LifecycleExecutionException: Failed to execute goal org.apache.maven.plugins:maven-compiler-plugin:2.5.1:compile (default-compile) on project scorpius: Compilation failure at org.apache.maven.lifecycle.internal.MojoExecutor.execute(MojoExecutor.java:212) at org.apache.maven.lifecycle.internal.MojoExecutor.execute(MojoExecutor.java:153) at org.apache.maven.lifecycle.internal.MojoExecutor.execute(MojoExecutor.java:145) at org.apache.maven.lifecycle.internal.LifecycleModuleBuilder.buildProject(LifecycleModuleBuilder.java:84) at org.apache.maven.lifecycle.internal.LifecycleModuleBuilder.buildProject(LifecycleModuleBuilder.java:59) at org.apache.maven.lifecycle.internal.LifecycleStarter.singleThreadedBuild(LifecycleStarter.java:183) at org.apache.maven.lifecycle.internal.LifecycleStarter.execute(LifecycleStarter.java:161) at org.apache.maven.DefaultMaven.doExecute(DefaultMaven.java:318) at org.apache.maven.DefaultMaven.execute(DefaultMaven.java:153) at org.apache.maven.cli.MavenCli.execute(MavenCli.java:555) at org.apache.maven.cli.MavenCli.doMain(MavenCli.java:214) at org.apache.maven.cli.MavenCli.main(MavenCli.java:158) at sun.reflect.NativeMethodAccessorImpl.invoke0(Native Method) at sun.reflect.NativeMethodAccessorImpl.invoke(NativeMethodAccessorImpl.java:57) at sun.reflect.DelegatingMethodAccessorImpl.invoke(DelegatingMethodAccessorImpl.java:43) at java.lang.reflect.Method.invoke(Method.java:606) at org.codehaus.plexus.classworlds.launcher.Launcher.launchEnhanced(Launcher.java:290) at org.codehaus.plexus.classworlds.launcher.Launcher.launch(Launcher.java:230) at org.codehaus.plexus.classworlds.launcher.Launcher.mainWithExitCode(Launcher.java:414) at org.codehaus.plexus.classworlds.launcher.Launcher.main(Launcher.java:357) at org.codehaus.classworlds.Launcher.main(Launcher.java:47) Caused by: org.apache.maven.plugin.CompilationFailureException: Compilation failure at org.apache.maven.plugin.AbstractCompilerMojo.execute(AbstractCompilerMojo.java:729) at org.apache.maven.plugin.CompilerMojo.execute(CompilerMojo.java:128) at org.apache.maven.plugin.DefaultBuildPluginManager.executeMojo(DefaultBuildPluginManager.java:106) at org.apache.maven.lifecycle.internal.MojoExecutor.execute(MojoExecutor.java:208) ... 20 more [ERROR] [ERROR] [ERROR] For more information about the errors and possible solutions, please read the following articles: [ERROR] [Help 1] http://cwiki.apache.org/confluence/display/MAVEN/MojoFailureException

myeclipse建不了maven项目

建不了maven的wep和quickstart项目 - Could not resolve archetype org.apache.maven.archetypes:maven-archetype-webapp:RELEASE from any of the configured repositories. Could not resolve artifact org.apache.maven.archetypes:maven-archetype-webapp:pom:RELEASE Failed to resolve version for org.apache.maven.archetypes:maven-archetype-webapp:pom:RELEASE: Could not find metadata org.apache.maven.archetypes:maven-archetype-webapp/maven-metadata.xml in local (E:\maven_repository\.m2\repository) Failed to resolve version for org.apache.maven.archetypes:maven-archetype-webapp:pom:RELEASE: Could not find metadata org.apache.maven.archetypes:maven-archetype-webapp/maven-metadata.xml in local (E:\maven_repository\.m2\repository) ========================================================================

发布项目到maven中央仓库时提示Access denied to

[ERROR] Failed to execute goal org.apache.maven.plugins:maven-deploy-plugin:2.7:deploy (default-deploy) on project common-parent: Failed to deploy artifacts: Could not transfer artifact cn.dyaoming.common:common-parent:pom:1.0.0-20190411.094108-1 from/to maven-center-access (https://oss.sonatype.org/content/repositories/snapshots/): Access denied to: https://oss.sonatype.org/content/repositories/snapshots/cn/dyaoming/common/common-parent/1.0.0-SNAPSHOT/common-parent-1.0.0-20190411.094108-1.pom -> [Help 1] org.apache.maven.lifecycle.LifecycleExecutionException: Failed to execute goal org.apache.maven.plugins:maven-deploy-plugin:2.7:deploy (default-deploy) on project common-parent: Failed to deploy artifacts: Could not transfer artifact cn.dyaoming.common:common-parent:pom:1.0.0-20190411.094108-1 from/to maven-center-access (https://oss.sonatype.org/content/repositories/snapshots/): Access denied to: https://oss.sonatype.org/content/repositories/snapshots/cn/dyaoming/common/common-parent/1.0.0-SNAPSHOT/common-parent-1.0.0-20190411.094108-1.pom at org.apache.maven.lifecycle.internal.MojoExecutor.execute (MojoExecutor.java:215) at org.apache.maven.lifecycle.internal.MojoExecutor.execute (MojoExecutor.java:156) at org.apache.maven.lifecycle.internal.MojoExecutor.execute (MojoExecutor.java:148) at org.apache.maven.lifecycle.internal.LifecycleModuleBuilder.buildProject (LifecycleModuleBuilder.java:117) at org.apache.maven.lifecycle.internal.LifecycleModuleBuilder.buildProject (LifecycleModuleBuilder.java:81) at org.apache.maven.lifecycle.internal.builder.singlethreaded.SingleThreadedBuilder.build (SingleThreadedBuilder.java:56) at org.apache.maven.lifecycle.internal.LifecycleStarter.execute (LifecycleStarter.java:128) at org.apache.maven.DefaultMaven.doExecute (DefaultMaven.java:305) at org.apache.maven.DefaultMaven.doExecute (DefaultMaven.java:192) at org.apache.maven.DefaultMaven.execute (DefaultMaven.java:105) at org.apache.maven.cli.MavenCli.execute (MavenCli.java:956) at org.apache.maven.cli.MavenCli.doMain (MavenCli.java:288) at org.apache.maven.cli.MavenCli.main (MavenCli.java:192) at sun.reflect.NativeMethodAccessorImpl.invoke0 (Native Method) at sun.reflect.NativeMethodAccessorImpl.invoke (NativeMethodAccessorImpl.java:62) at sun.reflect.DelegatingMethodAccessorImpl.invoke (DelegatingMethodAccessorImpl.java:43) at java.lang.reflect.Method.invoke (Method.java:498) at org.codehaus.plexus.classworlds.launcher.Launcher.launchEnhanced (Launcher.java:289) at org.codehaus.plexus.classworlds.launcher.Launcher.launch (Launcher.java:229) at org.codehaus.plexus.classworlds.launcher.Launcher.mainWithExitCode (Launcher.java:415) at org.codehaus.plexus.classworlds.launcher.Launcher.main (Launcher.java:356) Caused by: org.apache.maven.plugin.MojoExecutionException: Failed to deploy artifacts: Could not transfer artifact cn.dyaoming.common:common-parent:pom:1.0.0-20190411.094108-1 from/to maven-center-access (https://oss.sonatype.org/content/repositories/snapshots/): Access denied to: https://oss.sonatype.org/content/repositories/snapshots/cn/dyaoming/common/common-parent/1.0.0-SNAPSHOT/common-parent-1.0.0-20190411.094108-1.pom at org.apache.maven.plugin.deploy.DeployMojo.execute (DeployMojo.java:193) at org.apache.maven.plugin.DefaultBuildPluginManager.executeMojo (DefaultBuildPluginManager.java:137) at org.apache.maven.lifecycle.internal.MojoExecutor.execute (MojoExecutor.java:210) at org.apache.maven.lifecycle.internal.MojoExecutor.execute (MojoExecutor.java:156) at org.apache.maven.lifecycle.internal.MojoExecutor.execute (MojoExecutor.java:148) at org.apache.maven.lifecycle.internal.LifecycleModuleBuilder.buildProject (LifecycleModuleBuilder.java:117) at org.apache.maven.lifecycle.internal.LifecycleModuleBuilder.buildProject (LifecycleModuleBuilder.java:81) at org.apache.maven.lifecycle.internal.builder.singlethreaded.SingleThreadedBuilder.build (SingleThreadedBuilder.java:56) at org.apache.maven.lifecycle.internal.LifecycleStarter.execute (LifecycleStarter.java:128) at org.apache.maven.DefaultMaven.doExecute (DefaultMaven.java:305) at org.apache.maven.DefaultMaven.doExecute (DefaultMaven.java:192) at org.apache.maven.DefaultMaven.execute (DefaultMaven.java:105) at org.apache.maven.cli.MavenCli.execute (MavenCli.java:956) at org.apache.maven.cli.MavenCli.doMain (MavenCli.java:288) at org.apache.maven.cli.MavenCli.main (MavenCli.java:192) at sun.reflect.NativeMethodAccessorImpl.invoke0 (Native Method) at sun.reflect.NativeMethodAccessorImpl.invoke (NativeMethodAccessorImpl.java:62) at sun.reflect.DelegatingMethodAccessorImpl.invoke (DelegatingMethodAccessorImpl.java:43) at java.lang.reflect.Method.invoke (Method.java:498) at org.codehaus.plexus.classworlds.launcher.Launcher.launchEnhanced (Launcher.java:289) at org.codehaus.plexus.classworlds.launcher.Launcher.launch (Launcher.java:229) at org.codehaus.plexus.classworlds.launcher.Launcher.mainWithExitCode (Launcher.java:415) at org.codehaus.plexus.classworlds.launcher.Launcher.main (Launcher.java:356) Caused by: org.apache.maven.artifact.deployer.ArtifactDeploymentException: Failed to deploy artifacts: Could not transfer artifact cn.dyaoming.common:common-parent:pom:1.0.0-20190411.094108-1 from/to maven-center-access (https://oss.sonatype.org/content/repositories/snapshots/): Access denied to: https://oss.sonatype.org/content/repositories/snapshots/cn/dyaoming/common/common-parent/1.0.0-SNAPSHOT/common-parent-1.0.0-20190411.094108-1.pom at org.apache.maven.artifact.deployer.DefaultArtifactDeployer.deploy (DefaultArtifactDeployer.java:146) at org.apache.maven.plugin.deploy.AbstractDeployMojo.deploy (AbstractDeployMojo.java:167) at org.apache.maven.plugin.deploy.DeployMojo.execute (DeployMojo.java:149) at org.apache.maven.plugin.DefaultBuildPluginManager.executeMojo (DefaultBuildPluginManager.java:137) at org.apache.maven.lifecycle.internal.MojoExecutor.execute (MojoExecutor.java:210) at org.apache.maven.lifecycle.internal.MojoExecutor.execute (MojoExecutor.java:156) at org.apache.maven.lifecycle.internal.MojoExecutor.execute (MojoExecutor.java:148) at org.apache.maven.lifecycle.internal.LifecycleModuleBuilder.buildProject (LifecycleModuleBuilder.java:117) at org.apache.maven.lifecycle.internal.LifecycleModuleBuilder.buildProject (LifecycleModuleBuilder.java:81) at org.apache.maven.lifecycle.internal.builder.singlethreaded.SingleThreadedBuilder.build (SingleThreadedBuilder.java:56) at org.apache.maven.lifecycle.internal.LifecycleStarter.execute (LifecycleStarter.java:128) at org.apache.maven.DefaultMaven.doExecute (DefaultMaven.java:305) at org.apache.maven.DefaultMaven.doExecute (DefaultMaven.java:192) at org.apache.maven.DefaultMaven.execute (DefaultMaven.java:105) at org.apache.maven.cli.MavenCli.execute (MavenCli.java:956) at org.apache.maven.cli.MavenCli.doMain (MavenCli.java:288) at org.apache.maven.cli.MavenCli.main (MavenCli.java:192) at sun.reflect.NativeMethodAccessorImpl.invoke0 (Native Method) at sun.reflect.NativeMethodAccessorImpl.invoke (NativeMethodAccessorImpl.java:62) at sun.reflect.DelegatingMethodAccessorImpl.invoke (DelegatingMethodAccessorImpl.java:43) at java.lang.reflect.Method.invoke (Method.java:498) at org.codehaus.plexus.classworlds.launcher.Launcher.launchEnhanced (Launcher.java:289) at org.codehaus.plexus.classworlds.launcher.Launcher.launch (Launcher.java:229) at org.codehaus.plexus.classworlds.launcher.Launcher.mainWithExitCode (Launcher.java:415) at org.codehaus.plexus.classworlds.launcher.Launcher.main (Launcher.java:356) Caused by: org.eclipse.aether.deployment.DeploymentException: Failed to deploy artifacts: Could not transfer artifact cn.dyaoming.common:common-parent:pom:1.0.0-20190411.094108-1 from/to maven-center-access (https://oss.sonatype.org/content/repositories/snapshots/): Access denied to: https://oss.sonatype.org/content/repositories/snapshots/cn/dyaoming/common/common-parent/1.0.0-SNAPSHOT/common-parent-1.0.0-20190411.094108-1.pom at org.eclipse.aether.internal.impl.DefaultDeployer.deploy (DefaultDeployer.java:301) at org.eclipse.aether.internal.impl.DefaultDeployer.deploy (DefaultDeployer.java:211) at org.eclipse.aether.internal.impl.DefaultRepositorySystem.deploy (DefaultRepositorySystem.java:371) at org.apache.maven.artifact.deployer.DefaultArtifactDeployer.deploy (DefaultArtifactDeployer.java:142) at org.apache.maven.plugin.deploy.AbstractDeployMojo.deploy (AbstractDeployMojo.java:167) at org.apache.maven.plugin.deploy.DeployMojo.execute (DeployMojo.java:149) at org.apache.maven.plugin.DefaultBuildPluginManager.executeMojo (DefaultBuildPluginManager.java:137) at org.apache.maven.lifecycle.internal.MojoExecutor.execute (MojoExecutor.java:210) at org.apache.maven.lifecycle.internal.MojoExecutor.execute (MojoExecutor.java:156) at org.apache.maven.lifecycle.internal.MojoExecutor.execute (MojoExecutor.java:148) at org.apache.maven.lifecycle.internal.LifecycleModuleBuilder.buildProject (LifecycleModuleBuilder.java:117) at org.apache.maven.lifecycle.internal.LifecycleModuleBuilder.buildProject (LifecycleModuleBuilder.java:81) at org.apache.maven.lifecycle.internal.builder.singlethreaded.SingleThreadedBuilder.build (SingleThreadedBuilder.java:56) at org.apache.maven.lifecycle.internal.LifecycleStarter.execute (LifecycleStarter.java:128) at org.apache.maven.DefaultMaven.doExecute (DefaultMaven.java:305) at org.apache.maven.DefaultMaven.doExecute (DefaultMaven.java:192) at org.apache.maven.DefaultMaven.execute (DefaultMaven.java:105) at org.apache.maven.cli.MavenCli.execute (MavenCli.java:956) at org.apache.maven.cli.MavenCli.doMain (MavenCli.java:288) at org.apache.maven.cli.MavenCli.main (MavenCli.java:192) at sun.reflect.NativeMethodAccessorImpl.invoke0 (Native Method) at sun.reflect.NativeMethodAccessorImpl.invoke (NativeMethodAccessorImpl.java:62) at sun.reflect.DelegatingMethodAccessorImpl.invoke (DelegatingMethodAccessorImpl.java:43) at java.lang.reflect.Method.invoke (Method.java:498) at org.codehaus.plexus.classworlds.launcher.Launcher.launchEnhanced (Launcher.java:289) at org.codehaus.plexus.classworlds.launcher.Launcher.launch (Launcher.java:229) at org.codehaus.plexus.classworlds.launcher.Launcher.mainWithExitCode (Launcher.java:415) at org.codehaus.plexus.classworlds.launcher.Launcher.main (Launcher.java:356) Caused by: org.eclipse.aether.transfer.ArtifactTransferException: Could not transfer artifact cn.dyaoming.common:common-parent:pom:1.0.0-20190411.094108-1 from/to maven-center-access (https://oss.sonatype.org/content/repositories/snapshots/): Access denied to: https://oss.sonatype.org/content/repositories/snapshots/cn/dyaoming/common/common-parent/1.0.0-SNAPSHOT/common-parent-1.0.0-20190411.094108-1.pom at org.eclipse.aether.connector.basic.ArtifactTransportListener.transferFailed (ArtifactTransportListener.java:52) at org.eclipse.aether.connector.basic.BasicRepositoryConnector$TaskRunner.run (BasicRepositoryConnector.java:368) at org.eclipse.aether.connector.basic.BasicRepositoryConnector.put (BasicRepositoryConnector.java:287) at org.eclipse.aether.internal.impl.DefaultDeployer.deploy (DefaultDeployer.java:295) at org.eclipse.aether.internal.impl.DefaultDeployer.deploy (DefaultDeployer.java:211) at org.eclipse.aether.internal.impl.DefaultRepositorySystem.deploy (DefaultRepositorySystem.java:371) at org.apache.maven.artifact.deployer.DefaultArtifactDeployer.deploy (DefaultArtifactDeployer.java:142) at org.apache.maven.plugin.deploy.AbstractDeployMojo.deploy (AbstractDeployMojo.java:167) at org.apache.maven.plugin.deploy.DeployMojo.execute (DeployMojo.java:149) at org.apache.maven.plugin.DefaultBuildPluginManager.executeMojo (DefaultBuildPluginManager.java:137) at org.apache.maven.lifecycle.internal.MojoExecutor.execute (MojoExecutor.java:210) at org.apache.maven.lifecycle.internal.MojoExecutor.execute (MojoExecutor.java:156) at org.apache.maven.lifecycle.internal.MojoExecutor.execute (MojoExecutor.java:148) at org.apache.maven.lifecycle.internal.LifecycleModuleBuilder.buildProject (LifecycleModuleBuilder.java:117) at org.apache.maven.lifecycle.internal.LifecycleModuleBuilder.buildProject (LifecycleModuleBuilder.java:81) at org.apache.maven.lifecycle.internal.builder.singlethreaded.SingleThreadedBuilder.build (SingleThreadedBuilder.java:56) at org.apache.maven.lifecycle.internal.LifecycleStarter.execute (LifecycleStarter.java:128) at org.apache.maven.DefaultMaven.doExecute (DefaultMaven.java:305) at org.apache.maven.DefaultMaven.doExecute (DefaultMaven.java:192) at org.apache.maven.DefaultMaven.execute (DefaultMaven.java:105) at org.apache.maven.cli.MavenCli.execute (MavenCli.java:956) at org.apache.maven.cli.MavenCli.doMain (MavenCli.java:288) at org.apache.maven.cli.MavenCli.main (MavenCli.java:192) at sun.reflect.NativeMethodAccessorImpl.invoke0 (Native Method) at sun.reflect.NativeMethodAccessorImpl.invoke (NativeMethodAccessorImpl.java:62) at sun.reflect.DelegatingMethodAccessorImpl.invoke (DelegatingMethodAccessorImpl.java:43) at java.lang.reflect.Method.invoke (Method.java:498) at org.codehaus.plexus.classworlds.launcher.Launcher.launchEnhanced (Launcher.java:289) at org.codehaus.plexus.classworlds.launcher.Launcher.launch (Launcher.java:229) at org.codehaus.plexus.classworlds.launcher.Launcher.mainWithExitCode (Launcher.java:415) at org.codehaus.plexus.classworlds.launcher.Launcher.main (Launcher.java:356) Caused by: org.apache.maven.wagon.authorization.AuthorizationException: Access denied to: https://oss.sonatype.org/content/repositories/snapshots/cn/dyaoming/common/common-parent/1.0.0-SNAPSHOT/common-parent-1.0.0-20190411.094108-1.pom at org.apache.maven.wagon.providers.http.wagon.shared.AbstractHttpClientWagon.put (AbstractHttpClientWagon.java:724) at org.apache.maven.wagon.providers.http.wagon.shared.AbstractHttpClientWagon.put (AbstractHttpClientWagon.java:648) at org.apache.maven.wagon.providers.http.wagon.shared.AbstractHttpClientWagon.put (AbstractHttpClientWagon.java:630) at org.apache.maven.wagon.providers.http.wagon.shared.AbstractHttpClientWagon.put (AbstractHttpClientWagon.java:624) at org.apache.maven.wagon.providers.http.wagon.shared.AbstractHttpClientWagon.put (AbstractHttpClientWagon.java:604) at org.eclipse.aether.transport.wagon.WagonTransporter$PutTaskRunner.run (WagonTransporter.java:686) at org.eclipse.aether.transport.wagon.WagonTransporter.execute (WagonTransporter.java:435) at org.eclipse.aether.transport.wagon.WagonTransporter.put (WagonTransporter.java:418) at org.eclipse.aether.connector.basic.BasicRepositoryConnector$PutTaskRunner.runTask (BasicRepositoryConnector.java:554) at org.eclipse.aether.connector.basic.BasicRepositoryConnector$TaskRunner.run (BasicRepositoryConnector.java:363) at org.eclipse.aether.connector.basic.BasicRepositoryConnector.put (BasicRepositoryConnector.java:287) at org.eclipse.aether.internal.impl.DefaultDeployer.deploy (DefaultDeployer.java:295) at org.eclipse.aether.internal.impl.DefaultDeployer.deploy (DefaultDeployer.java:211) at org.eclipse.aether.internal.impl.DefaultRepositorySystem.deploy (DefaultRepositorySystem.java:371) at org.apache.maven.artifact.deployer.DefaultArtifactDeployer.deploy (DefaultArtifactDeployer.java:142) at org.apache.maven.plugin.deploy.AbstractDeployMojo.deploy (AbstractDeployMojo.java:167) at org.apache.maven.plugin.deploy.DeployMojo.execute (DeployMojo.java:149) at org.apache.maven.plugin.DefaultBuildPluginManager.executeMojo (DefaultBuildPluginManager.java:137) at org.apache.maven.lifecycle.internal.MojoExecutor.execute (MojoExecutor.java:210) at org.apache.maven.lifecycle.internal.MojoExecutor.execute (MojoExecutor.java:156) at org.apache.maven.lifecycle.internal.MojoExecutor.execute (MojoExecutor.java:148) at org.apache.maven.lifecycle.internal.LifecycleModuleBuilder.buildProject (LifecycleModuleBuilder.java:117) at org.apache.maven.lifecycle.internal.LifecycleModuleBuilder.buildProject (LifecycleModuleBuilder.java:81) at org.apache.maven.lifecycle.internal.builder.singlethreaded.SingleThreadedBuilder.build (SingleThreadedBuilder.java:56) at org.apache.maven.lifecycle.internal.LifecycleStarter.execute (LifecycleStarter.java:128) at org.apache.maven.DefaultMaven.doExecute (DefaultMaven.java:305) at org.apache.maven.DefaultMaven.doExecute (DefaultMaven.java:192) at org.apache.maven.DefaultMaven.execute (DefaultMaven.java:105) at org.apache.maven.cli.MavenCli.execute (MavenCli.java:956) at org.apache.maven.cli.MavenCli.doMain (MavenCli.java:288) at org.apache.maven.cli.MavenCli.main (MavenCli.java:192) at sun.reflect.NativeMethodAccessorImpl.invoke0 (Native Method) at sun.reflect.NativeMethodAccessorImpl.invoke (NativeMethodAccessorImpl.java:62) at sun.reflect.DelegatingMethodAccessorImpl.invoke (DelegatingMethodAccessorImpl.java:43) at java.lang.reflect.Method.invoke (Method.java:498) at org.codehaus.plexus.classworlds.launcher.Launcher.launchEnhanced (Launcher.java:289) at org.codehaus.plexus.classworlds.launcher.Launcher.launch (Launcher.java:229) at org.codehaus.plexus.classworlds.launcher.Launcher.mainWithExitCode (Launcher.java:415) at org.codehaus.plexus.classworlds.launcher.Launcher.main (Launcher.java:356) [ERROR] [ERROR] Re-run Maven using the -X switch to enable full debug logging. [ERROR] [ERROR] For more information about the errors and possible solutions, please read the following articles: [ERROR] [Help 1] http://cwiki.apache.org/confluence/display/MAVEN/MojoExecutionException

定量遥感中文版 梁顺林著 范闻捷译

这是梁顺林的定量遥感的中文版,由范闻捷等翻译的,是电子版PDF,解决了大家看英文费时费事的问题,希望大家下载看看,一定会有帮助的

Java 最常见的 200+ 面试题:面试必备

这份面试清单是从我 2015 年做了 TeamLeader 之后开始收集的,一方面是给公司招聘用,另一方面是想用它来挖掘在 Java 技术栈中,还有那些知识点是我不知道的,我想找到这些技术盲点,然后修复它,以此来提高自己的技术水平。虽然我是从 2009 年就开始参加编程工作了,但我依旧觉得自己现在要学的东西很多,并且学习这些知识,让我很有成就感和满足感,那所以何乐而不为呢? 说回面试的事,这份面试...

机器学习初学者必会的案例精讲

通过六个实际的编码项目,带领同学入门人工智能。这些项目涉及机器学习(回归,分类,聚类),深度学习(神经网络),底层数学算法,Weka数据挖掘,利用Git开源项目实战等。

远程工具,免费

远程工具,免费

java jdk 8 帮助文档 中文 文档 chm 谷歌翻译

JDK1.8 API 中文谷歌翻译版 java帮助文档 JDK API java 帮助文档 谷歌翻译 JDK1.8 API 中文 谷歌翻译版 java帮助文档 Java最新帮助文档 本帮助文档是使用谷

csma/ca和csma/cd的matlab仿真源代码带有详细的注释

csma/ca和csma/cd的matlab仿真源代码带有详细的注释,载波侦听,随意设置节点数,带有炫酷的图形展示效果。

Java基础知识面试题(2020最新版)

文章目录Java概述何为编程什么是Javajdk1.5之后的三大版本JVM、JRE和JDK的关系什么是跨平台性?原理是什么Java语言有哪些特点什么是字节码?采用字节码的最大好处是什么什么是Java程序的主类?应用程序和小程序的主类有何不同?Java应用程序与小程序之间有那些差别?Java和C++的区别Oracle JDK 和 OpenJDK 的对比基础语法数据类型Java有哪些数据类型switc...

软件测试入门、SQL、性能测试、测试管理工具

软件测试2小时入门,让您快速了解软件测试基本知识,有系统的了解; SQL一小时,让您快速理解和掌握SQL基本语法 jmeter性能测试 ,让您快速了解主流来源性能测试工具jmeter 测试管理工具-禅道,让您快速学会禅道的使用,学会测试项目、用例、缺陷的管理、

pokemmo的资源

pokemmo必须的4个rom 分别为绿宝石 火红 心金 黑白 还有汉化补丁 资源不错哦 记得下载

三个项目玩转深度学习(附1G源码)

从事大数据与人工智能开发与实践约十年,钱老师亲自见证了大数据行业的发展与人工智能的从冷到热。事实证明,计算机技术的发展,算力突破,海量数据,机器人技术等,开启了第四次工业革命的序章。深度学习图像分类一直是人工智能的经典任务,是智慧零售、安防、无人驾驶等机器视觉应用领域的核心技术之一,掌握图像分类技术是机器视觉学习的重中之重。针对现有线上学习的特点与实际需求,我们开发了人工智能案例实战系列课程。打造:以项目案例实践为驱动的课程学习方式,覆盖了智能零售,智慧交通等常见领域,通过基础学习、项目案例实践、社群答疑,三维立体的方式,打造最好的学习效果。

无线通信中的智能天线:IS-95和第3代CDMA应用_.pdf

无线通信中的智能天线:IS-95和第3代CDMA应用_.pdf

设计模式(JAVA语言实现)--20种设计模式附带源码

课程亮点: 课程培训详细的笔记以及实例代码,让学员开始掌握设计模式知识点 课程内容: 工厂模式、桥接模式、组合模式、装饰器模式、外观模式、享元模式、原型模型、代理模式、单例模式、适配器模式 策略模式、模板方法模式、观察者模式、迭代器模式、责任链模式、命令模式、备忘录模式、状态模式、访问者模式 课程特色: 笔记设计模式,用笔记串连所有知识点,让学员从一点一滴积累,学习过程无压力 笔记标题采用关键字标识法,帮助学员更加容易记住知识点 笔记以超链接形式让知识点关联起来,形式知识体系 采用先概念后实例再应用方式,知识点深入浅出 提供授课内容笔记作为课后复习以及工作备查工具 部分图表(电脑PC端查看):

Java8零基础入门视频教程

这门课程基于主流的java8平台,由浅入深的详细讲解了java SE的开发技术,可以使java方向的入门学员,快速扎实的掌握java开发技术!

玩转Linux:常用命令实例指南

人工智能、物联网、大数据时代,Linux正有着一统天下的趋势,几乎每个程序员岗位,都要求掌握Linux。本课程零基础也能轻松入门。 本课程以简洁易懂的语言手把手教你系统掌握日常所需的Linux知识,每个知识点都会配合案例实战让你融汇贯通。课程通俗易懂,简洁流畅,适合0基础以及对Linux掌握不熟练的人学习; 【限时福利】 1)购课后按提示添加小助手,进答疑群,还可获得价值300元的编程大礼包! 2)本月购买此套餐加入老师答疑交流群,可参加老师的免费分享活动,学习最新技术项目经验。 --------------------------------------------------------------- 29元=掌握Linux必修知识+社群答疑+讲师社群分享会+700元编程礼包。 &nbsp;

极简JAVA学习营第四期(报名以后加助教微信:eduxy-1)

想学好JAVA必须要报两万的培训班吗? Java大神勿入 如果你: 零基础想学JAVA却不知道从何入手 看了一堆书和视频却还是连JAVA的环境都搭建不起来 囊中羞涩面对两万起的JAVA培训班不忍直视 在职没有每天大块的时间专门学习JAVA 那么恭喜你找到组织了,在这里有: 1. 一群志同道合立志学好JAVA的同学一起学习讨论JAVA 2. 灵活机动的学习时间完成特定学习任务+每日编程实战练习 3. 热心助人的助教和讲师及时帮你解决问题,不按时完成作业小心助教老师的家访哦 上一张图看看前辈的感悟: &nbsp; &nbsp; 大家一定迫不及待想知道什么是极简JAVA学习营了吧,下面就来给大家说道说道: 什么是极简JAVA学习营? 1. 针对Java小白或者初级Java学习者; 2. 利用9天时间,每天1个小时时间; 3.通过 每日作业 / 组队PK / 助教答疑 / 实战编程 / 项目答辩 / 社群讨论 / 趣味知识抢答等方式让学员爱上学习编程 , 最终实现能独立开发一个基于控制台的‘库存管理系统’ 的学习模式 极简JAVA学习营是怎么学习的? &nbsp; 如何报名? 只要购买了极简JAVA一:JAVA入门就算报名成功! &nbsp;本期为第四期极简JAVA学习营,我们来看看往期学员的学习状态: 作业看这里~ &nbsp; 助教的作业报告是不是很专业 不交作业打屁屁 助教答疑是不是很用心 &nbsp; 有奖抢答大家玩的很嗨啊 &nbsp; &nbsp; 项目答辩终于开始啦 &nbsp; 优秀者的获奖感言 &nbsp; 这是答辩项目的效果 &nbsp; &nbsp; 这么细致的服务,这么好的氛围,这样的学习效果,需要多少钱呢? 不要1999,不要199,不要99,只要9.9 是的你没听错,只要9.9以上所有就都属于你了 如果你: 1、&nbsp;想学JAVA没有基础 2、&nbsp;想学JAVA没有整块的时间 3、&nbsp;想学JAVA没有足够的预算 还等什么?赶紧报名吧,抓紧抢位,本期只招300人,错过只有等时间待定的下一期了 &nbsp; 报名请加小助手微信:eduxy-1 &nbsp; &nbsp;

Python数据清洗实战入门

本次课程主要以真实的电商数据为基础,通过Python详细的介绍了数据分析中的数据清洗阶段各种技巧和方法。

董付国老师Python全栈学习优惠套餐

购买套餐的朋友可以关注微信公众号“Python小屋”,上传付款截图,然后领取董老师任意图书1本。

linux下利用/proc进行进程树的打印

在linux下利用c语言实现的进程树的打印,主要通过/proc下的目录中的进程文件,获取status中的进程信息内容,然后利用递归实现进程树的打印

MySQL数据库面试题(2020最新版)

文章目录数据库基础知识为什么要使用数据库什么是SQL?什么是MySQL?数据库三大范式是什么mysql有关权限的表都有哪几个MySQL的binlog有有几种录入格式?分别有什么区别?数据类型mysql有哪些数据类型引擎MySQL存储引擎MyISAM与InnoDB区别MyISAM索引与InnoDB索引的区别?InnoDB引擎的4大特性存储引擎选择索引什么是索引?索引有哪些优缺点?索引使用场景(重点)...

HoloLens2开发入门教程

本课程为HoloLens2开发入门教程,讲解部署开发环境,安装VS2019,Unity版本,Windows SDK,创建Unity项目,讲解如何使用MRTK,编辑器模拟手势交互,打包VS工程并编译部署应用到HoloLens上等。

150讲轻松搞定Python网络爬虫

【为什么学爬虫?】 &nbsp; &nbsp; &nbsp; &nbsp;1、爬虫入手容易,但是深入较难,如何写出高效率的爬虫,如何写出灵活性高可扩展的爬虫都是一项技术活。另外在爬虫过程中,经常容易遇到被反爬虫,比如字体反爬、IP识别、验证码等,如何层层攻克难点拿到想要的数据,这门课程,你都能学到! &nbsp; &nbsp; &nbsp; &nbsp;2、如果是作为一个其他行业的开发者,比如app开发,web开发,学习爬虫能让你加强对技术的认知,能够开发出更加安全的软件和网站 【课程设计】 一个完整的爬虫程序,无论大小,总体来说可以分成三个步骤,分别是: 网络请求:模拟浏览器的行为从网上抓取数据。 数据解析:将请求下来的数据进行过滤,提取我们想要的数据。 数据存储:将提取到的数据存储到硬盘或者内存中。比如用mysql数据库或者redis等。 那么本课程也是按照这几个步骤循序渐进的进行讲解,带领学生完整的掌握每个步骤的技术。另外,因为爬虫的多样性,在爬取的过程中可能会发生被反爬、效率低下等。因此我们又增加了两个章节用来提高爬虫程序的灵活性,分别是: 爬虫进阶:包括IP代理,多线程爬虫,图形验证码识别、JS加密解密、动态网页爬虫、字体反爬识别等。 Scrapy和分布式爬虫:Scrapy框架、Scrapy-redis组件、分布式爬虫等。 通过爬虫进阶的知识点我们能应付大量的反爬网站,而Scrapy框架作为一个专业的爬虫框架,使用他可以快速提高我们编写爬虫程序的效率和速度。另外如果一台机器不能满足你的需求,我们可以用分布式爬虫让多台机器帮助你快速爬取数据。 &nbsp; 从基础爬虫到商业化应用爬虫,本套课程满足您的所有需求! 【课程服务】 专属付费社群+每周三讨论会+1v1答疑

MySQL 8.0.19安装教程(windows 64位)

话不多说直接开干 目录 1-先去官网下载点击的MySQL的下载​ 2-配置初始化的my.ini文件的文件 3-初始化MySQL 4-安装MySQL服务 + 启动MySQL 服务 5-连接MySQL + 修改密码 先去官网下载点击的MySQL的下载 下载完成后解压 解压完是这个样子 配置初始化的my.ini文件的文件 ...

Python数据挖掘简易入门

&nbsp; &nbsp; &nbsp; &nbsp; 本课程为Python数据挖掘方向的入门课程,课程主要以真实数据为基础,详细介绍数据挖掘入门的流程和使用Python实现pandas与numpy在数据挖掘方向的运用,并深入学习如何运用scikit-learn调用常用的数据挖掘算法解决数据挖掘问题,为进一步深入学习数据挖掘打下扎实的基础。

深度学习原理+项目实战+算法详解+主流框架(套餐)

深度学习系列课程从深度学习基础知识点开始讲解一步步进入神经网络的世界再到卷积和递归神经网络,详解各大经典网络架构。实战部分选择当下最火爆深度学习框架PyTorch与Tensorflow/Keras,全程实战演示框架核心使用与建模方法。项目实战部分选择计算机视觉与自然语言处理领域经典项目,从零开始详解算法原理,debug模式逐行代码解读。适合准备就业和转行的同学们加入学习! 建议按照下列课程顺序来进行学习 (1)掌握深度学习必备经典网络架构 (2)深度框架实战方法 (3)计算机视觉与自然语言处理项目实战。(按照课程排列顺序即可)

网络工程师小白入门--【思科CCNA、华为HCNA等网络工程师认证】

本课程适合CCNA或HCNA网络小白同志,高手请绕道,可以直接学习进价课程。通过本预科课程的学习,为学习网络工程师、思科CCNA、华为HCNA这些认证打下坚实的基础! 重要!思科认证2020年2月24日起,已启用新版认证和考试,包括题库都会更新,由于疫情原因,请关注官网和本地考点信息。题库网络上很容易下载到。

Ubuntu18.04安装教程

Ubuntu18.04.1安装一、准备工作1.下载Ubuntu18.04.1 LTS2.制作U盘启动盘3.准备 Ubuntu18.04.1 的硬盘空间二、安装Ubuntu18.04.1三、安装后的一些工作1.安装输入法2.更换软件源四、双系统如何卸载Ubuntu18.04.1新的改变功能快捷键合理的创建标题,有助于目录的生成如何改变文本的样式插入链接与图片如何插入一段漂亮的代码片生成一个适合你的列...

sql语句 异常 Err] 1064 - You have an error in your SQL syntax; check the manual that corresponds to your

在我们开发的工程中,有时候会报 [Err] 1064 - You have an error in your SQL syntax; check the manual that corresponds to your MySQL server version for the right syntax to use near ------ 这种异常 不用多想,肯定是我们的sql语句出现问题,下面...

西南交通大学新秀杯数学建模试题

题目比较难,如果符合大家的口味欢迎大家下载哈,提高你的思维想象能力

Windows版YOLOv4目标检测实战:训练自己的数据集

课程演示环境:Windows10; cuda 10.2; cudnn7.6.5; Python3.7; VisualStudio2019; OpenCV3.4 需要学习ubuntu系统上YOLOv4的同学请前往:《YOLOv4目标检测实战:训练自己的数据集》 课程链接:https://edu.csdn.net/course/detail/28745 YOLOv4来了!速度和精度双提升! 与 YOLOv3 相比,新版本的 AP (精度)和 FPS (每秒帧率)分别提高了 10% 和 12%。 YOLO系列是基于深度学习的端到端实时目标检测方法。本课程将手把手地教大家使用labelImg标注和使用YOLOv4训练自己的数据集。课程实战分为两个项目:单目标检测(足球目标检测)和多目标检测(足球和梅西同时检测)。 本课程的YOLOv4使用AlexyAB/darknet,在Windows系统上做项目演示。包括:安装软件环境、安装YOLOv4、标注自己的数据集、整理自己的数据集、修改配置文件、训练自己的数据集、测试训练出的网络模型、性能统计(mAP计算)和先验框聚类分析。还将介绍改善YOLOv4目标检测性能的技巧。 除本课程《Windows版YOLOv4目标检测实战:训练自己的数据集》外,本人将推出有关YOLOv4目标检测的系列课程。请持续关注该系列的其它视频课程,包括: 《Windows版YOLOv4目标检测实战:人脸口罩佩戴检测》 《Windows版YOLOv4目标检测实战:中国交通标志识别》 《Windows版YOLOv4目标检测:原理与源码解析》

Spring Boot -01- 快速入门篇(图文教程)

Spring Boot -01- 快速入门篇 今天开始不断整理 Spring Boot 2.0 版本学习笔记,大家可以在博客看到我的笔记,然后大家想看视频课程也可以到【慕课网】手机 app,去找【Spring Boot 2.0 深度实践】的课程,令人开心的是,课程完全免费! 什么是 Spring Boot? Spring Boot 是由 Pivotal 团队提供的全新框架。Spring Boot...

相关热词 c#中如何设置提交按钮 c#帮助怎么用 c# 读取合并单元格的值 c#带阻程序 c# 替换span内容 c# rpc c#控制台点阵字输出 c#do while循环 c#调用dll多线程 c#找出两个集合不同的
立即提问