caffe 模型classification.exe可用MATLAB不可用

在训练完自己的模型后,使用classification.exe运行分类模型时,是可以用的(但是概率总是显示0或者1,可能是训练图片太少),但是在MATLAB调用时总是出现错误:

Error using CHECK (line 4)
invalid Net handle

Error in caffe.Net (line 36)
CHECK(is_valid_handle(hNet_net), 'invalid Net handle');

Error in caffe.get_net (line 28)
net = caffe.Net(hNet);

Error in caffe.Net (line 31)
self = caffe.get_net(varargin{:});

    怎么回事呢。

2个回答

我也出现了这种问题,最后解决的呢???求告知

Csdn user default icon
上传中...
上传图片
插入图片
抄袭、复制答案,以达到刷声望分或其他目的的行为,在CSDN问答是严格禁止的,一经发现立刻封号。是时候展现真正的技术了!
其他相关推荐
将caffe的classification实例添加到自己的工程中
原本是一个vs2010的工程,为了使用caffe框架,就将h文件和cpp文件重新添加到了classification工程中。![图片说明](https://img-ask.csdn.net/upload/201610/30/1477817811_574571.png)环境是win10+vs2013的+caffe。如果独编译classification或者添加的过程都没有问题,但是一旦我在自己的工程中添加classification的实例再编译就会报错。我是直接include "classification.cpp"。报错是提示caffe.pb.h文件有错。 E:\caffe-master\include\caffe/proto/caffe.pb.h(1251): warning C4003: “min”宏的实参不足 1>E:\caffe-master\include\caffe/proto/caffe.pb.h(1251): error C2059: 语法错误:“)” 1>E:\caffe-master\include\caffe/proto/caffe.pb.h(1251): error C2334: “:”的前面有意外标记;跳过明显的函数体 1>E:\caffe-master\include\caffe/proto/caffe.pb.h(1258): warning C4003: “max”宏的实参不足 1>E:\caffe-master\include\caffe/proto/caffe.pb.h(1327): error C2143: 语法错误 : 缺少“)”(在“;”的前面) 1>E:\caffe-master\include\caffe/proto/caffe.pb.h(1327): error C2059: 语法错误:“)” 1>E:\caffe-master\include\caffe/proto/caffe.pb.h(1327): error C2238: 意外的标记位于“;”之前 1>E:\caffe-master\include\caffe/proto/caffe.pb.h(10996): error C3254: “caffe::FillerParameter”: 类包含显式重写“dim_size”,但并不从包含函数声明的接口派生 1>E:\caffe-master\include\caffe/proto/caffe.pb.h(10996): error C2838: “dim_size”: 成员声明中的非法限定名 1>E:\caffe-master\include\caffe/proto/caffe.pb.h(10999): error C3254: “caffe::FillerParameter”: 类包含显式重写“clear_dim”,但并不从包含函数声明的接口派生 1>E:\caffe-master\include\caffe/proto/caffe.pb.h(10999): error C2838: “clear_dim”: 成员声明中的非法限定名 1>E:\caffe-master\include\caffe/proto/caffe.pb.h(11002): error C3254: “caffe::FillerParameter”: 类包含显式重写“dim”,但并不从包含函数声明的接口派生 1>E:\caffe-master\include\caffe/proto/caffe.pb.h(11002): error C2838: “dim”: 成员声明中的非法限定名 1>E:\caffe-master\include\caffe/proto/caffe.pb.h(11006): error C3254: “caffe::FillerParameter”: 类包含显式重写“set_dim”,但并不从包含函数声明的接口派生 1>E:\caffe-master\include\caffe/proto/caffe.pb.h(11006): error C2838: “set_dim”: 成员声明中的非法限定名 1>E:\caffe-master\include\caffe/proto/caffe.pb.h(11010): error C3254: “caffe::FillerParameter”: 类包含显式重写“add_dim”,但并不从包含函数声明的接口派生 1>E:\caffe-master\include\caffe/proto/caffe.pb.h(11010): error C2838: “add_dim”: 成员声明中的非法限定名 1>E:\caffe-master\include\caffe/proto/caffe.pb.h(11015): error C3254: “caffe::FillerParameter”: 类包含显式重写“dim”,但并不从包含函数声明的接口派生 1>E:\caffe-master\include\caffe/proto/caffe.pb.h(11015): error C2838: “dim”: 成员声明中的非法限定名 1>E:\caffe-master\include\caffe/proto/caffe.pb.h(11020): error C3254: “caffe::FillerParameter”: 类包含显式重写“mutable_dim”,但并不从包含函数声明的接口派生 1>E:\caffe-master\include\caffe/proto/caffe.pb.h(11020): error C2838: “mutable_dim”: 成员声明中的非法限定名 1>E:\caffe-master\include\caffe/proto/caffe.pb.h(11030): error C3254: “caffe::FillerParameter”: 类包含显式重写“has_shape”,但并不从包含函数声明的接口派生 1>E:\caffe-master\include\caffe/proto/caffe.pb.h(11030): error C2838: “has_shape”: 成员声明中的非法限定名 1>E:\caffe-master\include\caffe/proto/caffe.pb.h(11033): error C3254: “caffe::FillerParameter”: 类包含显式重写“set_has_shape”,但并不从包含函数声明的接口派生 1>E:\caffe-master\include\caffe/proto/caffe.pb.h(11033): error C2838: “set_has_shape”: 成员声明中的非法限定名 1>E:\caffe-master\include\caffe/proto/caffe.pb.h(11036): error C3254: “caffe::FillerParameter”: 类包含显式重写“clear_has_shape”,但并不从包含函数声明的接口派生 1>E:\caffe-master\include\caffe/proto/caffe.pb.h(11036): error C2838: “clear_has_shape”: 成员声明中的非法限定名 1>E:\caffe-master\include\caffe/proto/caffe.pb.h(11039): error C3254: “caffe::FillerParameter”: 类包含显式重写“clear_shape”,但并不从包含函数声明的接口派生 1>E:\caffe-master\include\caffe/proto/caffe.pb.h(11039): error C2838: “clear_shape”: 成员声明中的非法限定名 1>E:\caffe-master\include\caffe/proto/caffe.pb.h(11043): error C3254: “caffe::FillerParameter”: 类包含显式重写“shape”,但并不从包含函数声明的接口派生 1>E:\caffe-master\include\caffe/proto/caffe.pb.h(11043): error C2838: “shape”: 成员声明中的非法限定名 1>E:\caffe-master\include\caffe/proto/caffe.pb.h(11047): error C3254: “caffe::FillerParameter”: 类包含显式重写“mutable_shape”,但并不从包含函数声明的接口派生 1>E:\caffe-master\include\caffe/proto/caffe.pb.h(11047): error C2838: “mutable_shape”: 成员声明中的非法限定名 1>E:\caffe-master\include\caffe/proto/caffe.pb.h(11053): error C3254: “caffe::FillerParameter”: 类包含显式重写“release_shape”,但并不从包含函数声明的接口派生 1>E:\caffe-master\include\caffe/proto/caffe.pb.h(11053): error C2838: “release_shape”: 成员声明中的非法限定名 1>E:\caffe-master\include\caffe/proto/caffe.pb.h(11059): error C3254: “caffe::FillerParameter”: 类包含显式重写“set_allocated_shape”,但并不从包含函数声明的接口派生 1>E:\caffe-master\include\caffe/proto/caffe.pb.h(11059): error C2838: “set_allocated_shape”: 成员声明中的非法限定名 1>E:\caffe-master\include\caffe/proto/caffe.pb.h(11071): error C3254: “caffe::FillerParameter”: 类包含显式重写“data_size”,但并不从包含函数声明的接口派生 1>E:\caffe-master\include\caffe/proto/caffe.pb.h(11071): error C2838: “data_size”: 成员声明中的非法限定名 1>E:\caffe-master\include\caffe/proto/caffe.pb.h(11074): error C3254: “caffe::FillerParameter”: 类包含显式重写“clear_data”,但并不从包含函数声明的接口派生 1>E:\caffe-master\include\caffe/proto/caffe.pb.h(11074): error C2838: “clear_data”: 成员声明中的非法限定名 1>E:\caffe-master\include\caffe/proto/caffe.pb.h(11077): error C3254: “caffe::FillerParameter”: 类包含显式重写“data”,但并不从包含函数声明的接口派生 1>E:\caffe-master\include\caffe/proto/caffe.pb.h(11077): error C2838: “data”: 成员声明中的非法限定名 1>E:\caffe-master\include\caffe/proto/caffe.pb.h(11081): error C3254: “caffe::FillerParameter”: 类包含显式重写“set_data”,但并不从包含函数声明的接口派生 1>E:\caffe-master\include\caffe/proto/caffe.pb.h(11081): error C2838: “set_data”: 成员声明中的非法限定名 1>E:\caffe-master\include\caffe/proto/caffe.pb.h(11085): error C3254: “caffe::FillerParameter”: 类包含显式重写“add_data”,但并不从包含函数声明的接口派生 1>E:\caffe-master\include\caffe/proto/caffe.pb.h(11085): error C2838: “add_data”: 成员声明中的非法限定名 1>E:\caffe-master\include\caffe/proto/caffe.pb.h(11090): error C3254: “caffe::FillerParameter”: 类包含显式重写“data”,但并不从包含函数声明的接口派生 1>E:\caffe-master\include\caffe/proto/caffe.pb.h(11090): error C2838: “data”: 成员声明中的非法限定名 1>E:\caffe-master\include\caffe/proto/caffe.pb.h(11095): error C3254: “caffe::FillerParameter”: 类包含显式重写“mutable_data”,但并不从包含函数声明的接口派生 1>E:\caffe-master\include\caffe/proto/caffe.pb.h(11095): error C2838: “mutable_data”: 成员声明中的非法限定名 1>E:\caffe-master\include\caffe/proto/caffe.pb.h(11101): error C3254: “caffe::FillerParameter”: 类包含显式重写“diff_size”,但并不从包含函数声明的接口派生 1>E:\caffe-master\include\caffe/proto/caffe.pb.h(11101): error C2838: “diff_size”: 成员声明中的非法限定名 1>E:\caffe-master\include\caffe/proto/caffe.pb.h(11104): error C3254: “caffe::FillerParameter”: 类包含显式重写“clear_diff”,但并不从包含函数声明的接口派生 1>E:\caffe-master\include\caffe/proto/caffe.pb.h(11104): error C2838: “clear_diff”: 成员声明中的非法限定名 1>E:\caffe-master\include\caffe/proto/caffe.pb.h(11107): error C3254: “caffe::FillerParameter”: 类包含显式重写“diff”,但并不从包含函数声明的接口派生 1>E:\caffe-master\include\caffe/proto/caffe.pb.h(11107): error C2838: “diff”: 成员声明中的非法限定名 1>E:\caffe-master\include\caffe/proto/caffe.pb.h(11111): error C3254: “caffe::FillerParameter”: 类包含显式重写“set_diff”,但并不从包含函数声明的接口派生 1>E:\caffe-master\include\caffe/proto/caffe.pb.h(11111): error C2838: “set_diff”: 成员声明中的非法限定名 1>E:\caffe-master\include\caffe/proto/caffe.pb.h(11115): error C3254: “caffe::FillerParameter”: 类包含显式重写“add_diff”,但并不从包含函数声明的接口派生 1>E:\caffe-master\include\caffe/proto/caffe.pb.h(11115): error C2838: “add_diff”: 成员声明中的非法限定名 1>E:\caffe-master\include\caffe/proto/caffe.pb.h(11120): error C3254: “caffe::FillerParameter”: 类包含显式重写“diff”,但并不从包含函数声明的接口派生 1>E:\caffe-master\include\caffe/proto/caffe.pb.h(11120): error C2838: “diff”: 成员声明中的非法限定名 1>E:\caffe-master\include\caffe/proto/caffe.pb.h(11125): error C3254: “caffe::FillerParameter”: 类包含显式重写“mutable_diff”,但并不从包含函数声明的接口派生 1>E:\caffe-master\include\caffe/proto/caffe.pb.h(11125): error C2838: “mutable_diff”: 成员声明中的非法限定名 1>E:\caffe-master\include\caffe/proto/caffe.pb.h(11131): error C3254: “caffe::FillerParameter”: 类包含显式重写“double_data_size”,但并不从包含函数声明的接口派生 1>E:\caffe-master\include\caffe/proto/caffe.pb.h(11131): error C2838: “double_data_size”: 成员声明中的非法限定名 1>E:\caffe-master\include\caffe/proto/caffe.pb.h(11134): error C3254: “caffe::FillerParameter”: 类包含显式重写“clear_double_data”,但并不从包含函数声明的接口派生 1>E:\caffe-master\include\caffe/proto/caffe.pb.h(11134): error C2838: “clear_double_data”: 成员声明中的非法限定名 1>E:\caffe-master\include\caffe/proto/caffe.pb.h(11137): error C3254: “caffe::FillerParameter”: 类包含显式重写“double_data”,但并不从包含函数声明的接口派生 1>E:\caffe-master\include\caffe/proto/caffe.pb.h(11137): error C2838: “double_data”: 成员声明中的非法限定名
Windows caffe 配置matlab 接口运行classification_demo.m文件matlab出现内部错误
在cpu环境下可以使用,在使用GPU模式编译matcaffe成功后,运行classification_demo.m文件,matlab提示出现内部错误,然后直接崩掉了,错误如下图所示,理论上来说有无gpu在编译之后的配置都是一样的呀,怎么会出现这样的问题,请问大神怎么解决![图片说明](http://forum.csdn.net/PointForum/ui/scripts/csdn/Plugin/001/face/54.gif)![图片](https://img-ask.csdn.net/upload/201611/30/1480474697_107805.jpg)
关于caffe-Windows下的classification.cpp编译问题
我在Windows下已经将caffe的环境啥的都编译通过了,没有任何问题,然后也自己生成了对应的mean.binaryproto文件,在运行classification.cpp文件时,SetMean函数 一直报错Check failed,到底是什么原因,求解救
caffe编译时出现make: protoc:命令未找到
make all -j8 时出现下面问题: ``` PROTOC src/caffe/proto/caffe.proto make: protoc:命令未找到 Makefile:629: recipe for target '.build_release/src/caffe/proto/caffe.pb.cc' failed make: *** [.build_release/src/caffe/proto/caffe.pb.cc] Error 127 make: *** 正在等待未完成的任务.... ```
【caffe例子问题】 net_->num_inputs() 为0
![图片说明](https://img-ask.csdn.net/upload/201807/03/1530589896_308277.png) 请问一下 net_->num_inputs() 这个值为0 怎么办 用的caffe 的classification.cpp的例子 ./predict.bin cifar10_quick.prototxt cifar10_quick_iter_5000.caffemodel.h5 mean.binaryproto synset_words.txt car.png @huang714 @ littlejade1214 具体怎么获取可以详细告知一下嘛 谢谢! 还有 我想不通为什么要用到训练集的 mean.binaryproto , 真奇怪。。
ubuntu16.04安装openpose编译出现错误/libopenpose.so.1.4.0:对‘caffe::Net未定义的引用
> ![图片说明](https://img-ask.csdn.net/upload/201903/07/1551930959_664828.png) caffe编译测试通过,将生成的caffe.pb.h和caffe.pb.cc文件放入指定文件这一步也做了,在openpose/build 文件下执行make -j'nproc'出现如图错误,感谢
错误显示Field numbers must be positive integers.
make pycaffe出现下列问题 PROTOC src/caffe/proto/caffe.proto caffe.proto:793:36: Field numbers must be positive integers. Makefile:632: recipe for target '.build_release/src/caffe/proto/caffe.pb.cc' failed make: *** [.build_release/src/caffe/proto/caffe.pb.cc] Error 1
error LNK1120: 1 个无法解析的外部命令private\caffe_.mexw64
按照您的方法https://github.com/happynear/caffe-windows,在Windows下配置caffe,出现错误 1392 error LNK1120: 1 个无法解析的外部命令 D:\Program Files (x86)\caffe_master\caffe-windows-master\caffe-windows-master\matlab\+caffe\private\caffe_.mexw64 m
caffe编译 Mainbuilder.sln遇到问题求解
打开MainBuilder.sln后用release x64生成,出现如下错误 ![图片说明](https://img-ask.csdn.net/upload/201611/22/1479778670_354796.png) ![图片说明](https://img-ask.csdn.net/upload/201611/22/1479778683_782826.png) cuda版本8.0 文件中版本号已修改
windows caffe 图片处理
我现在想用caffe convert imageset.exe通过命令行的方式将一个文件夹图片转化为Leveldb方式,但是我在网上查了好几个格式参数都没有看懂。下面是我按照一个网站上面的格式写的,但是出现了错误,好像是系统熵源不足之类的错误: SET GLOG_logtostderr=1 E:\CaffeFCNDeepLearn\caffe-master\Build\x64\Release\convert_imageset.exe C:\Users\Administrator\Desktop\image\train_label.txt C:\Users\Administrator\Desktop\lev --backend leveldb --resize_height=256 --resize_width=256 --shuffle --gray true pause 请问正确的应该怎么写呢?谢谢
caffe中draw_net 无法使用
在调用caffe中draw_net 的时候报错 ``` sudo python /home/yuanshuai/caffe/python/draw_net.py /home/yuanshuai/caffe/examples/mnist/lenet_train_test.prototxt /home/yuanshuai/lenet.png --rankdir=LR ``` 错误如下: ``` Drawing net to /home/yuanshuai/lenet.png Traceback (most recent call last): File "/home/yuanshuai/caffe/python/draw_net.py", line 58, in <module> main() File "/home/yuanshuai/caffe/python/draw_net.py", line 54, in main phase) File "/home/yuanshuai/caffe/python/caffe/draw.py", line 244, in draw_net_to_file fid.write(draw_net(caffe_net, rankdir, ext, phase)) File "/home/yuanshuai/caffe/python/caffe/draw.py", line 223, in draw_net return get_pydot_graph(caffe_net, rankdir, phase=phase).create(format=ext) File "/home/yuanshuai/caffe/python/caffe/draw.py", line 167, in get_pydot_graph node_label = get_layer_label(layer, rankdir) File "/home/yuanshuai/caffe/python/caffe/draw.py", line 107, in get_layer_label layer.pooling_param.kernel_size[0] if len(layer.pooling_param.kernel_size._values) else 1, AttributeError: 'int' object has no attribute '_values' ```
编译opencv gpu版时报错,谢谢
1>D:\opencv3.4world\modules\dnn\src\caffe\caffe_io.cpp(1124): error C2440: “<function-style-cast>”: **无法从“bool”转换为“google::protobuf::TextFormat::Parser”**
Ubuntu16.04下 convert_imageset.cpp编译和使用
​我的系统是Ubuntu16.04 想用caffe中的googlenet模型训练自己的图片。在预处理中需要用工具 convert_imageset.cpp,但用之前需要先编译为.EXE可执行才能使用。在网上查到“convert_imageset.cpp和caffe.cpp是一样的,两个都包含main入口,所以只需要把caffe删掉,换成convert_imageset就可以在caffe环境中跑了,而不需要为了跑起来这个cpp单独配无数个文件。”用G++编译,答提示报错convert_imageset.cpp:21:34 没有那个文件或目录。不知如何具体操作,请大神指教,多谢!!
caffe.cpp运行打不开,显示无法打开程序caffe.mex64,请教下各位大神这是什么问题
private文件夹下找不到caffe.mex64 。 有些时候还说无法启动程序 libcaffe.lib![图片说明](https://img-ask.csdn.net/upload/201710/25/1508900845_575457.jpg)
在Linux服务器上配置python(无root权限),make pycaffe出现问题。
根据教程https://blog.csdn.net/jiajinrang93/article/details/80337513?tdsourcetag=s_pctim_aiomsg 在Linux服务器上配置caffe, cmake 时出现: ``` CMake Error at CMakeLists.txt:107 (add_dependencies): The dependency target "pycaffe" of target "pytest" does not exist. ``` 但此错误不影响后续make 和 make install 以及 make runtest都可以通过 ![图片说明](https://img-ask.csdn.net/upload/201904/19/1555673994_130280.jpg) 然后在配置python接口时使用命令: ```python cd ~/caffe make pycaffe ``` 出现错误: ``` CXX .build_release/src/caffe/proto/caffe.pb.cc In file included from .build_release/src/caffe/proto/caffe.pb.cc:4:0: .build_release/src/caffe/proto/caffe.pb.h:9:42: fatal error: google/protobuf/stubs/common.h: No such file or directory compilation terminated. Makefile:598: recipe for target '.build_release/src/caffe/proto/caffe.pb.o' failed make: *** [.build_release/src/caffe/proto/caffe.pb.o] Error 1 ``` 以上问题已经解决√ --- 新的问题: make pycaffe出现 ``` LD -o .build_release/lib/libcaffe.so.1.0.0 /usr/bin/ld: cannot find -lhdf5_serial_hl /usr/bin/ld: cannot find -lhdf5_serial /usr/bin/ld: cannot find -lboost_python collect2: error: ld returned 1 exit status Makefile:582: recipe for target '.build_release/lib/libcaffe.so.1.0.0' failed make: *** [.build_release/lib/libcaffe.so.1.0.0] Error 1 ```
caffe 运行mnist实例出错
在使用Caffe运行mnist examples时报错,所有步骤都是按照网上步骤一步一步进行的,相当崩溃! 目前错误出现在最后一步,自己间了一个train_mnist_bat,写入 ..\..\Build\x64\Release\caffe.exe train--solver=../../examples/mnist/lenet_solver.prototxt Pause 后,双击运行,结果报错。错误如下: Unknown action: train--solver=../../examples/mnist/lenet_solver.prototxt 反复检查过路径这些,代码都是按照网上步骤撸的,就是报错训练不了,欲哭无泪啊。。。希望大神解答!DL小白跪谢!
caffe make 出错 boost重装了也没有用 求高手!支付宝发红包
sun@sunwin:/RMPE$ cp Makefile.config.example Makefile.config sun@sunwin:/RMPE$ sudo make all -j4 [sudo] sun 的密码: PROTOC src/caffe/proto/caffe.proto CXX src/caffe/blob.cpp CXX src/caffe/layer_factory.cpp CXX src/caffe/syncedmem.cpp CXX src/caffe/common.cpp CXX src/caffe/solvers/nesterov_solver.cpp In file included from /usr/local/include/boost/config.hpp:61:0, from /usr/local/include/boost/thread/detail/platform.hpp:14, from /usr/local/include/boost/thread/thread_only.hpp:12, from /usr/local/include/boost/thread/thread.hpp:12, from /usr/local/include/boost/thread.hpp:13, from src/caffe/common.cpp:1: /usr/local/include/boost/core/ignore_unused.hpp:17:19: error: ‘constexpr’ does not name a type BOOST_FORCEINLINE BOOST_CXX14_CONSTEXPR void ignore_unused(Ts const& ...) ^ /usr/local/include/boost/core/ignore_unused.hpp:17:19: note: C++11 ‘constexpr’ only available with -std=c++11 or -std=gnu++11 /usr/local/include/boost/core/ignore_unused.hpp:21:19: error: ‘constexpr’ does not name a type BOOST_FORCEINLINE BOOST_CXX14_CONSTEXPR void ignore_unused() ^ /usr/local/include/boost/core/ignore_unused.hpp:21:19: note: C++11 ‘constexpr’ only available with -std=c++11 or -std=gnu++11 In file included from /usr/local/include/boost/thread/mutex.hpp:16:0, from /usr/local/include/boost/thread/pthread/thread_data.hpp:13, from src/caffe/common.cpp:1: /usr/include/c++/5/bits/stl_pair.h:214:5: note: template argument deduction/substitution failed: In file included from /usr/local/include/boost/type_index/stl_type_index.hpp:22:0, from /usr/local/include/boost/type_index.hpp:29, from /usr/local/include/boost/function/function_base.hpp:21, from /usr/local/include/boost/function/detail/prologue.hpp:17, from /usr/local/include/boost/function/function_template.hpp:13, from /usr/local/include/boost/function/detail/maybe_include.hpp:13, from /usr/local/include/boost/function/function0.hpp:11, from /usr/local/include/boost/python/errors.hpp:13, from /usr/local/include/boost/python/handle.hpp:11, from /usr/local/include/boost/python/args_fwd.hpp:10, from /usr/local/include/boost/python/args.hpp:10, from /usr/local/include/boost/python.hpp:11, from src/caffe/layer_factory.cpp:4: /usr/local/include/boost/type_index/type_index_facade.hpp:191:25: note: ‘boost::typeindex::stl_type_index’ is not derived from ‘const std::pair<_T1, _T2>’ return Derived(lhs) == rhs; ^ src/caffe/layer_factory.cpp: In function ‘boost::shared_ptrcaffe::Layer<Dtype > caffe::GetTanHLayer(const caffe::LayerParameter&) [with Dtype = double]’: src/caffe/layer_factory.cpp:237:1: warning: control reaches end of non-void function [-Wreturn-type] } ^ src/caffe/layer_factory.cpp: In function ‘boost::shared_ptrcaffe::Layer<Dtype > caffe::GetTanHLayer(const caffe::LayerParameter&) [with Dtype = float]’: src/caffe/layer_factory.cpp: In function ‘boost::shared_ptrcaffe::Layer<Dtype > caffe::GetConvolutionLayer(const caffe::LayerParameter&) [with Dtype = double]’: src/caffe/layer_factory.cpp:71:1: warning: control reaches end of non-void function [-Wreturn-type] } ^ src/caffe/layer_factory.cpp: In function ‘boost::shared_ptrcaffe::Layer<Dtype > caffe::GetConvolutionLayer(const caffe::LayerParameter&) [with Dtype = float]’: src/caffe/layer_factory.cpp:71:1: warning: control reaches end of non-void function [-Wreturn-type] } ^ Makefile:575: recipe for target '.build_release/src/caffe/layer_factory.o' failed make: *** [.build_release/src/caffe/layer_factory.o] Error 1 Steps to reproduce If you are having difficulty building Caffe or training a model, please ask the caffe-users mailing list. If you are reporting a build error that seems to be due to a bug in Caffe, please attach your build configuration (either Makefile.config or CMakeCache.txt) and the output of the make (or cmake) command. MY system configuration Operating system: ubuntu16.04 CUDA version (if applicable):CUDA 8.0 CUDNN version (if applicable): CUDnn5.0 Python or MATLAB version (for pycaffe and matcaffe respectively):Python 2.7 MATLAB2014a 急求高手解决 ! 解决了支付宝直接发红包!
make mattest出现下面的错误有谁知道是什么原因吗?
编译matcaffe成功后,make mattest出现下面的错误,有谁知道是什么原因吗? ``` Invalid MEX-file '/home/caffe/matlab/+caffe/private/caffe_.mexa64': /usr/local/lib/libopencv_imgcodecs.so.3.4: undefined symbol: _ZN2cv6detail17check_failed_autoEmmRKNS0_12CheckContextE.   Error in caffe.set_mode_cpu (line 5) caffe_('set_mode_cpu');   Error in caffe.run_tests (line 6) caffe.set_mode_cpu(); ubuntu matlab:R2018b opencv:3.4.7 gcc/g++:5.5 ``` 向各位大佬求救啊啊啊,已经困于这个问题很久了
caffe-ssd在create_data.sh的时候报错No module named numpy,可是我已经有了numpy啊!
caffe-ssd在create_data.sh的时候报错No module named numpy,可是我已经有了numpy啊! 这是我报错的信息 ``` Traceback (most recent call last): File "/home/pj/caffe-ssd/data/widerface/../../scripts/create_annoset.py", line 7, in <module> from caffe.proto import caffe_pb2 File "/home/pj/caffe-ssd/python/caffe/__init__.py", line 1, in <module> from .pycaffe import Net, SGDSolver, NesterovSolver, AdaGradSolver, RMSPropSolver, AdaDeltaSolver, AdamSolver File "/home/pj/caffe-ssd/python/caffe/pycaffe.py", line 11, in <module> import numpy as np ImportError: No module named numpy Traceback (most recent call last): File "/home/pj/caffe-ssd/data/widerface/../../scripts/create_annoset.py", line 7, in <module> from caffe.proto import caffe_pb2 File "/home/pj/caffe-ssd/python/caffe/__init__.py", line 1, in <module> from .pycaffe import Net, SGDSolver, NesterovSolver, AdaGradSolver, RMSPropSolver, AdaDeltaSolver, AdamSolver File "/home/pj/caffe-ssd/python/caffe/pycaffe.py", line 11, in <module> import numpy as np ImportError: No module named numpy ``` 正常导入numpy是可以的 ``` Python 3.5.2 (default, Nov 12 2018, 13:43:14) [GCC 5.4.0 20160609] on linux Type "help", "copyright", "credits" or "license" for more information. >>> import numpy >>> ``` ~/.bashrc 中的文件导入了caffe-ssd的python路径 ``` export PYTHONPATH=~/caffe-ssd/python:$PYTHONPATH ```
相见恨晚的超实用网站
搞学习 知乎:www.zhihu.com 简答题:http://www.jiandati.com/ 网易公开课:https://open.163.com/ted/ 网易云课堂:https://study.163.com/ 中国大学MOOC:www.icourse163.org 网易云课堂:study.163.com 哔哩哔哩弹幕网:www.bilibili.com 我要自学网:www.51zxw
花了20分钟,给女朋友们写了一个web版群聊程序
参考博客 [1]https://www.byteslounge.com/tutorials/java-ee-html5-websocket-example
爬虫福利二 之 妹子图网MM批量下载
爬虫福利一:27报网MM批量下载    点击 看了本文,相信大家对爬虫一定会产生强烈的兴趣,激励自己去学习爬虫,在这里提前祝:大家学有所成! 目标网站:妹子图网 环境:Python3.x 相关第三方模块:requests、beautifulsoup4 Re:各位在测试时只需要将代码里的变量 path 指定为你当前系统要保存的路径,使用 python xxx.py 或IDE运行即可。
字节跳动视频编解码面经
引言 本文主要是记录一下面试字节跳动的经历。 三四月份投了字节跳动的实习(图形图像岗位),然后hr打电话过来问了一下会不会opengl,c++,shador,当时只会一点c++,其他两个都不会,也就直接被拒了。 七月初内推了字节跳动的提前批,因为内推没有具体的岗位,hr又打电话问要不要考虑一下图形图像岗,我说实习投过这个岗位不合适,不会opengl和shador,然后hr就说秋招更看重基础。我当时
Java学习的正确打开方式
在博主认为,对于入门级学习java的最佳学习方法莫过于视频+博客+书籍+总结,前三者博主将淋漓尽致地挥毫于这篇博客文章中,至于总结在于个人,实际上越到后面你会发现学习的最好方式就是阅读参考官方文档其次就是国内的书籍,博客次之,这又是一个层次了,这里暂时不提后面再谈。博主将为各位入门java保驾护航,各位只管冲鸭!!!上天是公平的,只要不辜负时间,时间自然不会辜负你。 何谓学习?博主所理解的学习,它
程序员必须掌握的核心算法有哪些?
由于我之前一直强调数据结构以及算法学习的重要性,所以就有一些读者经常问我,数据结构与算法应该要学习到哪个程度呢?,说实话,这个问题我不知道要怎么回答你,主要取决于你想学习到哪些程度,不过针对这个问题,我稍微总结一下我学过的算法知识点,以及我觉得值得学习的算法。这些算法与数据结构的学习大多数是零散的,并没有一本把他们全部覆盖的书籍。下面是我觉得值得学习的一些算法以及数据结构,当然,我也会整理一些看过
大学四年自学走来,这些私藏的实用工具/学习网站我贡献出来了
大学四年,看课本是不可能一直看课本的了,对于学习,特别是自学,善于搜索网上的一些资源来辅助,还是非常有必要的,下面我就把这几年私藏的各种资源,网站贡献出来给你们。主要有:电子书搜索、实用工具、在线视频学习网站、非视频学习网站、软件下载、面试/求职必备网站。 注意:文中提到的所有资源,文末我都给你整理好了,你们只管拿去,如果觉得不错,转发、分享就是最大的支持了。 一、电子书搜索 对于大部分程序员...
linux系列之常用运维命令整理笔录
本博客记录工作中需要的linux运维命令,大学时候开始接触linux,会一些基本操作,可是都没有整理起来,加上是做开发,不做运维,有些命令忘记了,所以现在整理成博客,当然vi,文件操作等就不介绍了,慢慢积累一些其它拓展的命令,博客不定时更新 顺便拉下票,我在参加csdn博客之星竞选,欢迎投票支持,每个QQ或者微信每天都可以投5票,扫二维码即可,http://m234140.nofollow.ax.
比特币原理详解
一、什么是比特币 比特币是一种电子货币,是一种基于密码学的货币,在2008年11月1日由中本聪发表比特币白皮书,文中提出了一种去中心化的电子记账系统,我们平时的电子现金是银行来记账,因为银行的背后是国家信用。去中心化电子记账系统是参与者共同记账。比特币可以防止主权危机、信用风险。其好处不多做赘述,这一层面介绍的文章很多,本文主要从更深层的技术原理角度进行介绍。 二、问题引入 假设现有4个人...
Python 基础(一):入门必备知识
目录1 标识符2 关键字3 引号4 编码5 输入输出6 缩进7 多行8 注释9 数据类型10 运算符10.1 常用运算符10.2 运算符优先级 1 标识符 标识符是编程时使用的名字,用于给变量、函数、语句块等命名,Python 中标识符由字母、数字、下划线组成,不能以数字开头,区分大小写。 以下划线开头的标识符有特殊含义,单下划线开头的标识符,如:_xxx ,表示不能直接访问的类属性,需通过类提供
这30个CSS选择器,你必须熟记(上)
关注前端达人,与你共同进步CSS的魅力就是让我们前端工程师像设计师一样进行网页的设计,我们能轻而易举的改变颜色、布局、制作出漂亮的影音效果等等,我们只需要改几行代码,不需...
国产开源API网关项目进入Apache孵化器:APISIX
点击蓝色“程序猿DD”关注我回复“资源”获取独家整理的学习资料!近日,又有一个开源项目加入了这个Java开源界大名鼎鼎的Apache基金会,开始进行孵化器。项目名称:AP...
程序员接私活怎样防止做完了不给钱?
首先跟大家说明一点,我们做 IT 类的外包开发,是非标品开发,所以很有可能在开发过程中会有这样那样的需求修改,而这种需求修改很容易造成扯皮,进而影响到费用支付,甚至出现做完了项目收不到钱的情况。 那么,怎么保证自己的薪酬安全呢? 我们在开工前,一定要做好一些证据方面的准备(也就是“讨薪”的理论依据),这其中最重要的就是需求文档和验收标准。一定要让需求方提供这两个文档资料作为开发的基础。之后开发
网页实现一个简单的音乐播放器(大佬别看。(⊙﹏⊙))
今天闲着无事,就想写点东西。然后听了下歌,就打算写个播放器。 于是乎用h5 audio的加上js简单的播放器完工了。 欢迎 改进 留言。 演示地点跳到演示地点 html代码如下`&lt;!DOCTYPE html&gt; &lt;html&gt; &lt;head&gt; &lt;title&gt;music&lt;/title&gt; &lt;meta charset="utf-8"&gt
Python十大装B语法
Python 是一种代表简单思想的语言,其语法相对简单,很容易上手。不过,如果就此小视 Python 语法的精妙和深邃,那就大错特错了。本文精心筛选了最能展现 Python 语法之精妙的十个知识点,并附上详细的实例代码。如能在实战中融会贯通、灵活使用,必将使代码更为精炼、高效,同时也会极大提升代码B格,使之看上去更老练,读起来更优雅。 1. for - else 什么?不是 if 和 else 才
数据库优化 - SQL优化
前面一篇文章从实例的角度进行数据库优化,通过配置一些参数让数据库性能达到最优。但是一些“不好”的SQL也会导致数据库查询变慢,影响业务流程。本文从SQL角度进行数据库优化,提升SQL运行效率。 判断问题SQL 判断SQL是否有问题时可以通过两个表象进行判断: 系统级别表象 CPU消耗严重 IO等待严重 页面响应时间过长
2019年11月中国大陆编程语言排行榜
2019年11月2日,我统计了某招聘网站,获得有效程序员招聘数据9万条。针对招聘信息,提取编程语言关键字,并统计如下: 编程语言比例 rank pl_ percentage 1 java 33.62% 2 c/c++ 16.42% 3 c_sharp 12.82% 4 javascript 12.31% 5 python 7.93% 6 go 7.25% 7
通俗易懂地给女朋友讲:线程池的内部原理
餐厅的约会 餐盘在灯光的照耀下格外晶莹洁白,女朋友拿起红酒杯轻轻地抿了一小口,对我说:“经常听你说线程池,到底线程池到底是个什么原理?”我楞了一下,心里想女朋友今天是怎么了,怎么突然问出这么专业的问题,但做为一个专业人士在女朋友面前也不能露怯啊,想了一下便说:“我先给你讲讲我前同事老王的故事吧!” 大龄程序员老王 老王是一个已经北漂十多年的程序员,岁数大了,加班加不动了,升迁也无望,于是拿着手里
经典算法(5)杨辉三角
杨辉三角 是经典算法,这篇博客对它的算法思想进行了讲解,并有完整的代码实现。
编写Spring MVC控制器的14个技巧
本期目录 1.使用@Controller构造型 2.实现控制器接口 3.扩展AbstractController类 4.为处理程序方法指定URL映射 5.为处理程序方法指定HTTP请求方法 6.将请求参数映射到处理程序方法 7.返回模型和视图 8.将对象放入模型 9.处理程序方法中的重定向 10.处理表格提交和表格验证 11.处理文件上传 12.在控制器中自动装配业务类 ...
腾讯算法面试题:64匹马8个跑道需要多少轮才能选出最快的四匹?
昨天,有网友私信我,说去阿里面试,彻底的被打击到了。问了为什么网上大量使用ThreadLocal的源码都会加上private static?他被难住了,因为他从来都没有考虑过这个问题。无独有偶,今天笔者又发现有网友吐槽了一道腾讯的面试题,我们一起来看看。 腾讯算法面试题:64匹马8个跑道需要多少轮才能选出最快的四匹? 在互联网职场论坛,一名程序员发帖求助到。二面腾讯,其中一个算法题:64匹
面试官:你连RESTful都不知道我怎么敢要你?
面试官:了解RESTful吗? 我:听说过。 面试官:那什么是RESTful? 我:就是用起来很规范,挺好的 面试官:是RESTful挺好的,还是自我感觉挺好的 我:都挺好的。 面试官:… 把门关上。 我:… 要干嘛?先关上再说。 面试官:我说出去把门关上。 我:what ?,夺门而去 文章目录01 前言02 RESTful的来源03 RESTful6大原则1. C-S架构2. 无状态3.统一的接
求小姐姐抠图竟遭白眼?痛定思痛,我决定用 Python 自力更生!
点击蓝色“Python空间”关注我丫加个“星标”,每天一起快乐的学习大家好,我是 Rocky0429,一个刚恰完午饭,正在用刷网页浪费生命的蒟蒻...一堆堆无聊八卦信息的网页内容慢慢使我的双眼模糊,一个哈欠打出了三斤老泪,就在此时我看到了一张图片:是谁!是谁把我女朋友的照片放出来的!awsl!太好看了叭...等等,那个背景上的一堆鬼画符是什么鬼?!真是看不下去!叔叔婶婶能忍,隔壁老王的三姨妈的四表...
为啥国人偏爱Mybatis,而老外喜欢Hibernate/JPA呢?
关于SQL和ORM的争论,永远都不会终止,我也一直在思考这个问题。昨天又跟群里的小伙伴进行了一番讨论,感触还是有一些,于是就有了今天这篇文。 声明:本文不会下关于Mybatis和JPA两个持久层框架哪个更好这样的结论。只是摆事实,讲道理,所以,请各位看官勿喷。 一、事件起因 关于Mybatis和JPA孰优孰劣的问题,争论已经很多年了。一直也没有结论,毕竟每个人的喜好和习惯是大不相同的。我也看
SQL-小白最佳入门sql查询一
不要偷偷的查询我的个人资料,即使你再喜欢我,也不要这样,真的不好;
项目中的if else太多了,该怎么重构?
介绍 最近跟着公司的大佬开发了一款IM系统,类似QQ和微信哈,就是聊天软件。我们有一部分业务逻辑是这样的 if (msgType = "文本") { // dosomething } else if(msgType = "图片") { // doshomething } else if(msgType = "视频") { // doshomething } else { // doshom...
致 Python 初学者
欢迎来到“Python进阶”专栏!来到这里的每一位同学,应该大致上学习了很多 Python 的基础知识,正在努力成长的过程中。在此期间,一定遇到了很多的困惑,对未来的学习方向感到迷茫。我非常理解你们所面临的处境。我从2007年开始接触 python 这门编程语言,从2009年开始单一使用 python 应对所有的开发工作,直至今天。回顾自己的学习过程,也曾经遇到过无数的困难,也曾经迷茫过、困惑过。开办这个专栏,正是为了帮助像我当年一样困惑的 Python 初学者走出困境、快速成长。希望我的经验能真正帮到你
“狗屁不通文章生成器”登顶GitHub热榜,分分钟写出万字形式主义大作
一、垃圾文字生成器介绍 最近在浏览GitHub的时候,发现了这样一个骨骼清奇的雷人项目,而且热度还特别高。 项目中文名:狗屁不通文章生成器 项目英文名:BullshitGenerator 根据作者的介绍,他是偶尔需要一些中文文字用于GUI开发时测试文本渲染,因此开发了这个废话生成器。但由于生成的废话实在是太过富于哲理,所以最近已经被小伙伴们给玩坏了。 他的文风可能是这样的: 你发现,...
程序员:我终于知道post和get的区别
是一个老生常谈的话题,然而随着不断的学习,对于以前的认识有很多误区,所以还是需要不断地总结的,学而时习之,不亦说乎
《程序人生》系列-这个程序员只用了20行代码就拿了冠军
你知道的越多,你不知道的越多 点赞再看,养成习惯GitHub上已经开源https://github.com/JavaFamily,有一线大厂面试点脑图,欢迎Star和完善 前言 这一期不算《吊打面试官》系列的,所有没前言我直接开始。 絮叨 本来应该是没有这期的,看过我上期的小伙伴应该是知道的嘛,双十一比较忙嘛,要值班又要去帮忙拍摄年会的视频素材,还得搞个程序员一天的Vlog,还要写BU...
相关热词 c# clr dll c# 如何orm c# 固定大小的字符数组 c#框架设计 c# 删除数据库 c# 中文文字 图片转 c# 成员属性 接口 c#如何将程序封装 16进制负数转换 c# c#练手项目
立即提问