请教:尝试opencv2.4.13在linux下编译程序的报错

源代码:#include

#include

#include

using namespace cv;

int main()

{

VideoCapture cap(0);
if(!cap.isOpened())

{

return -1;

}

Mat frame;

bool stop = false;

while(!stop)

{

cap.read(frame);

imshow("Video",frame);

if(waitKey(30)==27) //Esc键退出

{

stop = true;

}

}

return 0;

}

报错:~$ g++ -o opencvq opencv.cpp
/tmp/ccQJKVIi.o: In function main':
opencv.cpp:(.text+0x29): undefined reference to
cv::VideoCapture::VideoCapture(int)'
opencv.cpp:(.text+0x38): undefined reference to cv::VideoCapture::isOpened() const'
opencv.cpp:(.text+0x80): undefined reference to
cv::VideoCapture::read(cv::Mat&)'
opencv.cpp:(.text+0xf9): undefined reference to cv::Mat::ones(cv::Size_<int>, int)'
opencv.cpp:(.text+0x146): undefined reference to
cv::VideoCapture::read(cv::Mat&)'
opencv.cpp:(.text+0x33d): undefined reference to cv::_OutputArray::_OutputArray(cv::Mat&)'
opencv.cpp:(.text+0x356): undefined reference to
cv::_InputArray::_InputArray(cv::Mat const&)'
opencv.cpp:(.text+0x36f): undefined reference to cv::_InputArray::_InputArray(cv::Mat const&)'
opencv.cpp:(.text+0x3a1): undefined reference to
cv::addWeighted(cv::_InputArray const&, double, cv::_InputArray const&, double, double, cv::_OutputArray const&, int)'
opencv.cpp:(.text+0x3ba): undefined reference to cv::_InputArray::_InputArray(cv::Mat const&)'
opencv.cpp:(.text+0x3fd): undefined reference to
cv::imshow(std::string const&, cv::_InputArray const&)'
opencv.cpp:(.text+0x425): undefined reference to cv::waitKey(int)'
opencv.cpp:(.text+0x489): undefined reference to
cv::VideoCapture::~VideoCapture()'
opencv.cpp:(.text+0x51a): undefined reference to cv::VideoCapture::~VideoCapture()'
/tmp/ccQJKVIi.o: In function
cv::Mat::~Mat()':
opencv.cpp:(.text._ZN2cv3MatD2Ev[_ZN2cv3MatD5Ev]+0x39): undefined reference to cv::fastFree(void*)'
/tmp/ccQJKVIi.o: In function
cv::Mat::release()':
opencv.cpp:(.text._ZN2cv3Mat7releaseEv[_ZN2cv3Mat7releaseEv]+0x47): undefined reference to cv::Mat::deallocate()'
/tmp/ccQJKVIi.o: In function
cv::Mat::operator()(cv::Rect_ const&) const':
opencv.cpp:(.text._ZNK2cv3MatclERKNS_5Rect_IiEE[_ZNK2cv3MatclERKNS_5Rect_IiEE]+0x27): undefined reference to `cv::Mat::Mat(cv::Mat const&, cv::Rect_ const&)'
collect2: error: ld returned 1 exit status

第一次使用,在此请教各位前辈,谢谢了

1个回答

缺少头文件,编译的时候没有导入依赖库

weixin_35582406
Poirot_ 回复ImportSUC: 请问要使用哪些头文件呢(PS:我cpp里是有这几个的,,,opencv2/highgui/highgui.hpp,,,,opencv2/imgproc/imgproc.hpp,,,opencv2/core/core.hpp,问题里面是因为忘了去尖号被当成html元素了,所以没有显示头文件名)
大约 3 年之前 回复
yiranhaiziqi
ImportSUC 参考http://blog.csdn.net/jk198310/article/details/51344601
大约 3 年之前 回复
Csdn user default icon
上传中...
上传图片
插入图片
抄袭、复制答案,以达到刷声望分或其他目的的行为,在CSDN问答是严格禁止的,一经发现立刻封号。是时候展现真正的技术了!
其他相关推荐
cmake编译opencv3.2+opencv_contrib一直报错。。
一直会提示这个错,有大神知道原因吗,我把一些依赖包下载下来放固定目录里了。还是该提醒还提醒错。我用的是opencv3.2+vs2015。 CMake Error at H:/OpenCV/opencv/sources/cmake/OpenCVUtils.cmake:1005 (file): file MD5 failed to read file "H:/OpenCV/Library/3rdparty/protobuf/": Permission denied Call Stack (most recent call first): H:/OpenCV/opencv_contrib-master/modules/dnn/cmake/OpenCVFindLibProtobuf.cmake:32 (ocv_download) H:/OpenCV/opencv_contrib-master/modules/dnn/CMakeLists.txt:5 (include)![图片说明](http://forum.csdn.net/PointForum/ui/scripts/csdn/Plugin/003/monkey/11.gif)![图片说明](http://forum.csdn.net/PointForum/ui/scripts/csdn/Plugin/003/monkey/5.gif)
cv2.error:Opencv(3.4.3)
s = robot.get_camera_data() plt.imshow(s) plt.show() s_ = robot.get_camera_data() print (s_.shape) plt.imshow(s_) plt.show() flow = cv2.calcOpticalFlowFarneback(s, s_, None, 0.5, 3, 15, 3, 5, 1.2, 0) ``` s与s_分别为在仿真环境中采集到的3通道图片数据,但是 运行代码报错,在网上也没有找到相关问题,谢谢大家。 ``` cv2.error: OpenCV(3.4.3) C:\projects\opencv-python\opencv\modules\video\src\optflowgf.cpp:1114: error: (-215:Assertion failed) prev0.size() == next0.size() && prev0.channels() == next0.channels() && prev0.channels() == 1 && pyrScale_ < 1 in function 'cv::`anonymous-namespace'::FarnebackOpticalFlowImpl::calc' 此处为代码运行错误。
vs2015配置opencv2.4.13
在配置opencv2.4.13后编译工程遇到这个问题![图片说明](https://img-ask.csdn.net/upload/201606/28/1467114542_65165.png) 有木有可以帮忙解答的
Ubuntu18.04配置OPENCV3.3.1时make报错
在给Ubuntu18.04下载编译openCV3.3.1时, 参照https://blog.csdn.net/zhaoxr233/article/details/90036824 在做到make那一步时,报了以下error,在网上查询无果,不知如何解决,烦请各位大佬指点 ``` Linking CXX executable ../../bin/opencv_visualisation ../../lib/libopencv_core.a(hal_internal.cpp.o):在函数‘lapack_gemm32f(float const*, unsigned long, float const*, unsigned long, float, float const*, unsigned long, float, float*, unsigned long, int, int, int, int)’中: hal_internal.cpp:(.text._Z14lapack_gemm32fPKfmS0_mfS0_mfPfmiiii+0x3d2):对‘cblas_sgemm(CBLAS_ORDER, CBLAS_TRANSPOSE, CBLAS_TRANSPOSE, int, int, int, float, float const*, int, float const*, int, float, float*, int)’未定义的引用 ............ ../../lib/libopencv_core.a(hal_internal.cpp.o):在函数‘lapack_gemm64fc(double const*, unsigned long, double const*, unsigned long, double, double const*, unsigned long, double, double*, unsigned long, int, int, int, int)’中: hal_internal.cpp:(.text._Z15lapack_gemm64fcPKdmS0_mdS0_mdPdmiiii+0x29e):对‘cblas_zgemm(CBLAS_ORDER, CBLAS_TRANSPOSE, CBLAS_TRANSPOSE, int, int, int, void const*, void const*, int, void const*, int, void const*, void*, int)’未定义的引用 hal_internal.cpp:(.text._Z15lapack_gemm64fcPKdmS0_mdS0_mdPdmiiii+0x2f5):对‘cblas_cgemm(CBLAS_ORDER, CBLAS_TRANSPOSE, CBLAS_TRANSPOSE, int, int, int, void const*, void const*, int, void const*, int, void const*, void*, int)’未定义的引用 collect2: error: ld returned 1 exit status apps/annotation/CMakeFiles/opencv_annotation.dir/build.make:119: recipe for target 'bin/opencv_annotation' failed make[2]: *** [bin/opencv_annotation] Error 1 CMakeFiles/Makefile2:4522: recipe for target 'apps/annotation/CMakeFiles/opencv_annotation.dir/all' failed make[1]: *** [apps/annotation/CMakeFiles/opencv_annotation.dir/all] Error 2 ```
opencv2.4.9+vs2013 重新编译错误
我是64位机,但是编译的的是32位的库文件,用编译得到的文件测试程序,结果:OpenCV Error: Unspecified error (The function is not implemented. Rebuild the library with Windows, GTK+ 2.x or Carbon support. If you are on Ubuntu or Debian, install libgtk2.0-dev and pkg-config, th en re-run cmake or configure script) in cvShowImage, file D:\opencv\sources\modules\highgui\src\wind ow.cpp, line 501 请按任意键继续. . . 然后程序就崩溃退出了,求各位指导!!!!
为什么Opencv3.4.0使用make编译时出现错误?
环境:Debian(Raspiberry Pi Buster) cmake version: 3.0.2 gcc version: 8.2.0 python version: 3.7.2 make version: 4.2.1 本来计划用opencv基于python进行图像辨别 在使用cmake配置完成后使用make命令编译: ``` sudo make ``` 编译到大约90%时,出现如下错误: ``` #这是之前很多条控制台信息中的warning warning: cast between incompatible function types from ‘PyObject* (*)(PyObject*, PyObject*, PyObject*)’ {aka ‘_object* (*)(_object*, _object*, _object*)’} to ‘PyCFunction’ {aka ‘_object* (*)(_object*, _object*)’} [-Wcast-function-type] ``` ``` #make错误,退出 make[2]: *** [modules/python3/CMakeFiles/opencv_python3.dir/build.make:56: modules/python3/CMakeFiles/opencv_python3.dir/__/src2/cv2.cpp.o] Error 1 make[1]: *** [CMakeFiles/Makefile2:21149: modules/python3/CMakeFiles/opencv_python3.dir/all] Error 2 make: *** [Makefile:138: all] Error 2 ``` 如图(图1中使用了make -i选项忽略错误,继续编译剩余部分,但open_cv python3没有成功编译): ![图片说明](https://img-ask.csdn.net/upload/201908/11/1565498546_278259.png) (图2显示了make的错误) ![图片说明](https://img-ask.csdn.net/upload/201908/11/1565499335_385379.png) ``` #忽略错误后出现的c++error c++: error: Cmakefiles/opencv_python3.dir/__/src2/cv2.cpp.o No such file or dictionary ``` 在网上看到的编译错误的例子都和这个有所区别,没有能够很好地解决问题。有的说这是gcc编译器的问题 希望各位大佬们能够帮忙分析一下错误的原因,因为我的项目急需配置好opencv,也没有其它更好的替代,谢谢~
ubuntu12.04下 opencv库交叉编译后 动态库找不到
ubuntu上我装了pc 和arm 两个版本的opencv2.4.9 目录分别是/usr/local/opencv2.4.9 和/opt/opencv2.4.9-for-arm pc版本的库文件都在/usr/local/lib下 arm版本库文件在/opt/opencv2.4.9-for-arm/lib下 whereis libopencv___core 的时候,只列出的/usr/local/lib/libopencv_core.so 交叉编译器在/opt/Embedsky/gcc-4.6.2-glibc-2.13-linaro-multilib-2011.12/tq-linaro-toolchain/bin下 我写一个opencv测试程序test.cpp 交叉编译出现警告 ``` # arm-linux-g++ -o test test.cpp -I /opt/opencv2.4.9-for-arm/lib/include -L /opt/opencv2.4.9-for-arm/lib -lopencv_core -lopencv_highgui -lpthread -lrt In file included from /opt/opencv2.4.9-for-arm/lib/include/opencv2/flann/kmeans_index.h:50:0, from /opt/opencv2.4.9-for-arm/lib/include/opencv2/flann/all_indices.h:38, from /opt/opencv2.4.9-for-arm/lib/include/opencv2/flann/flann_base.hpp:44, from /opt/opencv2.4.9-for-arm/lib/include/opencv2/flann/flann.hpp:50, from /opt/opencv2.4.9-for-arm/lib/include/opencv/cv.h:69, from test.cpp:2: /opt/opencv2.4.9-for-arm/lib/include/opencv2/flann/logger.h:73:9: note: the mangling of 'va_list' has changed in GCC 4.4 /opt/Embedsky/gcc-4.6.2-glibc-2.13-linaro-multilib-2011.12/tq-linaro-toolchain/bin/../lib/gcc/arm-fsl-linux-gnueabi/4.6.2/../../../../arm-fsl-linux-gnueabi/bin/ld: warning: ../../lib/libopencv_core.so, needed by /opt/opencv2.4.9-for-arm/lib/libopencv_highgui.so, not found (try using -rpath or -rpath-link) /opt/Embedsky/gcc-4.6.2-glibc-2.13-linaro-multilib-2011.12/tq-linaro-toolchain/bin/../lib/gcc/arm-fsl-linux-gnueabi/4.6.2/../../../../arm-fsl-linux-gnueabi/bin/ld: warning: ../../lib/libopencv_imgproc.so, needed by /opt/opencv2.4.9-for-arm/lib/libopencv_highgui.so, not found (try using -rpath or -rpath-link) root@tsie-All-Series:/home/tsie/nfs/test/opencv_test# whereis libopencv_core libopencv_core: /usr/local/lib/libopencv_core.so ``` 这里面好像用到交叉编译器的ld,找opencv的.so文件看提示是跑到交叉编译器所在文件夹里面的lib去找?? 我也吧opencv的交叉库放到这个文件夹里面,再编译还是同样的问题 然后我尝试加上运行时库路径参数 -Wl,-rpath,/opt/opencv2.4.9-for-arm/lib,再编译,弹出来一样的信息。 然后,就没有然后了。我晕 这究竟谁什么问题啊 求各路大神给点思路
error "OpenCV 4.x+ requires enabled C++11 support"
编程环境:VS2019+opencv4.10 编译出现错误提示:error "OpenCV 4.x+ requires enabled C++11 support" 求解,谢谢。
在Qt5.3.1中opencv2.4.9配置的问题
(这是mainwindow.h里的内容,中间四个include包含的文件总是找不到) #ifndef MAINWINDOW_H #define MAINWINDOW_H //#include <QtGui/QMainWindow> #include <QtWidgets/QMainWindow> #include <opencv2/opencv.hpp> #include <opencv2/core/core.hpp> #include <opencv2/imgproc/imgproc.hpp> #include <opencv2/highgui/highgui.hpp> //#include "cv.h" //#include "cxcore.h" //#include "highgui.h" #include<QImage> #include<QPixmap> #include<iostream> using namespace std; using namespace cv; class MainWindow : public QMainWindow { ……(后面不打了) (这是pro文件里opencv的配置,我的opencv文件是放在c:\opencv文件夹里的,系统的环境变量自己也配了) INCLUDEPATH+=c:\opencv\opencv\build\include\opencv\ c:\opencv\opencv\build\include\opencv2\ c:\opencv\opencv\build\include\ LIBS+=c:\opencv\opencv\MinGW\lib\libopencv_calib3d249.dll.a\ c:\opencv\opencv\MinGW\lib\libopencv_contrib249.dll.a\ c:\opencv\opencv\MinGW\lib\libopencv_core249.dll.a\ c:\opencv\opencv\MinGW\lib\libopencv_features2d249.dll.a\ c:\opencv\opencv\MinGW\lib\libopencv_flann249.dll.a\ c:\opencv\opencv\MinGW\lib\libopencv_gpu249.dll.a\ c:\opencv\opencv\MinGW\lib\libopencv_highgui249.dll.a\ c:\opencv\opencv\MinGW\lib\libopencv_imgproc249.dll.a\ c:\opencv\opencv\MinGW\lib\libopencv_legacy249.dll.a\ c:\opencv\opencv\MinGW\lib\libopencv_ml249.dll.a\ c:\opencv\opencv\MinGW\lib\libopencv_objdetect249.dll.a\ c:\opencv\opencv\MinGW\lib\libopencv_video249.dll.a
opencv3.1.0交叉编译出错
我在给mini2440移植opencv3.1.0的时候,make编译opencv过程中出错了。log如下: CMakeFiles/opencv_perf_core.dir/perf/perf_math.cpp.obj: In function `cv::Mat::~Mat()': perf_math.cpp.text._ZN2cv3MatD1Ev[cv::Mat::~Mat()]+0x1c): undefined reference to `__sync_fetch_and_add_4' CMakeFiles/opencv_perf_core.dir/perf/perf_compare.cpp.obj: In function `Size_MatType_CmpType_compare:erfTestBody()': perf_compare.cpp.text._ZN28Size_MatType_CmpType_compare12PerfTestBodyEv+0x30c): undefined reference to `__sync_fetch_and_add_4' perf_compare.cpp.text._ZN28Size_MatType_CmpType_compare12PerfTestBodyEv+0x378): undefined reference to `__sync_fetch_and_add_4' perf_compare.cpp.text._ZN28Size_MatType_CmpType_compare12PerfTestBodyEv+0x3ec): undefined reference to `__sync_fetch_and_add_4' CMakeFiles/opencv_perf_core.dir/perf/perf_compare.cpp.obj: In function `Size_MatType_CmpType_compareScalar:erfTestBody()': perf_compare.cpp.text._ZN34Size_MatType_CmpType_compareScalar12PerfTestBodyEv+0x32c): undefined reference to `__sync_fetch_and_add_4' CMakeFiles/opencv_perf_core.dir/perf/perf_compare.cpp.obj:perf_compare.cpp.text._ZN34Size_MatType_CmpType_compareScalar12PerfTestBodyEv+0x3a0): more undefined references to `__sync_fetch_and_add_4' follow collect2: ld returned 1 exit status make[2]: *** [bin/opencv_perf_core] Error 1 make[1]: *** [modules/core/CMakeFiles/opencv_perf_core.dir/all] Error 2 make: *** [all] Error 2 我用的是Ubuntu14.04,32位虚拟机。 查网上说是CMAKE_C_FLAGS要设为-march=armv4t 可是我安装提示设置了CMAKE_C_FLAGS 和 CMAKE_CXX_FLAGS的值,错误还是没有消失。 我试过了opencv3.1。0和opencv3.2.0了,都会出现这个问题。因为项目需求要用到opencv3 所以只能自己编译最新版,,泪奔 有大神遇到过这个问题吗?
opencv2.4.8打开摄像头失败
各位大神好! 不知道有没有谁之前使用opencv2.4.8可以正常打开USB摄像头的? 我使用的是vs2013+opencv2.4.8 系统是win8中文版,用opencv打开摄像头时怎么无法打开 获取摄像头的指针为空,很是纠结,
opencv3.2中一直报错 SurfFeatureDetector 未定义的标识符。
配置了opencv3.2.0但是 SurfFeatureDetector类无法使用啊, 我也加上了opencv_contrib了![图片说明](http://forum.csdn.net/PointForum/ui/scripts/csdn/Plugin/001/face/76.gif)![图片说明](http://forum.csdn.net/PointForum/ui/scripts/csdn/Plugin/001/face/76.gif)
opencv3.2与opencv 2.8 切换的问题
我的ubuntu系统原来安装了opencv2.8,现在由于实际需要,安装了opencv3.2。但是,opencv2.8还得继续保留。利用pkg-config --modversion opencv 查看opencv的版本,显示是3.2.0。原来(opencv2.8下),CMakeList文件是这样写的。 project(test) find_package(OpenCV REQUIRED) add_executable(test src/test.cpp) target_link_libraries(test ${OpenCV_LIBS}) cmake_minimum_required(VERSION 2.8) 我使用opencv3.2编译的时候,按照要求,我把路径给加上了。 project(test) find_package(OpenCV REQUIRED) set(OpenCV_DIR "/usr/local/opencv320/share/OpenCV") INCLUDE_DIRECTORIES(${OpenCV_INCLUDE_DIRS}) add_executable(test src/test.cpp) target_link_libraries(test ${OpenCV_LIBS}) cmake_minimum_required(VERSION 3.2) 但是显示错误:要求的opencv版本太高,当前运行版本为2.8。但是我用 pkg-config --modversion opencv 查看版本,显示的是3.2.0
谁能帮忙看一下OpenCV 3.4.1源码的类型转换编译错误?
环境: 1. Ubuntu 12.04 LTS 2. cmake 3.5.1 3. OpenCV 3.4.1源码 4. Arm Cortex-A7 NXP i.MX6Q 5. 已经sudo为root 执行过程 cd opencv-3.4.1 mkdir build cd build cmakd -D CMAKE_BUILD_TYPE=Relase -D CMAKE_INSTALL_PREFIX=/usr/local .. make make install 出错提示: [ 0%] Built target gen-pkgconfig [ 9%] Built target libwebp [ 14%] Built target IlmImf [ 20%] Built target libprotobuf [ 23%] Built target carotene_objs [ 24%] Built target tegra_hal [ 24%] Built target opencv_ts_pch_dephelp [ 24%] Built target pch_Generate_opencv_ts [ 25%] Built target opencv_core_pch_dephelp [ 25%] Built target pch_Generate_opencv_core [ 31%] Built target opencv_core [ 31%] Built target opencv_imgproc_pch_dephelp [ 31%] Built target pch_Generate_opencv_imgproc [ 31%] Building CXX object modules/imgproc/CMakeFiles/opencv_imgproc.dir/src/smooth.cpp.o /home/linaro/opencv-3.4.1/modules/imgproc/src/smooth.cpp: In function ‘void cv::vlineSmooth1N(const FT* const*, const FT*, int, ET*, int) [with ET = unsigned char, FT = {anonymous}::ufixedpoint16]’: /home/linaro/opencv-3.4.1/modules/imgproc/src/smooth.cpp:2676:31: error: conversion from ‘{anonymous}::ufixedpoint32’ to ‘cv::uint8_t {aka unsigned char}’ is ambiguous /home/linaro/opencv-3.4.1/modules/imgproc/src/smooth.cpp:2676:31: note: candidates are: /home/linaro/opencv-3.4.1/modules/imgproc/src/fixedpoint.inl.hpp:223:22: note: {anonymous}::ufixedpoint32::operator float() const /home/linaro/opencv-3.4.1/modules/imgproc/src/fixedpoint.inl.hpp:222:22: note: {anonymous}::ufixedpoint32::operator double() const /home/linaro/opencv-3.4.1/modules/imgproc/src/fixedpoint.inl.hpp:221:22: note: {anonymous}::ufixedpoint32::operator ET() const [with ET = unsigned char] /home/linaro/opencv-3.4.1/modules/imgproc/src/smooth.cpp: In function ‘void cv::vlineSmooth1N1(const FT* const*, const FT*, int, ET*, int) [with ET = unsigned char, FT = {anonymous}::ufixedpoint16]’: /home/linaro/opencv-3.4.1/modules/imgproc/src/smooth.cpp:2693:24: error: conversion from ‘const {anonymous}::ufixedpoint16’ to ‘cv::uint8_t {aka unsigned char}’ is ambiguous /home/linaro/opencv-3.4.1/modules/imgproc/src/smooth.cpp:2693:24: note: candidates are: /home/linaro/opencv-3.4.1/modules/imgproc/src/fixedpoint.inl.hpp:289:22: note: {anonymous}::ufixedpoint16::operator float() const /home/linaro/opencv-3.4.1/modules/imgproc/src/fixedpoint.inl.hpp:288:22: note: {anonymous}::ufixedpoint16::operator double() const /home/linaro/opencv-3.4.1/modules/imgproc/src/fixedpoint.inl.hpp:287:22: note: {anonymous}::ufixedpoint16::operator ET() const [with ET = unsigned char] /home/linaro/opencv-3.4.1/modules/imgproc/src/smooth.cpp: In function ‘void cv::vlineSmooth3N(const FT* const*, const FT*, int, ET*, int) [with ET = unsigned char, FT = {anonymous}::ufixedpoint16]’: /home/linaro/opencv-3.4.1/modules/imgproc/src/smooth.cpp:2740:71: error: conversion from ‘{anonymous}::ufixedpoint32’ to ‘cv::uint8_t {aka unsigned char}’ is ambiguous /home/linaro/opencv-3.4.1/modules/imgproc/src/smooth.cpp:2740:71: note: candidates are: /home/linaro/opencv-3.4.1/modules/imgproc/src/fixedpoint.inl.hpp:223:22: note: {anonymous}::ufixedpoint32::operator float() const /home/linaro/opencv-3.4.1/modules/imgproc/src/fixedpoint.inl.hpp:222:22: note: {anonymous}::ufixedpoint32::operator double() const /home/linaro/opencv-3.4.1/modules/imgproc/src/fixedpoint.inl.hpp:221:22: note: {anonymous}::ufixedpoint32::operator ET() const [with ET = unsigned char] /home/linaro/opencv-3.4.1/modules/imgproc/src/smooth.cpp: In function ‘void cv::vlineSmooth5N(const FT* const*, const FT*, int, ET*, int) [with ET = unsigned char, FT = {anonymous}::ufixedpoint16]’: /home/linaro/opencv-3.4.1/modules/imgproc/src/smooth.cpp:2816:109: error: conversion from ‘{anonymous}::ufixedpoint32’ to ‘cv::uint8_t {aka unsigned char}’ is ambiguous /home/linaro/opencv-3.4.1/modules/imgproc/src/smooth.cpp:2816:109: note: candidates are: /home/linaro/opencv-3.4.1/modules/imgproc/src/fixedpoint.inl.hpp:223:22: note: {anonymous}::ufixedpoint32::operator float() const /home/linaro/opencv-3.4.1/modules/imgproc/src/fixedpoint.inl.hpp:222:22: note: {anonymous}::ufixedpoint32::operator double() const /home/linaro/opencv-3.4.1/modules/imgproc/src/fixedpoint.inl.hpp:221:22: note: {anonymous}::ufixedpoint32::operator ET() const [with ET = unsigned char] /home/linaro/opencv-3.4.1/modules/imgproc/src/smooth.cpp: In function ‘void cv::vlineSmooth(const FT* const*, const FT*, int, ET*, int) [with ET = unsigned char, FT = {anonymous}::ufixedpoint16]’: /home/linaro/opencv-3.4.1/modules/imgproc/src/smooth.cpp:2919:18: error: conversion from ‘{anonymous}::ufixedpoint32’ to ‘cv::uint8_t {aka unsigned char}’ is ambiguous /home/linaro/opencv-3.4.1/modules/imgproc/src/smooth.cpp:2914:23: note: candidates are: /home/linaro/opencv-3.4.1/modules/imgproc/src/fixedpoint.inl.hpp:223:22: note: {anonymous}::ufixedpoint32::operator float() const /home/linaro/opencv-3.4.1/modules/imgproc/src/fixedpoint.inl.hpp:222:22: note: {anonymous}::ufixedpoint32::operator double() const /home/linaro/opencv-3.4.1/modules/imgproc/src/fixedpoint.inl.hpp:221:22: note: {anonymous}::ufixedpoint32::operator ET() const [with ET = unsigned char] make[2]: *** [modules/imgproc/CMakeFiles/opencv_imgproc.dir/src/smooth.cpp.o] Error 1 make[1]: *** [modules/imgproc/CMakeFiles/opencv_imgproc.dir/all] Error 2 make: *** [all] Error 2 说明: 关键之处是 /home/linaro/opencv-3.4.1/modules/imgproc/src/smooth.cpp:2919:18: error: conversion from ‘{anonymous}::ufixedpoint32’ to ‘cv::uint8_t {aka unsigned char}’ is ambiguous 类型转换错误。 请教各位大侠,这个错误出在哪里,如何解决呢? 谢谢!
求助帖!!!ubuntu18.04 安装opencv4.0.0源码无限次出现如下问题
./src/image_opencv.cpp: In function ‘IplImage* image_to_ipl(image)’: ./src/image_opencv.cpp:16:5: error: ‘IPlImage’ was not declared in this scope IPlImage *disp = cvCreateImage(cvSize(im.w,im.h), IPL_DEPTH_8U, im.c); ^~~~~~~~ compilation terminated due to -Wfatal-errors. Makefile:86: recipe for target 'obj/image_opencv.o' failed make: *** [obj/image_opencv.o] Error 1 make: *** Waiting for unfinished jobs.... 但我在src文件夹中的image_opencv.cpp中也引入了#include "opencv2/imgproc/imgproc_c.h" 求助实在不知道怎么办了
VS2010下使用opencv2.4.8出现错误
VS2010下使用opencv2.4.8出现错误LINK : fatal error LNK1104: 无法打开文件“opencv_ts300d.lib”链接库附加依赖项里是opencv_ts248d.lib啊 刚开始接触opencv,有很多不懂
opencv3.1.0交叉编译 使用摄像头 编译出错
opencv3.1.0交叉编译: 宿主机:ubuntu 14.04 交叉编译工具:gcc-4.6.2-glibc-2.13-linaro 在使用Cmake-gui配置时,因为要使用摄像头(OV3640)取图像,进行图像处理,所以将Operating System填为Linux, 并将WITH_V4L勾选上,之后执行make命令,总是编译错误,提示许多的库找不到,如下图中所示; 如果将Operating System填为arm-linux,没有勾选WITH_V4L,则可以make编译通过,但在arm开发板上用OpenCV打不开摄像头,isOpened ()返回值是false。请帮忙分析问题原因,希望给提供些正确的解决办法,非常感激! ![勾选WITH_V4L 编译错误信息](https://img-ask.csdn.net/upload/201605/29/1464522128_617542.png)![勾选WITH_V4L 编译错误信息](https://img-ask.csdn.net/upload/201605/29/1464522146_811706.jpg) ![cmake-gui 配置为Linux](https://img-ask.csdn.net/upload/201605/30/1464565387_398821.png) ![cmake-gui 配置为arm-linux](https://img-ask.csdn.net/upload/201605/30/1464565406_575197.png)
Java学习的正确打开方式
在博主认为,对于入门级学习java的最佳学习方法莫过于视频+博客+书籍+总结,前三者博主将淋漓尽致地挥毫于这篇博客文章中,至于总结在于个人,实际上越到后面你会发现学习的最好方式就是阅读参考官方文档其次就是国内的书籍,博客次之,这又是一个层次了,这里暂时不提后面再谈。博主将为各位入门java保驾护航,各位只管冲鸭!!!上天是公平的,只要不辜负时间,时间自然不会辜负你。 何谓学习?博主所理解的学习,它是一个过程,是一个不断累积、不断沉淀、不断总结、善于传达自己的个人见解以及乐于分享的过程。
程序员必须掌握的核心算法有哪些?
由于我之前一直强调数据结构以及算法学习的重要性,所以就有一些读者经常问我,数据结构与算法应该要学习到哪个程度呢?,说实话,这个问题我不知道要怎么回答你,主要取决于你想学习到哪些程度,不过针对这个问题,我稍微总结一下我学过的算法知识点,以及我觉得值得学习的算法。这些算法与数据结构的学习大多数是零散的,并没有一本把他们全部覆盖的书籍。下面是我觉得值得学习的一些算法以及数据结构,当然,我也会整理一些看过...
大学四年自学走来,这些私藏的实用工具/学习网站我贡献出来了
大学四年,看课本是不可能一直看课本的了,对于学习,特别是自学,善于搜索网上的一些资源来辅助,还是非常有必要的,下面我就把这几年私藏的各种资源,网站贡献出来给你们。主要有:电子书搜索、实用工具、在线视频学习网站、非视频学习网站、软件下载、面试/求职必备网站。 注意:文中提到的所有资源,文末我都给你整理好了,你们只管拿去,如果觉得不错,转发、分享就是最大的支持了。 一、电子书搜索 对于大部分程序员...
linux系列之常用运维命令整理笔录
本博客记录工作中需要的linux运维命令,大学时候开始接触linux,会一些基本操作,可是都没有整理起来,加上是做开发,不做运维,有些命令忘记了,所以现在整理成博客,当然vi,文件操作等就不介绍了,慢慢积累一些其它拓展的命令,博客不定时更新 free -m 其中:m表示兆,也可以用g,注意都要小写 Men:表示物理内存统计 total:表示物理内存总数(total=used+free) use...
比特币原理详解
一、什么是比特币 比特币是一种电子货币,是一种基于密码学的货币,在2008年11月1日由中本聪发表比特币白皮书,文中提出了一种去中心化的电子记账系统,我们平时的电子现金是银行来记账,因为银行的背后是国家信用。去中心化电子记账系统是参与者共同记账。比特币可以防止主权危机、信用风险。其好处不多做赘述,这一层面介绍的文章很多,本文主要从更深层的技术原理角度进行介绍。 二、问题引入 假设现有4个人...
程序员接私活怎样防止做完了不给钱?
首先跟大家说明一点,我们做 IT 类的外包开发,是非标品开发,所以很有可能在开发过程中会有这样那样的需求修改,而这种需求修改很容易造成扯皮,进而影响到费用支付,甚至出现做完了项目收不到钱的情况。 那么,怎么保证自己的薪酬安全呢? 我们在开工前,一定要做好一些证据方面的准备(也就是“讨薪”的理论依据),这其中最重要的就是需求文档和验收标准。一定要让需求方提供这两个文档资料作为开发的基础。之后开发...
网页实现一个简单的音乐播放器(大佬别看。(⊙﹏⊙))
今天闲着无事,就想写点东西。然后听了下歌,就打算写个播放器。 于是乎用h5 audio的加上js简单的播放器完工了。 演示地点演示 html代码如下` music 这个年纪 七月的风 音乐 ` 然后就是css`*{ margin: 0; padding: 0; text-decoration: none; list-...
Python十大装B语法
Python 是一种代表简单思想的语言,其语法相对简单,很容易上手。不过,如果就此小视 Python 语法的精妙和深邃,那就大错特错了。本文精心筛选了最能展现 Python 语法之精妙的十个知识点,并附上详细的实例代码。如能在实战中融会贯通、灵活使用,必将使代码更为精炼、高效,同时也会极大提升代码B格,使之看上去更老练,读起来更优雅。
数据库优化 - SQL优化
以实际SQL入手,带你一步一步走上SQL优化之路!
2019年11月中国大陆编程语言排行榜
2019年11月2日,我统计了某招聘网站,获得有效程序员招聘数据9万条。针对招聘信息,提取编程语言关键字,并统计如下: 编程语言比例 rank pl_ percentage 1 java 33.62% 2 cpp 16.42% 3 c_sharp 12.82% 4 javascript 12.31% 5 python 7.93% 6 go 7.25% 7 p...
通俗易懂地给女朋友讲:线程池的内部原理
餐盘在灯光的照耀下格外晶莹洁白,女朋友拿起红酒杯轻轻地抿了一小口,对我说:“经常听你说线程池,到底线程池到底是个什么原理?”
《奇巧淫技》系列-python!!每天早上八点自动发送天气预报邮件到QQ邮箱
将代码部署服务器,每日早上定时获取到天气数据,并发送到邮箱。 也可以说是一个小型人工智障。 知识可以运用在不同地方,不一定非是天气预报。
经典算法(5)杨辉三角
杨辉三角 是经典算法,这篇博客对它的算法思想进行了讲解,并有完整的代码实现。
英特尔不为人知的 B 面
从 PC 时代至今,众人只知在 CPU、GPU、XPU、制程、工艺等战场中,英特尔在与同行硬件芯片制造商们的竞争中杀出重围,且在不断的成长进化中,成为全球知名的半导体公司。殊不知,在「刚硬」的背后,英特尔「柔性」的软件早已经做到了全方位的支持与支撑,并持续发挥独特的生态价值,推动产业合作共赢。 而对于这一不知人知的 B 面,很多人将其称之为英特尔隐形的翅膀,虽低调,但是影响力却不容小觑。 那么,在...
腾讯算法面试题:64匹马8个跑道需要多少轮才能选出最快的四匹?
昨天,有网友私信我,说去阿里面试,彻底的被打击到了。问了为什么网上大量使用ThreadLocal的源码都会加上private static?他被难住了,因为他从来都没有考虑过这个问题。无独有偶,今天笔者又发现有网友吐槽了一道腾讯的面试题,我们一起来看看。 腾讯算法面试题:64匹马8个跑道需要多少轮才能选出最快的四匹? 在互联网职场论坛,一名程序员发帖求助到。二面腾讯,其中一个算法题:64匹...
面试官:你连RESTful都不知道我怎么敢要你?
干货,2019 RESTful最贱实践
刷了几千道算法题,这些我私藏的刷题网站都在这里了!
遥想当年,机缘巧合入了 ACM 的坑,周边巨擘林立,从此过上了"天天被虐似死狗"的生活… 然而我是谁,我可是死狗中的战斗鸡,智力不够那刷题来凑,开始了夜以继日哼哧哼哧刷题的日子,从此"读题与提交齐飞, AC 与 WA 一色 ",我惊喜的发现被题虐既刺激又有快感,那一刻我泪流满面。这么好的事儿作为一个正直的人绝不能自己独享,经过激烈的颅内斗争,我决定把我私藏的十几个 T 的,阿不,十几个刷题网...
为啥国人偏爱Mybatis,而老外喜欢Hibernate/JPA呢?
关于SQL和ORM的争论,永远都不会终止,我也一直在思考这个问题。昨天又跟群里的小伙伴进行了一番讨论,感触还是有一些,于是就有了今天这篇文。 声明:本文不会下关于Mybatis和JPA两个持久层框架哪个更好这样的结论。只是摆事实,讲道理,所以,请各位看官勿喷。 一、事件起因 关于Mybatis和JPA孰优孰劣的问题,争论已经很多年了。一直也没有结论,毕竟每个人的喜好和习惯是大不相同的。我也看...
白话阿里巴巴Java开发手册高级篇
不久前,阿里巴巴发布了《阿里巴巴Java开发手册》,总结了阿里巴巴内部实际项目开发过程中开发人员应该遵守的研发流程规范,这些流程规范在一定程度上能够保证最终的项目交付质量,通过在时间中总结模式,并推广给广大开发人员,来避免研发人员在实践中容易犯的错误,确保最终在大规模协作的项目中达成既定目标。 无独有偶,笔者去年在公司里负责升级和制定研发流程、设计模板、设计标准、代码标准等规范,并在实际工作中进行...
SQL-小白最佳入门sql查询一
不要偷偷的查询我的个人资料,即使你再喜欢我,也不要这样,真的不好;
项目中的if else太多了,该怎么重构?
介绍 最近跟着公司的大佬开发了一款IM系统,类似QQ和微信哈,就是聊天软件。我们有一部分业务逻辑是这样的 if (msgType = "文本") { // dosomething } else if(msgType = "图片") { // doshomething } else if(msgType = "视频") { // doshomething } else { // doshom...
Nginx 原理和架构
Nginx 是一个免费的,开源的,高性能的 HTTP 服务器和反向代理,以及 IMAP / POP3 代理服务器。Nginx 以其高性能,稳定性,丰富的功能,简单的配置和低资源消耗而闻名。 Nginx 的整体架构 Nginx 里有一个 master 进程和多个 worker 进程。master 进程并不处理网络请求,主要负责调度工作进程:加载配置、启动工作进程及非停升级。worker 进程负责处...
【图解经典算法题】如何用一行代码解决约瑟夫环问题
约瑟夫环问题算是很经典的题了,估计大家都听说过,然后我就在一次笔试中遇到了,下面我就用 3 种方法来详细讲解一下这道题,最后一种方法学了之后保证让你可以让你装逼。 问题描述:编号为 1-N 的 N 个士兵围坐在一起形成一个圆圈,从编号为 1 的士兵开始依次报数(1,2,3…这样依次报),数到 m 的 士兵会被杀死出列,之后的士兵再从 1 开始报数。直到最后剩下一士兵,求这个士兵的编号。 1、方...
吐血推荐珍藏的Visual Studio Code插件
作为一名Java工程师,由于工作需要,最近一个月一直在写NodeJS,这种经历可以说是一部辛酸史了。好在有神器Visual Studio Code陪伴,让我的这段经历没有更加困难。眼看这段经历要告一段落了,今天就来给大家分享一下我常用的一些VSC的插件。 VSC的插件安装方法很简单,只需要点击左侧最下方的插件栏选项,然后就可以搜索你想要的插件了。 下面我们进入正题 Material Theme ...
如何防止抄袭PCB电路板
目录 1、抄板是什么 2、抄板是否属于侵权 3、如何防止抄板 1、抄板是什么 抄板也叫克隆或仿制,是对设计出来的PCB板进行反向技术研究;目前全新的定义:从狭义上来说,抄板仅指对电子产品电路板PCB文件的提取还原和利用文件进行电路板克隆的过程;从广义上来说,抄板不仅包括对电路板文件提取、电路板克隆、电路板仿制等技术过程,而且包括对电路板文件进行修改(即改板)、对电子产品外形模具进行三维...
“狗屁不通文章生成器”登顶GitHub热榜,分分钟写出万字形式主义大作
一、垃圾文字生成器介绍 最近在浏览GitHub的时候,发现了这样一个骨骼清奇的雷人项目,而且热度还特别高。 项目中文名:狗屁不通文章生成器 项目英文名:BullshitGenerator 根据作者的介绍,他是偶尔需要一些中文文字用于GUI开发时测试文本渲染,因此开发了这个废话生成器。但由于生成的废话实在是太过富于哲理,所以最近已经被小伙伴们给玩坏了。 他的文风可能是这样的: 你发现,...
程序员:我终于知道post和get的区别
是一个老生常谈的话题,然而随着不断的学习,对于以前的认识有很多误区,所以还是需要不断地总结的,学而时习之,不亦说乎
《程序人生》系列-这个程序员只用了20行代码就拿了冠军
你知道的越多,你不知道的越多 点赞再看,养成习惯GitHub上已经开源https://github.com/JavaFamily,有一线大厂面试点脑图,欢迎Star和完善 前言 这一期不算《吊打面试官》系列的,所有没前言我直接开始。 絮叨 本来应该是没有这期的,看过我上期的小伙伴应该是知道的嘛,双十一比较忙嘛,要值班又要去帮忙拍摄年会的视频素材,还得搞个程序员一天的Vlog,还要写BU...
加快推动区块链技术和产业创新发展,2019可信区块链峰会在京召开
11月8日,由中国信息通信研究院、中国通信标准化协会、中国互联网协会、可信区块链推进计划联合主办,科技行者协办的2019可信区块链峰会将在北京悠唐皇冠假日酒店开幕。   区块链技术被认为是继蒸汽机、电力、互联网之后,下一代颠覆性的核心技术。如果说蒸汽机释放了人类的生产力,电力解决了人类基本的生活需求,互联网彻底改变了信息传递的方式,区块链作为构造信任的技术有重要的价值。   1...
Python 植物大战僵尸代码实现(2):植物卡片选择和种植
这篇文章要介绍的是: - 上方植物卡片栏的实现。 - 点击植物卡片,鼠标切换为植物图片。 - 鼠标移动时,判断当前在哪个方格中,并显示半透明的植物作为提示。
Java世界最常用的工具类库
Apache Commons Apache Commons有很多子项目 Google Guava 参考博客
程序员把地府后台管理系统做出来了,还有3.0版本!12月7号最新消息:已在开发中有github地址
第一幕:缘起 听说阎王爷要做个生死簿后台管理系统,我们派去了一个程序员…… 996程序员做的梦: 第一场:团队招募 为了应对地府管理危机,阎王打算找“人”开发一套地府后台管理系统,于是就在地府总经办群中发了项目需求。 话说还是中国电信的信号好,地府都是满格,哈哈!!! 经常会有外行朋友问:看某网站做的不错,功能也简单,你帮忙做一下? 而这次,面对这样的需求,这个程序员...
相关热词 c# 引用mysql c#动态加载非托管dll c# 两个表数据同步 c# 返回浮点json c# imap 链接状态 c# 漂亮字 c# 上取整 除法 c#substring c#中延时关闭 c#线段拖拉
立即提问