caffe编译 Mainbuilder.sln遇到问题求解 20C

打开MainBuilder.sln后用release x64生成,出现如下错误
图片说明
图片说明
cuda版本8.0 文件中版本号已修改

1个回答

Csdn user default icon
上传中...
上传图片
插入图片
抄袭、复制答案,以达到刷声望分或其他目的的行为,在CSDN问答是严格禁止的,一经发现立刻封号。是时候展现真正的技术了!
其他相关推荐
caffe.sln在编译后出现错误
请教各位大神:caffe.sln在编译后出现错误,错误显示:无法打开输入文件libcaffe.lib 我是按照《深度学习21天实战caffe》中指示的“windows环境准备”的步骤进行的,我电脑win7,装的是VS2013。
用VS2013打开caffe.sln,编译总是出现nuget程序还原包失败
急求,用VS2013打开caffe.sln,编译总是出现nuget程序还原包失败,未能解析远程名称www.nudgt.org,怎么解决,而且我的电脑不能联网![图片说明](https://img-ask.csdn.net/upload/201709/05/1504576226_193420.png)![图片说明](https://img-ask.csdn.net/upload/201709/05/1504576289_871673.png)
caffe编译时出现make: protoc:命令未找到
make all -j8 时出现下面问题: ``` PROTOC src/caffe/proto/caffe.proto make: protoc:命令未找到 Makefile:629: recipe for target '.build_release/src/caffe/proto/caffe.pb.cc' failed make: *** [.build_release/src/caffe/proto/caffe.pb.cc] Error 127 make: *** 正在等待未完成的任务.... ```
ubuntu16.04安装openpose编译出现错误/libopenpose.so.1.4.0:对‘caffe::Net未定义的引用
> ![图片说明](https://img-ask.csdn.net/upload/201903/07/1551930959_664828.png) caffe编译测试通过,将生成的caffe.pb.h和caffe.pb.cc文件放入指定文件这一步也做了,在openpose/build 文件下执行make -j'nproc'出现如图错误,感谢
caffe编译出现libgflags.so.2: error adding symbols:
caffe下 make clean后make all后出现 CXX/LD -o .build_release/tools/convert_imageset.bin /usr/bin/ld: .build_release/tools/convert_imageset.o: undefined reference to symbol '_ZN6google14FlagRegistererC1EPKcS2_S2_S2_PvS3_' //usr/lib/x86_64-linux-gnu/libgflags.so.2: error adding symbols: DSO missing from command line collect2: error: ld returned 1 exit status Makefile:626: recipe for target '.build_release/tools/convert_imageset.bin' failed make: *** [.build_release/tools/convert_imageset.bin] Error 1
caffe 模型classification.exe可用MATLAB不可用
在训练完自己的模型后,使用classification.exe运行分类模型时,是可以用的(但是概率总是显示0或者1,可能是训练图片太少),但是在MATLAB调用时总是出现错误: Error using CHECK (line 4) invalid Net handle Error in caffe.Net (line 36) CHECK(is_valid_handle(hNet_net), 'invalid Net handle'); Error in caffe.get_net (line 28) net = caffe.Net(hNet); Error in caffe.Net (line 31) self = caffe.get_net(varargin{:}); 怎么回事呢。
将caffe的classification实例添加到自己的工程中
原本是一个vs2010的工程,为了使用caffe框架,就将h文件和cpp文件重新添加到了classification工程中。![图片说明](https://img-ask.csdn.net/upload/201610/30/1477817811_574571.png)环境是win10+vs2013的+caffe。如果独编译classification或者添加的过程都没有问题,但是一旦我在自己的工程中添加classification的实例再编译就会报错。我是直接include "classification.cpp"。报错是提示caffe.pb.h文件有错。 E:\caffe-master\include\caffe/proto/caffe.pb.h(1251): warning C4003: “min”宏的实参不足 1>E:\caffe-master\include\caffe/proto/caffe.pb.h(1251): error C2059: 语法错误:“)” 1>E:\caffe-master\include\caffe/proto/caffe.pb.h(1251): error C2334: “:”的前面有意外标记;跳过明显的函数体 1>E:\caffe-master\include\caffe/proto/caffe.pb.h(1258): warning C4003: “max”宏的实参不足 1>E:\caffe-master\include\caffe/proto/caffe.pb.h(1327): error C2143: 语法错误 : 缺少“)”(在“;”的前面) 1>E:\caffe-master\include\caffe/proto/caffe.pb.h(1327): error C2059: 语法错误:“)” 1>E:\caffe-master\include\caffe/proto/caffe.pb.h(1327): error C2238: 意外的标记位于“;”之前 1>E:\caffe-master\include\caffe/proto/caffe.pb.h(10996): error C3254: “caffe::FillerParameter”: 类包含显式重写“dim_size”,但并不从包含函数声明的接口派生 1>E:\caffe-master\include\caffe/proto/caffe.pb.h(10996): error C2838: “dim_size”: 成员声明中的非法限定名 1>E:\caffe-master\include\caffe/proto/caffe.pb.h(10999): error C3254: “caffe::FillerParameter”: 类包含显式重写“clear_dim”,但并不从包含函数声明的接口派生 1>E:\caffe-master\include\caffe/proto/caffe.pb.h(10999): error C2838: “clear_dim”: 成员声明中的非法限定名 1>E:\caffe-master\include\caffe/proto/caffe.pb.h(11002): error C3254: “caffe::FillerParameter”: 类包含显式重写“dim”,但并不从包含函数声明的接口派生 1>E:\caffe-master\include\caffe/proto/caffe.pb.h(11002): error C2838: “dim”: 成员声明中的非法限定名 1>E:\caffe-master\include\caffe/proto/caffe.pb.h(11006): error C3254: “caffe::FillerParameter”: 类包含显式重写“set_dim”,但并不从包含函数声明的接口派生 1>E:\caffe-master\include\caffe/proto/caffe.pb.h(11006): error C2838: “set_dim”: 成员声明中的非法限定名 1>E:\caffe-master\include\caffe/proto/caffe.pb.h(11010): error C3254: “caffe::FillerParameter”: 类包含显式重写“add_dim”,但并不从包含函数声明的接口派生 1>E:\caffe-master\include\caffe/proto/caffe.pb.h(11010): error C2838: “add_dim”: 成员声明中的非法限定名 1>E:\caffe-master\include\caffe/proto/caffe.pb.h(11015): error C3254: “caffe::FillerParameter”: 类包含显式重写“dim”,但并不从包含函数声明的接口派生 1>E:\caffe-master\include\caffe/proto/caffe.pb.h(11015): error C2838: “dim”: 成员声明中的非法限定名 1>E:\caffe-master\include\caffe/proto/caffe.pb.h(11020): error C3254: “caffe::FillerParameter”: 类包含显式重写“mutable_dim”,但并不从包含函数声明的接口派生 1>E:\caffe-master\include\caffe/proto/caffe.pb.h(11020): error C2838: “mutable_dim”: 成员声明中的非法限定名 1>E:\caffe-master\include\caffe/proto/caffe.pb.h(11030): error C3254: “caffe::FillerParameter”: 类包含显式重写“has_shape”,但并不从包含函数声明的接口派生 1>E:\caffe-master\include\caffe/proto/caffe.pb.h(11030): error C2838: “has_shape”: 成员声明中的非法限定名 1>E:\caffe-master\include\caffe/proto/caffe.pb.h(11033): error C3254: “caffe::FillerParameter”: 类包含显式重写“set_has_shape”,但并不从包含函数声明的接口派生 1>E:\caffe-master\include\caffe/proto/caffe.pb.h(11033): error C2838: “set_has_shape”: 成员声明中的非法限定名 1>E:\caffe-master\include\caffe/proto/caffe.pb.h(11036): error C3254: “caffe::FillerParameter”: 类包含显式重写“clear_has_shape”,但并不从包含函数声明的接口派生 1>E:\caffe-master\include\caffe/proto/caffe.pb.h(11036): error C2838: “clear_has_shape”: 成员声明中的非法限定名 1>E:\caffe-master\include\caffe/proto/caffe.pb.h(11039): error C3254: “caffe::FillerParameter”: 类包含显式重写“clear_shape”,但并不从包含函数声明的接口派生 1>E:\caffe-master\include\caffe/proto/caffe.pb.h(11039): error C2838: “clear_shape”: 成员声明中的非法限定名 1>E:\caffe-master\include\caffe/proto/caffe.pb.h(11043): error C3254: “caffe::FillerParameter”: 类包含显式重写“shape”,但并不从包含函数声明的接口派生 1>E:\caffe-master\include\caffe/proto/caffe.pb.h(11043): error C2838: “shape”: 成员声明中的非法限定名 1>E:\caffe-master\include\caffe/proto/caffe.pb.h(11047): error C3254: “caffe::FillerParameter”: 类包含显式重写“mutable_shape”,但并不从包含函数声明的接口派生 1>E:\caffe-master\include\caffe/proto/caffe.pb.h(11047): error C2838: “mutable_shape”: 成员声明中的非法限定名 1>E:\caffe-master\include\caffe/proto/caffe.pb.h(11053): error C3254: “caffe::FillerParameter”: 类包含显式重写“release_shape”,但并不从包含函数声明的接口派生 1>E:\caffe-master\include\caffe/proto/caffe.pb.h(11053): error C2838: “release_shape”: 成员声明中的非法限定名 1>E:\caffe-master\include\caffe/proto/caffe.pb.h(11059): error C3254: “caffe::FillerParameter”: 类包含显式重写“set_allocated_shape”,但并不从包含函数声明的接口派生 1>E:\caffe-master\include\caffe/proto/caffe.pb.h(11059): error C2838: “set_allocated_shape”: 成员声明中的非法限定名 1>E:\caffe-master\include\caffe/proto/caffe.pb.h(11071): error C3254: “caffe::FillerParameter”: 类包含显式重写“data_size”,但并不从包含函数声明的接口派生 1>E:\caffe-master\include\caffe/proto/caffe.pb.h(11071): error C2838: “data_size”: 成员声明中的非法限定名 1>E:\caffe-master\include\caffe/proto/caffe.pb.h(11074): error C3254: “caffe::FillerParameter”: 类包含显式重写“clear_data”,但并不从包含函数声明的接口派生 1>E:\caffe-master\include\caffe/proto/caffe.pb.h(11074): error C2838: “clear_data”: 成员声明中的非法限定名 1>E:\caffe-master\include\caffe/proto/caffe.pb.h(11077): error C3254: “caffe::FillerParameter”: 类包含显式重写“data”,但并不从包含函数声明的接口派生 1>E:\caffe-master\include\caffe/proto/caffe.pb.h(11077): error C2838: “data”: 成员声明中的非法限定名 1>E:\caffe-master\include\caffe/proto/caffe.pb.h(11081): error C3254: “caffe::FillerParameter”: 类包含显式重写“set_data”,但并不从包含函数声明的接口派生 1>E:\caffe-master\include\caffe/proto/caffe.pb.h(11081): error C2838: “set_data”: 成员声明中的非法限定名 1>E:\caffe-master\include\caffe/proto/caffe.pb.h(11085): error C3254: “caffe::FillerParameter”: 类包含显式重写“add_data”,但并不从包含函数声明的接口派生 1>E:\caffe-master\include\caffe/proto/caffe.pb.h(11085): error C2838: “add_data”: 成员声明中的非法限定名 1>E:\caffe-master\include\caffe/proto/caffe.pb.h(11090): error C3254: “caffe::FillerParameter”: 类包含显式重写“data”,但并不从包含函数声明的接口派生 1>E:\caffe-master\include\caffe/proto/caffe.pb.h(11090): error C2838: “data”: 成员声明中的非法限定名 1>E:\caffe-master\include\caffe/proto/caffe.pb.h(11095): error C3254: “caffe::FillerParameter”: 类包含显式重写“mutable_data”,但并不从包含函数声明的接口派生 1>E:\caffe-master\include\caffe/proto/caffe.pb.h(11095): error C2838: “mutable_data”: 成员声明中的非法限定名 1>E:\caffe-master\include\caffe/proto/caffe.pb.h(11101): error C3254: “caffe::FillerParameter”: 类包含显式重写“diff_size”,但并不从包含函数声明的接口派生 1>E:\caffe-master\include\caffe/proto/caffe.pb.h(11101): error C2838: “diff_size”: 成员声明中的非法限定名 1>E:\caffe-master\include\caffe/proto/caffe.pb.h(11104): error C3254: “caffe::FillerParameter”: 类包含显式重写“clear_diff”,但并不从包含函数声明的接口派生 1>E:\caffe-master\include\caffe/proto/caffe.pb.h(11104): error C2838: “clear_diff”: 成员声明中的非法限定名 1>E:\caffe-master\include\caffe/proto/caffe.pb.h(11107): error C3254: “caffe::FillerParameter”: 类包含显式重写“diff”,但并不从包含函数声明的接口派生 1>E:\caffe-master\include\caffe/proto/caffe.pb.h(11107): error C2838: “diff”: 成员声明中的非法限定名 1>E:\caffe-master\include\caffe/proto/caffe.pb.h(11111): error C3254: “caffe::FillerParameter”: 类包含显式重写“set_diff”,但并不从包含函数声明的接口派生 1>E:\caffe-master\include\caffe/proto/caffe.pb.h(11111): error C2838: “set_diff”: 成员声明中的非法限定名 1>E:\caffe-master\include\caffe/proto/caffe.pb.h(11115): error C3254: “caffe::FillerParameter”: 类包含显式重写“add_diff”,但并不从包含函数声明的接口派生 1>E:\caffe-master\include\caffe/proto/caffe.pb.h(11115): error C2838: “add_diff”: 成员声明中的非法限定名 1>E:\caffe-master\include\caffe/proto/caffe.pb.h(11120): error C3254: “caffe::FillerParameter”: 类包含显式重写“diff”,但并不从包含函数声明的接口派生 1>E:\caffe-master\include\caffe/proto/caffe.pb.h(11120): error C2838: “diff”: 成员声明中的非法限定名 1>E:\caffe-master\include\caffe/proto/caffe.pb.h(11125): error C3254: “caffe::FillerParameter”: 类包含显式重写“mutable_diff”,但并不从包含函数声明的接口派生 1>E:\caffe-master\include\caffe/proto/caffe.pb.h(11125): error C2838: “mutable_diff”: 成员声明中的非法限定名 1>E:\caffe-master\include\caffe/proto/caffe.pb.h(11131): error C3254: “caffe::FillerParameter”: 类包含显式重写“double_data_size”,但并不从包含函数声明的接口派生 1>E:\caffe-master\include\caffe/proto/caffe.pb.h(11131): error C2838: “double_data_size”: 成员声明中的非法限定名 1>E:\caffe-master\include\caffe/proto/caffe.pb.h(11134): error C3254: “caffe::FillerParameter”: 类包含显式重写“clear_double_data”,但并不从包含函数声明的接口派生 1>E:\caffe-master\include\caffe/proto/caffe.pb.h(11134): error C2838: “clear_double_data”: 成员声明中的非法限定名 1>E:\caffe-master\include\caffe/proto/caffe.pb.h(11137): error C3254: “caffe::FillerParameter”: 类包含显式重写“double_data”,但并不从包含函数声明的接口派生 1>E:\caffe-master\include\caffe/proto/caffe.pb.h(11137): error C2838: “double_data”: 成员声明中的非法限定名
错误显示Field numbers must be positive integers.
make pycaffe出现下列问题 PROTOC src/caffe/proto/caffe.proto caffe.proto:793:36: Field numbers must be positive integers. Makefile:632: recipe for target '.build_release/src/caffe/proto/caffe.pb.cc' failed make: *** [.build_release/src/caffe/proto/caffe.pb.cc] Error 1
caffe编译:compute_image_mean.cpp:(.text.startup+0x2f):对‘boost::system::generic_category()’未定义的引用
caffe编译: compute_image_mean.cpp:(.text.startup+0x2f):对‘boost::system::generic_category()’未定义的引用 ![图片说明](https://img-ask.csdn.net/upload/201911/28/1574900443_165848.png) 求大神解决
python配置caffe,vs编译caffe遇到error
想在anaconda(python3.6)下配置caffe,vs2013编译caffe的时候就遇到问题 错误 3 error LNK2001: 无法解析的外部符号 "struct _object * __cdecl boost::python::detail::init_module(struct PyModuleDef &,void (__cdecl*)(void))" (?init_module@detail@python@boost@@YAPEAU_object@@AEAUPyModuleDef@@P6AXXZ@Z) C:\caffetest\caffe-master\windows\pycaffe\_caffe.obj pycaffe 错误 4 error LNK1120: 1 个无法解析的外部命令 C:\caffetest\Bin\x64\Release\_caffe.pyd 1 1 pycaffe 环境:win10,cuda9.2(2080显卡只支持9.2以上版本)
编译caffe时出现这个问题~求解系统ubuntu15.04
![图片说明](https://img-ask.csdn.net/upload/201602/25/1456393797_222555.png)请问能帮忙解决吗?新手练习。opencv3.0,不行的话能请教怎么卸载opencv3.0吗?用的SH文件装的。linux新手见谅。
编译opencv gpu版时报错,谢谢
1>D:\opencv3.4world\modules\dnn\src\caffe\caffe_io.cpp(1124): error C2440: “<function-style-cast>”: **无法从“bool”转换为“google::protobuf::TextFormat::Parser”**
caffe编译时出现的问题
![如图所示,各位大神求帮忙,这是在编译caffe时出现的问题](https://img-ask.csdn.net/upload/201708/07/1502073061_619543.png)
Ubuntu16.04下 convert_imageset.cpp编译和使用
​我的系统是Ubuntu16.04 想用caffe中的googlenet模型训练自己的图片。在预处理中需要用工具 convert_imageset.cpp,但用之前需要先编译为.EXE可执行才能使用。在网上查到“convert_imageset.cpp和caffe.cpp是一样的,两个都包含main入口,所以只需要把caffe删掉,换成convert_imageset就可以在caffe环境中跑了,而不需要为了跑起来这个cpp单独配无数个文件。”用G++编译,答提示报错convert_imageset.cpp:21:34 没有那个文件或目录。不知如何具体操作,请大神指教,多谢!!
caffe中draw_net 无法使用
在调用caffe中draw_net 的时候报错 ``` sudo python /home/yuanshuai/caffe/python/draw_net.py /home/yuanshuai/caffe/examples/mnist/lenet_train_test.prototxt /home/yuanshuai/lenet.png --rankdir=LR ``` 错误如下: ``` Drawing net to /home/yuanshuai/lenet.png Traceback (most recent call last): File "/home/yuanshuai/caffe/python/draw_net.py", line 58, in <module> main() File "/home/yuanshuai/caffe/python/draw_net.py", line 54, in main phase) File "/home/yuanshuai/caffe/python/caffe/draw.py", line 244, in draw_net_to_file fid.write(draw_net(caffe_net, rankdir, ext, phase)) File "/home/yuanshuai/caffe/python/caffe/draw.py", line 223, in draw_net return get_pydot_graph(caffe_net, rankdir, phase=phase).create(format=ext) File "/home/yuanshuai/caffe/python/caffe/draw.py", line 167, in get_pydot_graph node_label = get_layer_label(layer, rankdir) File "/home/yuanshuai/caffe/python/caffe/draw.py", line 107, in get_layer_label layer.pooling_param.kernel_size[0] if len(layer.pooling_param.kernel_size._values) else 1, AttributeError: 'int' object has no attribute '_values' ```
ubuntu14 下 Caffe编译问题 出错
# .build_release/lib/libcaffe.so: undefined reference to `cudnnConvolutionBackwardData_v3'.build_release/lib/libcaffe.so: undefined reference to `cudnnConvolutionBackwardData_v3' .build_release/lib/libcaffe.so: undefined reference to `cudnnConvolutionBackwardFilter_v3' collect2: error: ld returned 1 exit status make: *** [.build_release/tools/upgrade_solver_proto_text.bin] Error 1 make: *** Waiting for unfinished jobs.... .build_release/lib/libcaffe.so: undefined reference to `cudnnConvolutionBackwardData_v3' .build_release/lib/libcaffe.so: undefined reference to `cudnnConvolutionBackwardFilter_v3' collect2: error: ld returned 1 exit status make: *** [.build_release/tools/upgrade_net_proto_binary.bin] Error 1 .build_release/lib/libcaffe.so: undefined reference to `cudnnConvolutionBackwardData_v3' .build_release/lib/libcaffe.so: undefined reference to `cudnnConvolutionBackwardFilter_v3' collect2: error: ld returned 1 exit status .build_release/lib/make: libcaffe.so: undefined reference to *** [.build_release/tools/compute_image_mean.bin] Error 1`cudnnConvolutionBackwardData_v3 ' .build_release/lib/libcaffe.so: undefined reference to `cudnnConvolutionBackwardFilter_v3' collect2: error: ld returned 1 exit status make: *** [.build_release/tools/caffe.bin] Error 1 .build_release/lib/libcaffe.so: undefined reference to `cudnnConvolutionBackwardData_v3' .build_release/lib/libcaffe.so: undefined reference to `cudnnConvolutionBackwardFilter_v3' collect2: error: ld returned 1 exit status make: *** [.build_release/examples/cifar10/convert_cifar_data.bin] Error 1 .build_release/lib/libcaffe.so: undefined reference to `cudnnConvolutionBackwardData_v3' .build_release/lib/libcaffe.so: undefined reference to `cudnnConvolutionBackwardFilter_v3' collect2: error: ld returned 1 exit status make: *** [.build_release/tools/convert_imageset.bin] Error 1 .build_release/lib/libcaffe.so: undefined reference to `cudnnConvolutionBackwardData_v3' .build_release/lib/libcaffe.so: undefined reference to `cudnnConvolutionBackwardFilter_v3' collect2: error: ld returned 1 exit status make: *** [.build_release/tools/extract_features.bin] Error 1 .build_release/lib/libcaffe.so: undefined reference to `cudnnConvolutionBackwardData_v3' .build_release/lib/libcaffe.so: undefined reference to `cudnnConvolutionBackwardFilter_v3' collect2: error: ld returned 1 exit status make: *** [.build_release/tools/upgrade_net_proto_text.bin] Error 1_**
mac下安装caffe,make时遇到的问题
mac下安装caffe,make时遇到的问题 CXX/LD -o .build_release/tools/caffe.bin clang: warning: argument unused during compilation: '-pthread' Undefined symbols for architecture x86_64: "google::SetUsageMessage(std::__1::basic_string<char, std::__1::char_traits<char>, std::__1::allocator<char> > const&)", referenced from: _main in caffe.o "google::SetVersionString(std::__1::basic_string<char, std::__1::char_traits<char>, std::__1::allocator<char> > const&)", referenced from: _main in caffe.o ld: symbol(s) not found for architecture x86_64 clang: error: linker command failed with exit code 1 (use -v to see invocation) make: *** [.build_release/tools/caffe.bin] Error 1 如上,该怎么解决,谢谢
win7+1080ti+cuda8.0+cudnn5.0+caffe编译报错
我最近在配置caffe,配置环境是win7+1080ti+cuda8.0+cudnn5.0+caffe,按照网上的相关博文进行了配置,但是现在是Debug版本可以编译成功并运行,Release版本就会直接报错,主要的错误是error MSB3721: 命令“"C:\Program Files\NVIDIA GPU Computing Toolkit\CUDA\v8.0\bin\nvcc.exe" -gencode=arch=compute_61,code=\"sm_61,compute_61\" --use-local-env --cl-version 2013 -ccbin和error MSB4062: 未能从程序集 D:\Caffe\NugetPackages\OpenCV.2.4.10\build\native\\private\coapp.NuGetNativeMSBuildTasks.dll 加载任务“NuGetPackageOverlay”。未能加载文件或程序集“file:///D:\Caffe\NugetPackages\OpenCV.2.4.10\build\native\private\coapp.NuGetNativeMSBuildTasks.dll”或它的某一个依赖项。另一个程序正在使用此文件,进程无法访问。 请问大家知道为什么会出现这种情况吗?谢谢
ubuntu16.04安装caffe时编译遇到的问题
![图片说明](https://img-ask.csdn.net/upload/201801/15/1516010855_935381.jpg) 第一次在安装caffe的时候,make all -j16报这个错,cuda、cudnn、nccl、opencv都装成功了 ,依赖包也都装了,实在是不知道哪里的问题,大神帮忙出来看一下吧!!!
Java学习的正确打开方式
在博主认为,对于入门级学习java的最佳学习方法莫过于视频+博客+书籍+总结,前三者博主将淋漓尽致地挥毫于这篇博客文章中,至于总结在于个人,实际上越到后面你会发现学习的最好方式就是阅读参考官方文档其次就是国内的书籍,博客次之,这又是一个层次了,这里暂时不提后面再谈。博主将为各位入门java保驾护航,各位只管冲鸭!!!上天是公平的,只要不辜负时间,时间自然不会辜负你。 何谓学习?博主所理解的学习,它是一个过程,是一个不断累积、不断沉淀、不断总结、善于传达自己的个人见解以及乐于分享的过程。
程序员必须掌握的核心算法有哪些?
由于我之前一直强调数据结构以及算法学习的重要性,所以就有一些读者经常问我,数据结构与算法应该要学习到哪个程度呢?,说实话,这个问题我不知道要怎么回答你,主要取决于你想学习到哪些程度,不过针对这个问题,我稍微总结一下我学过的算法知识点,以及我觉得值得学习的算法。这些算法与数据结构的学习大多数是零散的,并没有一本把他们全部覆盖的书籍。下面是我觉得值得学习的一些算法以及数据结构,当然,我也会整理一些看过...
大学四年自学走来,这些私藏的实用工具/学习网站我贡献出来了
大学四年,看课本是不可能一直看课本的了,对于学习,特别是自学,善于搜索网上的一些资源来辅助,还是非常有必要的,下面我就把这几年私藏的各种资源,网站贡献出来给你们。主要有:电子书搜索、实用工具、在线视频学习网站、非视频学习网站、软件下载、面试/求职必备网站。 注意:文中提到的所有资源,文末我都给你整理好了,你们只管拿去,如果觉得不错,转发、分享就是最大的支持了。 一、电子书搜索 对于大部分程序员...
linux系列之常用运维命令整理笔录
本博客记录工作中需要的linux运维命令,大学时候开始接触linux,会一些基本操作,可是都没有整理起来,加上是做开发,不做运维,有些命令忘记了,所以现在整理成博客,当然vi,文件操作等就不介绍了,慢慢积累一些其它拓展的命令,博客不定时更新 free -m 其中:m表示兆,也可以用g,注意都要小写 Men:表示物理内存统计 total:表示物理内存总数(total=used+free) use...
比特币原理详解
一、什么是比特币 比特币是一种电子货币,是一种基于密码学的货币,在2008年11月1日由中本聪发表比特币白皮书,文中提出了一种去中心化的电子记账系统,我们平时的电子现金是银行来记账,因为银行的背后是国家信用。去中心化电子记账系统是参与者共同记账。比特币可以防止主权危机、信用风险。其好处不多做赘述,这一层面介绍的文章很多,本文主要从更深层的技术原理角度进行介绍。 二、问题引入 假设现有4个人...
程序员接私活怎样防止做完了不给钱?
首先跟大家说明一点,我们做 IT 类的外包开发,是非标品开发,所以很有可能在开发过程中会有这样那样的需求修改,而这种需求修改很容易造成扯皮,进而影响到费用支付,甚至出现做完了项目收不到钱的情况。 那么,怎么保证自己的薪酬安全呢? 我们在开工前,一定要做好一些证据方面的准备(也就是“讨薪”的理论依据),这其中最重要的就是需求文档和验收标准。一定要让需求方提供这两个文档资料作为开发的基础。之后开发...
网页实现一个简单的音乐播放器(大佬别看。(⊙﹏⊙))
今天闲着无事,就想写点东西。然后听了下歌,就打算写个播放器。 于是乎用h5 audio的加上js简单的播放器完工了。 演示地点演示 html代码如下` music 这个年纪 七月的风 音乐 ` 然后就是css`*{ margin: 0; padding: 0; text-decoration: none; list-...
Python十大装B语法
Python 是一种代表简单思想的语言,其语法相对简单,很容易上手。不过,如果就此小视 Python 语法的精妙和深邃,那就大错特错了。本文精心筛选了最能展现 Python 语法之精妙的十个知识点,并附上详细的实例代码。如能在实战中融会贯通、灵活使用,必将使代码更为精炼、高效,同时也会极大提升代码B格,使之看上去更老练,读起来更优雅。
数据库优化 - SQL优化
以实际SQL入手,带你一步一步走上SQL优化之路!
2019年11月中国大陆编程语言排行榜
2019年11月2日,我统计了某招聘网站,获得有效程序员招聘数据9万条。针对招聘信息,提取编程语言关键字,并统计如下: 编程语言比例 rank pl_ percentage 1 java 33.62% 2 cpp 16.42% 3 c_sharp 12.82% 4 javascript 12.31% 5 python 7.93% 6 go 7.25% 7 p...
通俗易懂地给女朋友讲:线程池的内部原理
餐盘在灯光的照耀下格外晶莹洁白,女朋友拿起红酒杯轻轻地抿了一小口,对我说:“经常听你说线程池,到底线程池到底是个什么原理?”
《奇巧淫技》系列-python!!每天早上八点自动发送天气预报邮件到QQ邮箱
将代码部署服务器,每日早上定时获取到天气数据,并发送到邮箱。 也可以说是一个小型人工智障。 知识可以运用在不同地方,不一定非是天气预报。
经典算法(5)杨辉三角
杨辉三角 是经典算法,这篇博客对它的算法思想进行了讲解,并有完整的代码实现。
英特尔不为人知的 B 面
从 PC 时代至今,众人只知在 CPU、GPU、XPU、制程、工艺等战场中,英特尔在与同行硬件芯片制造商们的竞争中杀出重围,且在不断的成长进化中,成为全球知名的半导体公司。殊不知,在「刚硬」的背后,英特尔「柔性」的软件早已经做到了全方位的支持与支撑,并持续发挥独特的生态价值,推动产业合作共赢。 而对于这一不知人知的 B 面,很多人将其称之为英特尔隐形的翅膀,虽低调,但是影响力却不容小觑。 那么,在...
腾讯算法面试题:64匹马8个跑道需要多少轮才能选出最快的四匹?
昨天,有网友私信我,说去阿里面试,彻底的被打击到了。问了为什么网上大量使用ThreadLocal的源码都会加上private static?他被难住了,因为他从来都没有考虑过这个问题。无独有偶,今天笔者又发现有网友吐槽了一道腾讯的面试题,我们一起来看看。 腾讯算法面试题:64匹马8个跑道需要多少轮才能选出最快的四匹? 在互联网职场论坛,一名程序员发帖求助到。二面腾讯,其中一个算法题:64匹...
面试官:你连RESTful都不知道我怎么敢要你?
干货,2019 RESTful最贱实践
刷了几千道算法题,这些我私藏的刷题网站都在这里了!
遥想当年,机缘巧合入了 ACM 的坑,周边巨擘林立,从此过上了"天天被虐似死狗"的生活… 然而我是谁,我可是死狗中的战斗鸡,智力不够那刷题来凑,开始了夜以继日哼哧哼哧刷题的日子,从此"读题与提交齐飞, AC 与 WA 一色 ",我惊喜的发现被题虐既刺激又有快感,那一刻我泪流满面。这么好的事儿作为一个正直的人绝不能自己独享,经过激烈的颅内斗争,我决定把我私藏的十几个 T 的,阿不,十几个刷题网...
为啥国人偏爱Mybatis,而老外喜欢Hibernate/JPA呢?
关于SQL和ORM的争论,永远都不会终止,我也一直在思考这个问题。昨天又跟群里的小伙伴进行了一番讨论,感触还是有一些,于是就有了今天这篇文。 声明:本文不会下关于Mybatis和JPA两个持久层框架哪个更好这样的结论。只是摆事实,讲道理,所以,请各位看官勿喷。 一、事件起因 关于Mybatis和JPA孰优孰劣的问题,争论已经很多年了。一直也没有结论,毕竟每个人的喜好和习惯是大不相同的。我也看...
白话阿里巴巴Java开发手册高级篇
不久前,阿里巴巴发布了《阿里巴巴Java开发手册》,总结了阿里巴巴内部实际项目开发过程中开发人员应该遵守的研发流程规范,这些流程规范在一定程度上能够保证最终的项目交付质量,通过在时间中总结模式,并推广给广大开发人员,来避免研发人员在实践中容易犯的错误,确保最终在大规模协作的项目中达成既定目标。 无独有偶,笔者去年在公司里负责升级和制定研发流程、设计模板、设计标准、代码标准等规范,并在实际工作中进行...
SQL-小白最佳入门sql查询一
不要偷偷的查询我的个人资料,即使你再喜欢我,也不要这样,真的不好;
项目中的if else太多了,该怎么重构?
介绍 最近跟着公司的大佬开发了一款IM系统,类似QQ和微信哈,就是聊天软件。我们有一部分业务逻辑是这样的 if (msgType = "文本") { // dosomething } else if(msgType = "图片") { // doshomething } else if(msgType = "视频") { // doshomething } else { // doshom...
Nginx 原理和架构
Nginx 是一个免费的,开源的,高性能的 HTTP 服务器和反向代理,以及 IMAP / POP3 代理服务器。Nginx 以其高性能,稳定性,丰富的功能,简单的配置和低资源消耗而闻名。 Nginx 的整体架构 Nginx 里有一个 master 进程和多个 worker 进程。master 进程并不处理网络请求,主要负责调度工作进程:加载配置、启动工作进程及非停升级。worker 进程负责处...
【图解经典算法题】如何用一行代码解决约瑟夫环问题
约瑟夫环问题算是很经典的题了,估计大家都听说过,然后我就在一次笔试中遇到了,下面我就用 3 种方法来详细讲解一下这道题,最后一种方法学了之后保证让你可以让你装逼。 问题描述:编号为 1-N 的 N 个士兵围坐在一起形成一个圆圈,从编号为 1 的士兵开始依次报数(1,2,3…这样依次报),数到 m 的 士兵会被杀死出列,之后的士兵再从 1 开始报数。直到最后剩下一士兵,求这个士兵的编号。 1、方...
吐血推荐珍藏的Visual Studio Code插件
作为一名Java工程师,由于工作需要,最近一个月一直在写NodeJS,这种经历可以说是一部辛酸史了。好在有神器Visual Studio Code陪伴,让我的这段经历没有更加困难。眼看这段经历要告一段落了,今天就来给大家分享一下我常用的一些VSC的插件。 VSC的插件安装方法很简单,只需要点击左侧最下方的插件栏选项,然后就可以搜索你想要的插件了。 下面我们进入正题 Material Theme ...
如何防止抄袭PCB电路板
目录 1、抄板是什么 2、抄板是否属于侵权 3、如何防止抄板 1、抄板是什么 抄板也叫克隆或仿制,是对设计出来的PCB板进行反向技术研究;目前全新的定义:从狭义上来说,抄板仅指对电子产品电路板PCB文件的提取还原和利用文件进行电路板克隆的过程;从广义上来说,抄板不仅包括对电路板文件提取、电路板克隆、电路板仿制等技术过程,而且包括对电路板文件进行修改(即改板)、对电子产品外形模具进行三维...
“狗屁不通文章生成器”登顶GitHub热榜,分分钟写出万字形式主义大作
一、垃圾文字生成器介绍 最近在浏览GitHub的时候,发现了这样一个骨骼清奇的雷人项目,而且热度还特别高。 项目中文名:狗屁不通文章生成器 项目英文名:BullshitGenerator 根据作者的介绍,他是偶尔需要一些中文文字用于GUI开发时测试文本渲染,因此开发了这个废话生成器。但由于生成的废话实在是太过富于哲理,所以最近已经被小伙伴们给玩坏了。 他的文风可能是这样的: 你发现,...
程序员:我终于知道post和get的区别
是一个老生常谈的话题,然而随着不断的学习,对于以前的认识有很多误区,所以还是需要不断地总结的,学而时习之,不亦说乎
《程序人生》系列-这个程序员只用了20行代码就拿了冠军
你知道的越多,你不知道的越多 点赞再看,养成习惯GitHub上已经开源https://github.com/JavaFamily,有一线大厂面试点脑图,欢迎Star和完善 前言 这一期不算《吊打面试官》系列的,所有没前言我直接开始。 絮叨 本来应该是没有这期的,看过我上期的小伙伴应该是知道的嘛,双十一比较忙嘛,要值班又要去帮忙拍摄年会的视频素材,还得搞个程序员一天的Vlog,还要写BU...
加快推动区块链技术和产业创新发展,2019可信区块链峰会在京召开
11月8日,由中国信息通信研究院、中国通信标准化协会、中国互联网协会、可信区块链推进计划联合主办,科技行者协办的2019可信区块链峰会将在北京悠唐皇冠假日酒店开幕。   区块链技术被认为是继蒸汽机、电力、互联网之后,下一代颠覆性的核心技术。如果说蒸汽机释放了人类的生产力,电力解决了人类基本的生活需求,互联网彻底改变了信息传递的方式,区块链作为构造信任的技术有重要的价值。   1...
Python 植物大战僵尸代码实现(2):植物卡片选择和种植
这篇文章要介绍的是: - 上方植物卡片栏的实现。 - 点击植物卡片,鼠标切换为植物图片。 - 鼠标移动时,判断当前在哪个方格中,并显示半透明的植物作为提示。
相关热词 c# 引用mysql c#动态加载非托管dll c# 两个表数据同步 c# 返回浮点json c# imap 链接状态 c# 漂亮字 c# 上取整 除法 c#substring c#中延时关闭 c#线段拖拉
立即提问