maven 打包报如下错误

org.apache.maven.lifecycle.LifecycleExecutionException: Failed to execute goal org.apache.maven.plugins:maven-compiler-plugin:2.5.1:compile (default-compile) on project ship-base-web: Compilation failure
at org.apache.maven.lifecycle.internal.MojoExecutor.execute(MojoExecutor.java:212)
at org.apache.maven.lifecycle.internal.MojoExecutor.execute(MojoExecutor.java:153)
at org.apache.maven.lifecycle.internal.MojoExecutor.execute(MojoExecutor.java:145)
at org.apache.maven.lifecycle.internal.LifecycleModuleBuilder.buildProject(LifecycleModuleBuilder.java:116)
at org.apache.maven.lifecycle.internal.LifecycleModuleBuilder.buildProject(LifecycleModuleBuilder.java:80)
at org.apache.maven.lifecycle.internal.builder.singlethreaded.SingleThreadedBuilder.build(SingleThreadedBuilder.java:51)
at org.apache.maven.lifecycle.internal.LifecycleStarter.execute(LifecycleStarter.java:128)
at org.apache.maven.DefaultMaven.doExecute(DefaultMaven.java:307)
at org.apache.maven.DefaultMaven.doExecute(DefaultMaven.java:193)
at org.apache.maven.DefaultMaven.execute(DefaultMaven.java:106)
at org.apache.maven.cli.MavenCli.execute(MavenCli.java:862)
at org.apache.maven.cli.MavenCli.doMain(MavenCli.java:286)
at org.apache.maven.cli.MavenCli.main(MavenCli.java:197)
at sun.reflect.NativeMethodAccessorImpl.invoke0(Native Method)
at sun.reflect.NativeMethodAccessorImpl.invoke(NativeMethodAccessorImpl.java:57)
at sun.reflect.DelegatingMethodAccessorImpl.invoke(DelegatingMethodAccessorImpl.java:43)
at java.lang.reflect.Method.invoke(Method.java:606)
at org.codehaus.plexus.classworlds.launcher.Launcher.launchEnhanced(Launcher.java:289)
at org.codehaus.plexus.classworlds.launcher.Launcher.launch(Launcher.java:229)
at org.codehaus.plexus.classworlds.launcher.Launcher.mainWithExitCode(Launcher.java:415)
at org.codehaus.plexus.classworlds.launcher.Launcher.main(Launcher.java:356)
Caused by: org.apache.maven.plugin.CompilationFailureException: Compilation failure
at org.apache.maven.plugin.AbstractCompilerMojo.execute(AbstractCompilerMojo.java:729)
at org.apache.maven.plugin.CompilerMojo.execute(CompilerMojo.java:128)
at org.apache.maven.plugin.DefaultBuildPluginManager.executeMojo(DefaultBuildPluginManager.java:134)
at org.apache.maven.lifecycle.internal.MojoExecutor.execute(MojoExecutor.java:208)
... 20 more
[ERROR]
[ERROR] Re-run Maven using the -X switch to enable full debug logging.
[ERROR]
[ERROR] For more information about the errors and possible solutions, please read the following articles:
[ERROR] [Help 1] http://cwiki.apache.org/confluence/display/MAVEN/MojoFailureException

2个回答

求高手解答啊 小弟先谢谢了

在命令后边增加 -X 参数查看具体的错误, 谢谢

Csdn user default icon
上传中...
上传图片
插入图片
抄袭、复制答案,以达到刷声望分或其他目的的行为,在CSDN问答是严格禁止的,一经发现立刻封号。是时候展现真正的技术了!
其他相关推荐
maven 打包时出现错误

错误提示如下所示: [ERROR] Failed to execute goal org.apache.maven.plugins:maven-war-plugin:2.2:war (default-war) on project lmsportal-admin: Error assembling WAR: webxml attribut e is required (or pre-existing WEB-INF/web.xml if executing in update mode) -> [ Help 1] [ERROR] [ERROR] To see the full stack trace of the errors, re-run Maven with the -e swit ch. [ERROR] Re-run Maven using the -X switch to enable full debug logging. [ERROR] [ERROR] For more information about the errors and possible solutions, please rea d the following articles: [ERROR] [Help 1] http://cwiki.apache.org/confluence/display/MAVEN/MojoExecutionE xception 使用的MyEclipse 10.7,Maven3.1.0,项目是从SVN检出的。

maven module 打包报错问题

maven结构如下: ![图片说明](https://img-ask.csdn.net/upload/201707/10/1499654181_120999.png) 当加入web时打包报提示: **Failed to execute goal org.apache.maven.plugins:maven-war-plugin:2.2:war (default-war)** 后增加 **<plugins> <plugin> <groupId>org.apache.maven.plugins</groupId> <artifactId>maven-war-plugin</artifactId> <version>2.4</version> <configuration> <webResources> <resource> <directory>src\main\webapp</directory> </resource> </webResources> </configuration> </plugin> </plugins>** 却又提示 **[INFO] Processing war project [INFO] Copying webapp webResources [E:\workspace\itm.root\itm.client\src\main\webapp] to [E:\workspace\itm.root\itm.client\target\itm.client] [INFO] Copying webapp resources [E:\workspace\itm.root\itm.client\src\main\webapp] java.lang.Error: Cleaner terminated abnormally at sun.misc.Cleaner$1.run(Cleaner.java:148) at sun.misc.Cleaner$1.run(Cleaner.java:145) at java.security.AccessController.doPrivileged(Native Method) at sun.misc.Cleaner.clean(Cleaner.java:145) at sun.nio.ch.FileChannelImpl.unmap(FileChannelImpl.java:849) at sun.nio.ch.FileChannelImpl.transferFromFileChannel(FileChannelImpl.java:647) at sun.nio.ch.FileChannelImpl.transferFrom(FileChannelImpl.java:708) at org.codehaus.plexus.util.FileUtils.doCopyFile(FileUtils.java:1077) at org.codehaus.plexus.util.FileUtils.copyFile(FileUtils.java:1049) at org.apache.maven.plugin.war.packaging.AbstractWarPackagingTask.copyFile(AbstractWarPackagingTask.java:334) at org.apache.maven.plugin.war.packaging.AbstractWarPackagingTask$1.registered(AbstractWarPackagingTask.java:154) at org.apache.maven.plugin.war.util.WebappStructure.registerFile(WebappStructure.java:207) at org.apache.maven.plugin.war.packaging.AbstractWarPackagingTask.copyFile(AbstractWarPackagingTask.java:149) at org.apache.maven.plugin.war.packaging.ArtifactsPackagingTask.performPackaging(ArtifactsPackagingTask.java:110) at org.apache.maven.plugin.war.packaging.WarProjectPackagingTask.handleArtifacts(WarProjectPackagingTask.java:194) at org.apache.maven.plugin.war.packaging.WarProjectPackagingTask.performPackaging(WarProjectPackagingTask.java:106) at org.apache.maven.plugin.war.AbstractWarMojo.buildWebapp(AbstractWarMojo.java:505) at org.apache.maven.plugin.war.AbstractWarMojo.buildExplodedWebapp(AbstractWarMojo.java:433) at org.apache.maven.plugin.war.WarMojo.performPackaging(WarMojo.java:213) at org.apache.maven.plugin.war.WarMojo.execute(WarMojo.java:175) at org.apache.maven.plugin.DefaultBuildPluginManager.executeMojo(DefaultBuildPluginManager.java:134) at org.apache.maven.lifecycle.internal.MojoExecutor.execute(MojoExecutor.java:207) at org.apache.maven.lifecycle.internal.MojoExecutor.execute(MojoExecutor.java:153) at org.apache.maven.lifecycle.internal.MojoExecutor.execute(MojoExecutor.java:145) at org.apache.maven.lifecycle.internal.LifecycleModuleBuilder.buildProject(LifecycleModuleBuilder.java:116) at org.apache.maven.lifecycle.internal.LifecycleModuleBuilder.buildProject(LifecycleModuleBuilder.java:80) at org.apache.maven.lifecycle.internal.builder.singlethreaded.SingleThreadedBuilder.build(SingleThreadedBuilder.java:51) at org.apache.maven.lifecycle.internal.LifecycleStarter.execute(LifecycleStarter.java:128) at org.apache.maven.DefaultMaven.doExecute(DefaultMaven.java:307) at org.apache.maven.DefaultMaven.doExecute(DefaultMaven.java:193) at org.apache.maven.DefaultMaven.execute(DefaultMaven.java:106) at org.apache.maven.cli.MavenCli.execute(MavenCli.java:863) at org.apache.maven.cli.MavenCli.doMain(MavenCli.java:288) at org.apache.maven.cli.MavenCli.main(MavenCli.java:199) at sun.reflect.NativeMethodAccessorImpl.invoke0(Native Method) at sun.reflect.NativeMethodAccessorImpl.invoke(NativeMethodAccessorImpl.java:62) at sun.reflect.DelegatingMethodAccessorImpl.invoke(DelegatingMethodAccessorImpl.java:43) at java.lang.reflect.Method.invoke(Method.java:498) at org.codehaus.plexus.classworlds.launcher.Launcher.launchEnhanced(Launcher.java:289) at org.codehaus.plexus.classworlds.launcher.Launcher.launch(Launcher.java:229) at org.codehaus.plexus.classworlds.launcher.Launcher.mainWithExitCode(Launcher.java:415) at org.codehaus.plexus.classworlds.launcher.Launcher.main(Launcher.java:356) Caused by: java.io.IOException: 试图访问无效的地址。 at sun.nio.ch.FileChannelImpl.unmap0(Native Method) at sun.nio.ch.FileChannelImpl.access$000(FileChannelImpl.java:50) at sun.nio.ch.FileChannelImpl$Unmapper.run(FileChannelImpl.java:826) at sun.misc.Cleaner.clean(Cleaner.java:143) ... 38 more **

maven 项目,通过 maven编译,在浏览器中打开报如下错误

maven 项目,通过 maven编译,在浏览器中打开报如下错误: 严重: Servlet.service() for servlet jsp threw exception java.lang.LinkageError: loader constraint violation: loader (instance of org/apache/jasper/servlet/JasperLoader) previously initiated loading for a different type with name "javax/servlet/http/HttpServletRequest" at java.lang.Class.getDeclaredMethods0(Native Method) at java.lang.Class.privateGetDeclaredMethods(Unknown Source) at java.lang.Class.getDeclaredMethods(Unknown Source) at org.apache.catalina.util.DefaultAnnotationProcessor.processAnnotations(DefaultAnnotationProcessor.java:226) at org.apache.jasper.servlet.JspServletWrapper.getServlet(JspServletWrapper.java:148) at org.apache.jasper.servlet.JspServletWrapper.service(JspServletWrapper.java:329) at org.apache.jasper.servlet.JspServlet.serviceJspFile(JspServlet.java:313) at org.apache.jasper.servlet.JspServlet.service(JspServlet.java:260) at javax.servlet.http.HttpServlet.service(HttpServlet.java:717) at org.apache.catalina.core.ApplicationFilterChain.internalDoFilter(ApplicationFilterChain.java:290) at org.apache.catalina.core.ApplicationFilterChain.doFilter(ApplicationFilterChain.java:206) at org.apache.catalina.core.StandardWrapperValve.invoke(StandardWrapperValve.java:233) at org.apache.catalina.core.StandardContextValve.invoke(StandardContextValve.java:191) at org.apache.catalina.core.StandardHostValve.invoke(StandardHostValve.java:127) at org.apache.catalina.valves.ErrorReportValve.invoke(ErrorReportValve.java:102) at org.apache.catalina.core.StandardEngineValve.invoke(StandardEngineValve.java:109) at org.apache.catalina.connector.CoyoteAdapter.service(CoyoteAdapter.java:298) at org.apache.coyote.http11.Http11Processor.process(Http11Processor.java:857) at org.apache.coyote.http11.Http11Protocol$Http11ConnectionHandler.process(Http11Protocol.java:588) at org.apache.tomcat.util.net.JIoEndpoint$Worker.run(JIoEndpoint.java:489) at java.lang.Thread.run(Unknown Source) 用debug as deubg on server 没有问题,只有一个简单的 index.jsp页面。 pom如下: <dependencies> <dependency> <groupId>junit</groupId> <artifactId>junit</artifactId> <version>3.8.1</version> <scope>test</scope> </dependency> <!-- <dependency> --> <!-- <groupId>javax.servlet</groupId> --> <!-- <artifactId>javax.servlet-api</artifactId> --> <!-- <version>3.1-b09</version> --> <!-- </dependency> --> <!-- <dependency> --> <!-- <groupId>javax.servlet</groupId> --> <!-- <artifactId>javax.servlet-api</artifactId> --> <!-- <version>3.0.1</version> --> <!-- <classifier>javadoc</classifier> --> <!-- </dependency> --> <dependency> <groupId>javax.servlet</groupId> <artifactId>javax.servlet-api</artifactId> <version>3.0.1</version> </dependency> <dependency> <groupId>org.slf4j</groupId> <artifactId>log4j-over-slf4j</artifactId> <version>1.7.4</version> </dependency> <dependency> <groupId>commons-lang</groupId> <artifactId>commons-lang</artifactId> <version>2.2</version> </dependency> </dependencies>

在控制台上maven打包报错。

楼主刚看徐晓斌的《maven实战》,正在控制台上鼓捣maven呢,mvn clean compile,mvn clean test也成功,然后mvn clean package打包也成功,但是由于打出来的Jar包没有指定main方法的位置,我就按照书上的案例,加入maven-shade-plugin插件,在pom.xml加入这话话,一直打包都是错误的。 pom.xml文件配置如下: ``` <?xml version="1.0" encoding="UTF-8"?> <project xmlns="http://maven.apache.org/POM/4.0.0" xmlns:xsi="http://www.w3.org/2001/XMLSchema-instance" xsi:schemaLocation="http://maven.apache.org/POM/4.0.0 http://maven.apache.org/xsd/maven-4.0.0.xsd"> <modelVersion>4.0.0</modelVersion> <groupId>xx.xx.xxx</groupId> <artifactId>hello-maven</artifactId> <version>1.0-SNAPSHOT</version> <packaging>jar</packaging> <properties> <project.build.sourceEncoding>UTF-8</project.build.sourceEncoding> </properties> <dependencies> <dependency> <groupId>junit</groupId> <artifactId>junit</artifactId> <version>3.8.1</version> <scope>test</scope> </dependency> </dependencies> <build> <plugins> <plugin> <groupId>org.apache.maven.plugins</groupId> <artifactId>maven-compiler-plugin</artifactId> <configuration> <source>1.6</source> <target>1.6</target> </configuration> </plugin> <plugin> <groupId>org.apache.maven.plugins</groupId> <artifactId>maven-shade-plugin</artifactId> <version>1.2.1</version> <configuration> <transformers> <transformer implementation = "org.apache.maven.plugins.shade.resource.MainifestResourceTransformer"> <mainClass>xx.xxx.xxx.hellomaven.App</mainClass> </transformer> </transformers> </configuration> <executions> <execution> <phase>package</phase> <goals> <goal>shade</goal> </goals> </execution> </executions> </plugin> </plugins> </build> </project> ``` 控制台报错信息如下: ``` [INFO] BUILD FAILURE [INFO] ------------------------------------------------------------------------ [INFO] Total time: 1.731s [INFO] Finished at: Tue Mar 29 11:40:17 CST 2016 [INFO] Final Memory: 10M/24M [INFO] ------------------------------------------------------------------------ [ERROR] Failed to execute goal org.apache.maven.plugins:maven-shade-plugin:1.2.1 :shade (default) on project hello-maven: Unable to parse configuration of mojo o rg.apache.maven.plugins:maven-shade-plugin:1.2.1:shade: ClassNotFoundException: Class name which was explicitly given in configuration using 'implementation' at tribute: 'org.apache.maven.plugins.shade.resource.MainifestResourceTransformer' cannot be loaded -> [Help 1] [ERROR] [ERROR] To see the full stack trace of the errors, re-run Maven with the -e swit ch. [ERROR] Re-run Maven using the -X switch to enable full debug logging. [ERROR] [ERROR] For more information about the errors and possible solutions, please rea d the following articles: [ERROR] [Help 1] http://cwiki.apache.org/confluence/display/MAVEN/PluginConfigur ationException ``` ~\m2\repository\org\apache\maven\plugins\maven-compiler-plugin 里面居然是2.3.2版本,我的本地仓库下载下载下来的不是指定的那个1.2.1版本,这是怎么回事?

maven yuicompressor 插件压缩js , 遇到for循环后报语法错误

我是spring boot 的一个web项目, 我想把 static 目录下的js 和css 压缩, 用的是下面这个插件 ``` <!-- https://blog.csdn.net/chs007chs/article/details/81633563 https://www.jianshu.com/p/34e45414f75b --> <plugin> <groupId>net.alchim31.maven</groupId> <artifactId>yuicompressor-maven-plugin</artifactId> <version>1.5.1</version> <executions> <execution> <goals> <goal>compress</goal> </goals> </execution> </executions> <configuration> <encoding>UTF-8</encoding> <jswarn>false</jswarn> <force>false</force> <linebreakpos>-1</linebreakpos> <preProcessAggregates>true</preProcessAggregates> <nosuffix>true</nosuffix> <sourceDirectory>src/main/resources/static</sourceDirectory> <outputDirectory>target/classes/static</outputDirectory> <force>true</force> <includes> <include>**/*.js</include> <include>**/*.css</include> </includes> <excludes> <exclude>**/*.min.js</exclude> <exclude>**/*.min.css</exclude> </excludes> </configuration> </plugin> ``` 但是遇到一个问题 : ``` script\rundetail.js [26:30]: missing ; after for-loop initializer # 报错的代码如下 for (let node of nodes) { } ``` 但是这个语法在 浏览器上执行时没问题的, 我想问下, 这个插件能不能忽略这些语法啊? 或者还有没有别的插件可以压缩 js 和 css ?

maven插件打包jar,在myeclipse运行没有错误,运行jar时报错

Excepion in thread "main" org.springframework.beans.factory. parsing.BeanDefinitionPersingException: Configuration problem:Unable to locate Spring NamespaceHandler for XML schema namespace [http://www.springframework.org/schema/context] Offending resource: class path resource [applicationContext.xml] applicationContext.xml配置如下: <beans xmlns="http://www.springframework.org/schema/beans" xmlns:xsi="http://www.w3.org/2001/XMLSchema-instance" xmlns:context="http://www.springframework.org/schema/context" xmlns:task="http://www.springframework.org/schema/task" xmlns:aop="http://www.springframework.org/schema/aop" xmlns:p="http://www.springframework.org/schema/p" xsi:schemaLocation="http://www.springframework.org/schema/beans http://www.springframework.org/schema/beans/spring-beans-4.1.xsd http://www.springframework.org/schema/context http://www.springframework.org/schema/context/spring-context-4.1.xsd http://www.springframework.org/schema/task http://www.springframework.org/schema/task/spring-task-4.1.xsd http://www.springframework.org/schema/aop http://www.springframework.org/schema/aop/spring-aop-4.1.xsd"> <context:component-scan base-package="com.jytime"></context:component-scan> <!-- 数据库连接池 非单例属性 scope="prototype" --> <bean id="dataSource" class="com.mchange.v2.c3p0.ComboPooledDataSource" destroy-method="close"> <property name="driverClass" value="com.microsoft.sqlserver.jdbc.SQLServerDriver" /> <property name="jdbcUrl" value="jdbc:sqlserver://192.168.2.101;DatabaseName=pm" /> <property name="user" value="sa" /> <property name="password" value="123" /> </bean> <bean id="jdbcTemplate" class="org.springframework.jdbc.core.JdbcTemplate"> <property name="dataSource" ref="dataSource"></property> </bean> <task:scheduler id="taskScheduler" pool-size="100"></task:scheduler> <task:scheduled-tasks scheduler="taskScheduler"> <task:scheduled ref="taskRemind" method="execute1" cron="0 0 10 * * ?" /> </task:scheduled-tasks> </beans> pom.xml配置如下: 复制代码 <dependencies> <dependency> <groupId>org.springframework</groupId> <artifactId>spring-core</artifactId> <version>4.1.7.RELEASE</version> </dependency> <dependency> <groupId>org.springframework</groupId> <artifactId>spring-beans</artifactId> <version>4.1.7.RELEASE</version> </dependency> <dependency> <groupId>org.springframework</groupId> <artifactId>spring-context</artifactId> <version>4.1.7.RELEASE</version> </dependency> <dependency> <groupId>org.springframework</groupId> <artifactId>spring-test</artifactId> <version>4.1.7.RELEASE</version> </dependency> <dependency> <groupId>org.springframework</groupId> <artifactId>spring-jdbc</artifactId> <version>4.1.7.RELEASE</version> </dependency> <dependency> <groupId>org.springframework.ws</groupId> <artifactId>spring-ws-core</artifactId> <version>2.4.0.RELEASE</version> </dependency> <dependency> <groupId>com.microsoft.sqlserver</groupId> <artifactId>sqljdbc4</artifactId> <version>4.0</version> <type>jar</type> <scope>compile</scope> </dependency> <dependency> <groupId>c3p0</groupId> <artifactId>c3p0</artifactId> <version>0.9.1.2</version> <type>jar</type> <scope>compile</scope> </dependency> <dependency> <groupId>junit</groupId> <artifactId>junit</artifactId> <version>4.11</version> <scope>test</scope> </dependency> <dependency> <groupId>org.slf4j</groupId> <artifactId>slf4j-api</artifactId> <version>1.6.1</version> <type>jar</type> <scope>compile</scope> </dependency> <dependency> <groupId>log4j</groupId> <artifactId>log4j</artifactId> <version>1.2.16</version> <scope>compile</scope> </dependency> <dependency> <groupId>org.slf4j</groupId> <artifactId>slf4j-log4j12</artifactId> <version>1.6.1</version> <type>jar</type> <scope>compile</scope> </dependency> </dependencies> <build> <plugins> <plugin> <artifactId>maven-assembly-plugin</artifactId> <configuration> <archive> <manifest> <mainClass>com.jytime.remind.App</mainClass> </manifest> </archive> <descriptorRefs> <descriptorRef> jar-with-dependencies </descriptorRef> </descriptorRefs> </configuration> <executions> <execution> <phase>package</phase> <goals> <goal>single</goal> </goals> <configuration> <transformers> <transformer implementation="org.apache.maven.plugins.shade.resource.AppendingTransformer"> <resource>META-INF/spring.handlers</resource> </transformer> <transformer implementation="org.apache.maven.plugins.shade.resource.AppendingTransformer"> <resource>META-INF/spring.schemas</resource> </transformer> </transformers> </configuration> </execution> </executions> </plugin> </plugins> </build> 复制代码 请高人帮忙解答一下,实在不知道怎么回事

maven在没有网络的环境下开发

开发的电脑没有网络环境,但是可以拷贝东西,我想在这台电脑上使用maven进行开发, 于是我搭建了nexus,但是在新建maven项目的时候一直报如下错误,手动在nexus导了 maven-resources-plugins 2.6也还是没有。错误信息如下:Could not calculate build plan: Plugin org.apache.maven.plugins:maven-resources-plugin:2.6 or one of its dependencies could not be resolved: Failed to read artifact descriptor for org.apache.maven.plugins:maven-resources-plugin:jar:2.6 Plugin org.apache.maven.plugins:maven-resources-plugin:2.6 or one of its dependencies could not be resolved: Failed to read artifact descriptor for org.apache.maven.plugins:maven-resources-plugin:jar:2.6 求大神解答,感激不尽!

maven问题,编译错误,谁帮忙看下谢了

D:\code\maven01\src\main\java\com\imooc\maven01\model 里面有java文件如下 package com.imooc.maven01.model; public class HelloWorld{ public String sayHello(){ return "Hello World"; } } D:\code\maven01\src\test\java\com\imooc\maven01\model import org.junit.*; import org.junit.Assert.*; public class HelloWorldTest{ @Test public void testHello(){ Assert.assertEquals("Hello World!",new HelloWorld().sayHello()); } } 有导入junit包了 D:\code\maven01>mvn compile [INFO] Scanning for projects... [ERROR] [ERROR] Some problems were encountered while processing the POMs: [FATAL] Non-parseable POM D:\code\maven01\pom.xml: expected = after attribute na me (position: START_DOCUMENT seen ....0.0" xmlns:xsi="http://www.w3.org/2001/XML Schema-instance" xsi:\ns... @4:2) @ line 4, column 2 @ [ERROR] The build could not read 1 project -> [Help 1] [ERROR] [ERROR] The project (D:\code\maven01\pom.xml) has 1 error [ERROR] Non-parseable POM D:\code\maven01\pom.xml: expected = after attribut e name (position: START_DOCUMENT seen ....0.0" xmlns:xsi="http://www.w3.org/2001 /XMLSchema-instance" xsi:\ns... @4:2) @ line 4, column 2 -> [Help 2] [ERROR] [ERROR] To see the full stack trace of the errors, re-run Maven with the -e swit ch. [ERROR] Re-run Maven using the -X switch to enable full debug logging. [ERROR] [ERROR] For more information about the errors and possible solutions, please rea d the following articles: [ERROR] [Help 1] http://cwiki.apache.org/confluence/display/MAVEN/ProjectBuildin gException [ERROR] [Help 2] http://cwiki.apache.org/confluence/display/MAVEN/ModelParseExce ption 编译错误

maven 打jar包,引发程序运行时候报错

java项目A,用maven 打完jar包之后,放入项目B中使用,运行报如下错误java.lang.NoSuchFieldError: ALIAS_TO_ENTITY_MAP; 用MyEclipse 自带的export jar打包,却没有这个问题,很是郁闷,求解。。。 报错代码:query.setResultTransformer(Transformers.ALIAS_TO_ENTITY_MAP);

springboot 项目在本地启动正常,maven打包运行包如下错误,在项目中去掉 @KafkaListener注解打包运行不会报错,怀疑是jar依赖的问题,求解!

[2019-11-25 14:53:48.299][main][KEY:] INFO- Stopping service [Tomcat] -[org.apache.juli.logging.DirectJDKLog:log] [DirectJDKLog.java:180] [2019-11-25 14:53:48.499][localhost-startStop-2][KEY:] WARN- The web application [ROOT] appears to have started a thread named [logback-1] but ha s failed to stop it. This is very likely to create a memory leak. Stack trace of thread: java.base@11.0.3/jdk.internal.misc.Unsafe.park(Native Method) java.base@11.0.3/java.util.concurrent.locks.LockSupport.parkNanos(LockSupport.java:234) java.base@11.0.3/java.util.concurrent.locks.AbstractQueuedSynchronizer$ConditionObject.awaitNanos(AbstractQueuedSynchronizer.java:2123) java.base@11.0.3/java.util.concurrent.ScheduledThreadPoolExecutor$DelayedWorkQueue.take(ScheduledThreadPoolExecutor.java:1182) java.base@11.0.3/java.util.concurrent.ScheduledThreadPoolExecutor$DelayedWorkQueue.take(ScheduledThreadPoolExecutor.java:899) java.base@11.0.3/java.util.concurrent.ThreadPoolExecutor.getTask(ThreadPoolExecutor.java:1054) java.base@11.0.3/java.util.concurrent.ThreadPoolExecutor.runWorker(ThreadPoolExecutor.java:1114) java.base@11.0.3/java.util.concurrent.ThreadPoolExecutor$Worker.run(ThreadPoolExecutor.java:628) java.base@11.0.3/java.lang.Thread.run(Thread.java:834) -[org.apache.juli.logging.DirectJDKLog:log] [DirectJDKLog.java:180] [2019-11-25 14:53:48.503][localhost-startStop-2][KEY:] WARN- The web application [ROOT] appears to have started a thread named [Timer-0] but has failed to stop it. This is very likely to create a memory leak. Stack trace of thread: java.base@11.0.3/java.lang.Object.wait(Native Method) java.base@11.0.3/java.util.TimerThread.mainLoop(Timer.java:553) java.base@11.0.3/java.util.TimerThread.run(Timer.java:506) -[org.apache.juli.logging.DirectJDKLog:log] [DirectJDKLog.java:180] [2019-11-25 14:53:48.504][localhost-startStop-2][KEY:] WARN- The web application [ROOT] appears to have started a thread named [com.alibaba.nacos .naming.client.listener] but has failed to stop it. This is very likely to create a memory leak. Stack trace of thread: java.base@11.0.3/jdk.internal.misc.Unsafe.park(Native Method) java.base@11.0.3/java.util.concurrent.locks.LockSupport.parkNanos(LockSupport.java:234) java.base@11.0.3/java.util.concurrent.locks.AbstractQueuedSynchronizer$ConditionObject.awaitNanos(AbstractQueuedSynchronizer.java:2123) java.base@11.0.3/java.util.concurrent.LinkedBlockingQueue.poll(LinkedBlockingQueue.java:458) com.alibaba.nacos.client.naming.core.EventDispatcher$Notifier.run(EventDispatcher.java:114) java.base@11.0.3/java.util.concurrent.ThreadPoolExecutor.runWorker(ThreadPoolExecutor.java:1128) java.base@11.0.3/java.util.concurrent.ThreadPoolExecutor$Worker.run(ThreadPoolExecutor.java:628) java.base@11.0.3/java.lang.Thread.run(Thread.java:834) -[org.apache.juli.logging.DirectJDKLog:log] [DirectJDKLog.java:180] [2019-11-25 14:53:48.508][localhost-startStop-2][KEY:] WARN- The web application [ROOT] appears to have started a thread named [com.alibaba.nacos .naming.beat.sender] but has failed to stop it. This is very likely to create a memory leak. Stack trace of thread: java.base@11.0.3/jdk.internal.misc.Unsafe.park(Native Method) java.base@11.0.3/java.util.concurrent.locks.LockSupport.parkNanos(LockSupport.java:234) java.base@11.0.3/java.util.concurrent.locks.AbstractQueuedSynchronizer$ConditionObject.awaitNanos(AbstractQueuedSynchronizer.java:2123) java.base@11.0.3/java.util.concurrent.ScheduledThreadPoolExecutor$DelayedWorkQueue.take(ScheduledThreadPoolExecutor.java:1182) java.base@11.0.3/java.util.concurrent.ScheduledThreadPoolExecutor$DelayedWorkQueue.take(ScheduledThreadPoolExecutor.java:899) java.base@11.0.3/java.util.concurrent.ThreadPoolExecutor.getTask(ThreadPoolExecutor.java:1054) java.base@11.0.3/java.util.concurrent.ThreadPoolExecutor.runWorker(ThreadPoolExecutor.java:1114) java.base@11.0.3/java.util.concurrent.ThreadPoolExecutor$Worker.run(ThreadPoolExecutor.java:628) java.base@11.0.3/java.lang.Thread.run(Thread.java:834) -[org.apache.juli.logging.DirectJDKLog:log] [DirectJDKLog.java:180] [2019-11-25 14:53:48.514][localhost-startStop-2][KEY:] WARN- The web application [ROOT] appears to have started a thread named [com.alibaba.nacos .naming.beat.sender] but has failed to stop it. This is very likely to create a memory leak. Stack trace of thread: java.base@11.0.3/jdk.internal.misc.Unsafe.park(Native Method) java.base@11.0.3/java.util.concurrent.locks.LockSupport.park(LockSupport.java:194) java.base@11.0.3/java.util.concurrent.locks.AbstractQueuedSynchronizer$ConditionObject.await(AbstractQueuedSynchronizer.java:2081) java.base@11.0.3/java.util.concurrent.ScheduledThreadPoolExecutor$DelayedWorkQueue.take(ScheduledThreadPoolExecutor.java:1177) java.base@11.0.3/java.util.concurrent.ScheduledThreadPoolExecutor$DelayedWorkQueue.take(ScheduledThreadPoolExecutor.java:899) java.base@11.0.3/java.util.concurrent.ThreadPoolExecutor.getTask(ThreadPoolExecutor.java:1054) java.base@11.0.3/java.util.concurrent.ThreadPoolExecutor.runWorker(ThreadPoolExecutor.java:1114) java.base@11.0.3/java.util.concurrent.ThreadPoolExecutor$Worker.run(ThreadPoolExecutor.java:628) java.base@11.0.3/java.lang.Thread.run(Thread.java:834) -[org.apache.juli.logging.DirectJDKLog:log] [DirectJDKLog.java:180] [2019-11-25 14:53:48.525][localhost-startStop-2][KEY:] WARN- The web application [ROOT] appears to have started a thread named [com.alibaba.nacos .naming.failover] but has failed to stop it. This is very likely to create a memory leak. Stack trace of thread: java.base@11.0.3/jdk.internal.misc.Unsafe.park(Native Method) java.base@11.0.3/java.util.concurrent.locks.LockSupport.parkNanos(LockSupport.java:234) java.base@11.0.3/java.util.concurrent.locks.AbstractQueuedSynchronizer$ConditionObject.awaitNanos(AbstractQueuedSynchronizer.java:2123) java.base@11.0.3/java.util.concurrent.ScheduledThreadPoolExecutor$DelayedWorkQueue.take(ScheduledThreadPoolExecutor.java:1182) java.base@11.0.3/java.util.concurrent.ScheduledThreadPoolExecutor$DelayedWorkQueue.take(ScheduledThreadPoolExecutor.java:899) java.base@11.0.3/java.util.concurrent.ThreadPoolExecutor.getTask(ThreadPoolExecutor.java:1054) java.base@11.0.3/java.util.concurrent.ThreadPoolExecutor.runWorker(ThreadPoolExecutor.java:1114) java.base@11.0.3/java.util.concurrent.ThreadPoolExecutor$Worker.run(ThreadPoolExecutor.java:628) java.base@11.0.3/java.lang.Thread.run(Thread.java:834) -[org.apache.juli.logging.DirectJDKLog:log] [DirectJDKLog.java:180] [2019-11-25 14:53:48.531][localhost-startStop-2][KEY:] WARN- The web application [ROOT] appears to have started a thread named [com.alibaba.nacos .naming.push.receiver] but has failed to stop it. This is very likely to create a memory leak. Stack trace of thread: java.base@11.0.3/java.net.DualStackPlainDatagramSocketImpl.socketReceiveOrPeekData(Native Method) java.base@11.0.3/java.net.DualStackPlainDatagramSocketImpl.receive0(DualStackPlainDatagramSocketImpl.java:124) java.base@11.0.3/java.net.AbstractPlainDatagramSocketImpl.receive(AbstractPlainDatagramSocketImpl.java:181) java.base@11.0.3/java.net.DatagramSocket.receive(DatagramSocket.java:814) java.base@11.0.3/java.net.AbstractPlainDatagramSocketImpl.receive(AbstractPlainDatagramSocketImpl.j java.base@11.0.3/java.net.DatagramSocket.receive(DatagramSocket.java:814) com.alibaba.nacos.client.naming.core.PushReceiver.run(PushReceiver.java:73) java.base@11.0.3/java.util.concurrent.Executors$RunnableAdapter.call(Executors.java:515) java.base@11.0.3/java.util.concurrent.FutureTask.run(FutureTask.java:264) java.base@11.0.3/java.util.concurrent.ScheduledThreadPoolExecutor$ScheduledFutureTask.run(Scheduled java.base@11.0.3/java.util.concurrent.ThreadPoolExecutor.runWorker(ThreadPoolExecutor.java:1128) java.base@11.0.3/java.util.concurrent.ThreadPoolExecutor$Worker.run(ThreadPoolExecutor.java:628) java.base@11.0.3/java.lang.Thread.run(Thread.java:834) -[org.apache.juli.logging.DirectJDKLog:log]

springboot集成apache.cxf实现wsdl webservice接口服务及客户端,使用maven打包是遇到乱码问题

springboot集成apache.cxf实现wsdl webservice接口服务及客户端,使用的工具是idea。在工具内直接启动时没有问题,但使用maven打包时报错 pom文件如下 ``` <?xml version="1.0" encoding="UTF-8"?> <project xmlns="http://maven.apache.org/POM/4.0.0" xmlns:xsi="http://www.w3.org/2001/XMLSchema-instance" xsi:schemaLocation="http://maven.apache.org/POM/4.0.0 http://maven.apache.org/xsd/maven-4.0.0.xsd"> <modelVersion>4.0.0</modelVersion> <parent> <groupId>org.springframework.boot</groupId> <artifactId>spring-boot-starter-parent</artifactId> <version>2.1.4.RELEASE</version> <relativePath/> <!-- lookup parent from repository --> </parent> <groupId>com.hls</groupId> <artifactId>hisapi</artifactId> <version>0.0.1-SNAPSHOT</version> <name>hisapi</name> <description>Demo project for Spring Boot</description> <properties> <java.version>1.8</java.version> <projcet.build.sourceEncoding>UTF-8</projcet.build.sourceEncoding> </properties> <dependencies> <dependency> <groupId>org.springframework.boot</groupId> <artifactId>spring-boot-starter-thymeleaf</artifactId> </dependency> <dependency> <groupId>org.springframework.boot</groupId> <artifactId>spring-boot-starter-web</artifactId> </dependency> <dependency> <groupId>org.mybatis.spring.boot</groupId> <artifactId>mybatis-spring-boot-starter</artifactId> <version>2.0.1</version> </dependency> <dependency> <groupId>org.springframework.boot</groupId> <artifactId>spring-boot-configuration-processor</artifactId> <optional>true</optional> </dependency> <dependency> <groupId>com.oracle</groupId> <artifactId>ojdbc6</artifactId> <version>11.2.0.1.0</version> </dependency> <dependency> <groupId>org.springframework.boot</groupId> <artifactId>spring-boot-starter-test</artifactId> <scope>test</scope> </dependency> <!-- http所需包 --> <dependency> <groupId>org.apache.httpcomponents</groupId> <artifactId>httpclient</artifactId> </dependency> <dependency> <groupId>org.apache.httpcomponents</groupId> <artifactId>httpcore</artifactId> </dependency> <dependency> <groupId>org.apache.httpcomponents</groupId> <artifactId>httpmime</artifactId> </dependency> <!-- /http所需包 --> <!-- 数据解析所需包 --> <dependency> <groupId>org.apache.commons</groupId> <artifactId>commons-lang3</artifactId> <version>3.4</version> </dependency> <dependency> <groupId>commons-lang</groupId> <artifactId>commons-lang</artifactId> <version>2.6</version> </dependency> <dependency> <groupId>com.alibaba</groupId> <artifactId>fastjson</artifactId> <version>1.2.4</version> </dependency> <dependency> <groupId>org.apache.cxf</groupId> <artifactId>cxf-spring-boot-starter-jaxws</artifactId> <version>3.2.6</version> </dependency> <dependency> <groupId>org.projectlombok</groupId> <artifactId>lombok</artifactId> <version>1.16.20</version> <scope>provided</scope> </dependency> </dependencies> <build> <plugins> <plugin> <groupId>org.springframework.boot</groupId> <artifactId>spring-boot-maven-plugin</artifactId> </plugin> </plugins> </build> </project> ``` 执行mav install提示错误信息如下 ``` C:\Users\weigu\AppData\Local\Temp\org.apache.cxf.jaxws.endpoint.dynamic.JaxWsDynamicClientFactory@ceddaf8-1555314397936-src\com\sd\msun\hospital\service\AbstractJSON.java:11: 错误: 编码GBK的不可映射字符 * <p>abstractJSON complex type鐨? Java 绫汇?? ^ C:\Users\weigu\AppData\Local\Temp\org.apache.cxf.jaxws.endpoint.dynamic.JaxWsDynamicClientFactory@ceddaf8-1555314397936-src\com\sd\msun\hospital\service\AbstractJSON.java:11: 错误: 编码GBK的不可映射字符 * <p>abstractJSON complex type鐨? Java 绫汇?? ^ C:\Users\weigu\AppData\Local\Temp\org.apache.cxf.jaxws.endpoint.dynamic.JaxWsDynamicClientFactory@ceddaf8-1555314397936-src\com\sd\msun\hospital\service\AbstractJSON.java:11: 错误: 编码GBK的不可映射字符 * <p>abstractJSON complex type鐨? Java 绫汇?? ^ C:\Users\weigu\AppData\Local\Temp\org.apache.cxf.jaxws.endpoint.dynamic.JaxWsDynamicClientFactory@ceddaf8-1555314397936-src\com\sd\msun\hospital\service\AbstractJSON.java:13: 错误: 编码GBK的不可映射字符 * <p>浠ヤ笅妯″紡鐗囨鎸囧畾鍖呭惈鍦ㄦ绫讳腑鐨勯鏈熷唴瀹广?? ^ C:\Users\weigu\AppData\Local\Temp\org.apache.cxf.jaxws.endpoint.dynamic.JaxWsDynamicClientFactory@ceddaf8-1555314397936-src\com\sd\msun\hospital\service\AbstractJSON.java:13: 错误: 编码GBK的不可映射字符 * <p>浠ヤ笅妯″紡鐗囨鎸囧畾鍖呭惈鍦ㄦ绫讳腑鐨勯鏈熷唴瀹广?? ^ C:\Users\weigu\AppData\Local\Temp\org.apache.cxf.jaxws.endpoint.dynamic.JaxWsDynamicClientFactory@ceddaf8-1555314397936-src\com\sd\msun\hospital\service\AddAndUpdate.java:10: 错误: 编码GBK的不可映射字符 * <p>addAndUpdate complex type鐨? Java 绫汇?? ^ C:\Users\weigu\AppData\Local\Temp\org.apache.cxf.jaxws.endpoint.dynamic.JaxWsDynamicClientFactory@ceddaf8-1555314397936-src\com\sd\msun\hospital\service\AddAndUpdate.java:10: 错误: 编码GBK的不可映射字符 * <p>addAndUpdate complex type鐨? Java 绫汇?? ^ C:\Users\weigu\AppData\Local\Temp\org.apache.cxf.jaxws.endpoint.dynamic.JaxWsDynamicClientFactory@ceddaf8-1555314397936-src\com\sd\msun\hospital\service\AddAndUpdate.java:10: 错误: 编码GBK的不可映射字符 * <p>addAndUpdate complex type鐨? Java 绫汇?? ^ C:\Users\weigu\AppData\Local\Temp\org.apache.cxf.jaxws.endpoint.dynamic.JaxWsDynamicClientFactory@ceddaf8-1555314397936-src\com\sd\msun\hospital\service\AddAndUpdate.java:12: 错误: 编码GBK的不可映射字符 * <p>浠ヤ笅妯″紡鐗囨鎸囧畾鍖呭惈鍦ㄦ绫讳腑鐨勯鏈熷唴瀹广?? ^ C:\Users\weigu\AppData\Local\Temp\org.apache.cxf.jaxws.endpoint.dynamic.JaxWsDynamicClientFactory@ceddaf8-1555314397936-src\com\sd\msun\hospital\service\AddAndUpdate.java:12: 错误: 编码GBK的不可映射字符 * <p>浠ヤ笅妯″紡鐗囨鎸囧畾鍖呭惈鍦ㄦ绫讳腑鐨勯鏈熷唴瀹广?? ^ C:\Users\weigu\AppData\Local\Temp\org.apache.cxf.jaxws.endpoint.dynamic.JaxWsDynamicClientFactory@ceddaf8-1555314397936-src\com\sd\msun\hospital\service\AddAndUpdate.java:37: 错误: 编码GBK的不可映射字符 * 鑾峰彇arg0灞炴?х殑鍊笺?? ^ C:\Users\weigu\AppData\Local\Temp\org.apache.cxf.jaxws.endpoint.dynamic.JaxWsDynamicClientFactory@ceddaf8-1555314397936-src\com\sd\msun\hospital\service\AddAndUpdate.java:37: 错误: 编码GBK的不可映射字符 * 鑾峰彇arg0灞炴?х殑鍊笺?? ^ C:\Users\weigu\AppData\Local\Temp\org.apache.cxf.jaxws.endpoint.dynamic.JaxWsDynamicClientFactory@ceddaf8-1555314397936-src\com\sd\msun\hospital\service\AddAndUpdate.java:37: 错误: 编码GBK的不可映射字符 * 鑾峰彇arg0灞炴?х殑鍊笺?? ^ C:\Users\weigu\AppData\Local\Temp\org.apache.cxf.jaxws.endpoint.dynamic.JaxWsDynamicClientFactory@ceddaf8-1555314397936-src\com\sd\msun\hospital\service\AddAndUpdate.java:49: 错误: 编码GBK的不可映射字符 * 璁剧疆arg0灞炴?х殑鍊笺?? ^ C:\Users\weigu\AppData\Local\Temp\org.apache.cxf.jaxws.endpoint.dynamic.JaxWsDynamicClientFactory@ceddaf8-1555314397936-src\com\sd\msun\hospital\service\AddAndUpdate.java:49: 错误: 编码GBK的不可映射字符 * 璁剧疆arg0灞炴?х殑鍊笺?? ^ C:\Users\weigu\AppData\Local\Temp\org.apache.cxf.jaxws.endpoint.dynamic.JaxWsDynamicClientFactory@ceddaf8-1555314397936-src\com\sd\msun\hospital\service\AddAndUpdate.java:49: 错误: 编码GBK的不可映射字符 * 璁剧疆arg0灞炴?х殑鍊笺?? ^ C:\Users\weigu\AppData\Local\Temp\org.apache.cxf.jaxws.endpoint.dynamic.JaxWsDynamicClientFactory@ceddaf8-1555314397936-src\com\sd\msun\hospital\service\AddAndUpdateResponse.java:13: 错误: 编码GBK的不可映射字符 * <p>addAndUpdateResponse complex type鐨? Java 绫汇?? ^ C:\Users\weigu\AppData\Local\Temp\org.apache.cxf.jaxws.endpoint.dynamic.JaxWsDynamicClientFactory@ceddaf8-1555314397936-src\com\sd\msun\hospital\service\AddAndUpdateResponse.java:13: 错误: 编码GBK的不可映射字符 * <p>addAndUpdateResponse complex type鐨? Java 绫汇?? ^ C:\Users\weigu\AppData\Local\Temp\org.apache.cxf.jaxws.endpoint.dynamic.JaxWsDynamicClientFactory@ceddaf8-1555314397936-src\com\sd\msun\hospital\service\AddAndUpdateResponse.java:13: 错误: 编码GBK的不可映射字符 * <p>addAndUpdateResponse complex type鐨? Java 绫汇?? ^ C:\Users\weigu\AppData\Local\Temp\org.apache.cxf.jaxws.endpoint.dynamic.JaxWsDynamicClientFactory@ceddaf8-1555314397936-src\com\sd\msun\hospital\service\AddAndUpdateResponse.java:15: 错误: 编码GBK的不可映射字符 * <p>浠ヤ笅妯″紡鐗囨鎸囧畾鍖呭惈鍦ㄦ绫讳腑鐨勯鏈熷唴瀹广?? ^ C:\Users\weigu\AppData\Local\Temp\org.apache.cxf.jaxws.endpoint.dynamic.JaxWsDynamicClientFactory@ceddaf8-1555314397936-src\com\sd\msun\hospital\service\AddAndUpdateResponse.java:15: 错误: 编码GBK的不可映射字符 * <p>浠ヤ笅妯″紡鐗囨鎸囧畾鍖呭惈鍦ㄦ绫讳腑鐨勯鏈熷唴瀹广?? ^ C:\Users\weigu\AppData\Local\Temp\org.apache.cxf.jaxws.endpoint.dynamic.JaxWsDynamicClientFactory@ceddaf8-1555314397936-src\com\sd\msun\hospital\service\AddAndUpdateResponse.java:62: 错误: 编码GBK的不可映射字符 * 鑾峰彇return灞炴?х殑鍊笺?? ^ C:\Users\weigu\AppData\Local\Temp\org.apache.cxf.jaxws.endpoint.dynamic.JaxWsDynamicClientFactory@ceddaf8-1555314397936-src\com\sd\msun\hospital\service\AddAndUpdateResponse.java:62: 错误: 编码GBK的不可映射字符 * 鑾峰彇return灞炴?х殑鍊笺?? ^ C:\Users\weigu\AppData\Local\Temp\org.apache.cxf.jaxws.endpoint.dynamic.JaxWsDynamicClientFactory@ceddaf8-1555314397936-src\com\sd\msun\hospital\service\AddAndUpdateResponse.java:62: 错误: 编码GBK的不可映射字符 * 鑾峰彇return灞炴?х殑鍊笺?? ^ C:\Users\weigu\AppData\Local\Temp\org.apache.cxf.jaxws.endpoint.dynamic.JaxWsDynamicClientFactory@ceddaf8-1555314397936-src\com\sd\msun\hospital\service\AddAndUpdateResponse.java:74: 错误: 编码GBK的不可映射字符 * 璁剧疆return灞炴?х殑鍊笺?? ^ C:\Users\weigu\AppData\Local\Temp\org.apache.cxf.jaxws.endpoint.dynamic.JaxWsDynamicClientFactory@ceddaf8-1555314397936-src\com\sd\msun\hospital\service\AddAndUpdateResponse.java:74: 错误: 编码GBK的不可映射字符 * 璁剧疆return灞炴?х殑鍊笺?? ^ C:\Users\weigu\AppData\Local\Temp\org.apache.cxf.jaxws.endpoint.dynamic.JaxWsDynamicClientFactory@ceddaf8-1555314397936-src\com\sd\msun\hospital\service\AddAndUpdateResponse.java:74: 错误: 编码GBK的不可映射字符 * 璁剧疆return灞炴?х殑鍊笺?? ^ C:\Users\weigu\AppData\Local\Temp\org.apache.cxf.jaxws.endpoint.dynamic.JaxWsDynamicClientFactory@ceddaf8-1555314397936-src\com\sd\msun\hospital\service\AddAndUpdateResponse.java:87: 错误: 编码GBK的不可映射字符 * <p>anonymous complex type鐨? Java 绫汇?? ^ C:\Users\weigu\AppData\Local\Temp\org.apache.cxf.jaxws.endpoint.dynamic.JaxWsDynamicClientFactory@ceddaf8-1555314397936-src\com\sd\msun\hospital\service\AddAndUpdateResponse.java:87: 错误: 编码GBK的不可映射字符 * <p>anonymous complex type鐨? Java 绫汇?? ^ C:\Users\weigu\AppData\Local\Temp\org.apache.cxf.jaxws.endpoint.dynamic.JaxWsDynamicClientFactory@ceddaf8-1555314397936-src\com\sd\msun\hospital\service\AddAndUpdateResponse.java:87: 错误: 编码GBK的不可映射字符 * <p>anonymous complex type鐨? Java 绫汇?? ^ C:\Users\weigu\AppData\Local\Temp\org.apache.cxf.jaxws.endpoint.dynamic.JaxWsDynamicClientFactory@ceddaf8-1555314397936-src\com\sd\msun\hospital\service\AddAndUpdateResponse.java:89: 错误: 编码GBK的不可映射字符 * <p>浠ヤ笅妯″紡鐗囨鎸囧畾鍖呭惈鍦ㄦ绫讳腑鐨勯鏈熷唴瀹广?? ^ C:\Users\weigu\AppData\Local\Temp\org.apache.cxf.jaxws.endpoint.dynamic.JaxWsDynamicClientFactory@ceddaf8-1555314397936-src\com\sd\msun\hospital\service\AddAndUpdateResponse.java:89: 错误: 编码GBK的不可映射字符 * <p>浠ヤ笅妯″紡鐗囨鎸囧畾鍖呭惈鍦ㄦ绫讳腑鐨勯鏈熷唴瀹广?? ^ C:\Users\weigu\AppData\Local\Temp\org.apache.cxf.jaxws.endpoint.dynamic.JaxWsDynamicClientFactory@ceddaf8-1555314397936-src\com\sd\msun\hospital\service\AddAndUpdateResponse.java:155: 错误: 编码GBK的不可映射字符 * <p>anonymous complex type鐨? Java 绫汇?? ^ C:\Users\weigu\AppData\Local\Temp\org.apache.cxf.jaxws.endpoint.dynamic.JaxWsDynamicClientFactory@ceddaf8-1555314397936-src\com\sd\msun\hospital\service\AddAndUpdateResponse.java:155: 错误: 编码GBK的不可映射字符 * <p>anonymous complex type鐨? Java 绫汇?? ^ C:\Users\weigu\AppData\Local\Temp\org.apache.cxf.jaxws.endpoint.dynamic.JaxWsDynamicClientFactory@ceddaf8-1555314397936-src\com\sd\msun\hospital\service\AddAndUpdateResponse.java:155: 错误: 编码GBK的不可映射字符 * <p>anonymous complex type鐨? Java 绫汇?? ^ C:\Users\weigu\AppData\Local\Temp\org.apache.cxf.jaxws.endpoint.dynamic.JaxWsDynamicClientFactory@ceddaf8-1555314397936-src\com\sd\msun\hospital\service\AddAndUpdateResponse.java:157: 错误: 编码GBK的不可映射字符 * <p>浠ヤ笅妯″紡鐗囨鎸囧畾鍖呭惈鍦ㄦ绫讳腑鐨勯鏈熷唴瀹广?? ^ C:\Users\weigu\AppData\Local\Temp\org.apache.cxf.jaxws.endpoint.dynamic.JaxWsDynamicClientFactory@ceddaf8-1555314397936-src\com\sd\msun\hospital\service\AddAndUpdateResponse.java:157: 错误: 编码GBK的不可映射字符 * <p>浠ヤ笅妯″紡鐗囨鎸囧畾鍖呭惈鍦ㄦ绫讳腑鐨勯鏈熷唴瀹广?? ^ C:\Users\weigu\AppData\Local\Temp\org.apache.cxf.jaxws.endpoint.dynamic.JaxWsDynamicClientFactory@ceddaf8-1555314397936-src\com\sd\msun\hospital\service\AddAndUpdateResponse.java:185: 错误: 编码GBK的不可映射字符 * 鑾峰彇key灞炴?х殑鍊笺?? ^ C:\Users\weigu\AppData\Local\Temp\org.apache.cxf.jaxws.endpoint.dynamic.JaxWsDynamicClientFactory@ceddaf8-1555314397936-src\com\sd\msun\hospital\service\AddAndUpdateResponse.java:185: 错误: 编码GBK的不可映射字符 * 鑾峰彇key灞炴?х殑鍊笺?? ^ C:\Users\weigu\AppData\Local\Temp\org.apache.cxf.jaxws.endpoint.dynamic.JaxWsDynamicClientFactory@ceddaf8-1555314397936-src\com\sd\msun\hospital\service\AddAndUpdateResponse.java:185: 错误: 编码GBK的不可映射字符 * 鑾峰彇key灞炴?х殑鍊笺?? ^ C:\Users\weigu\AppData\Local\Temp\org.apache.cxf.jaxws.endpoint.dynamic.JaxWsDynamicClientFactory@ceddaf8-1555314397936-src\com\sd\msun\hospital\service\AddAndUpdateResponse.java:197: 错误: 编码GBK的不可映射字符 * 璁剧疆key灞炴?х殑鍊笺?? ^ C:\Users\weigu\AppData\Local\Temp\org.apache.cxf.jaxws.endpoint.dynamic.JaxWsDynamicClientFactory@ceddaf8-1555314397936-src\com\sd\msun\hospital\service\AddAndUpdateResponse.java:197: 错误: 编码GBK的不可映射字符 * 璁剧疆key灞炴?х殑鍊笺?? ^ C:\Users\weigu\AppData\Local\Temp\org.apache.cxf.jaxws.endpoint.dynamic.JaxWsDynamicClientFactory@ceddaf8-1555314397936-src\com\sd\msun\hospital\service\AddAndUpdateResponse.java:197: 错误: 编码GBK的不可映射字符 * 璁剧疆key灞炴?х殑鍊笺?? ^ C:\Users\weigu\AppData\Local\Temp\org.apache.cxf.jaxws.endpoint.dynamic.JaxWsDynamicClientFactory@ceddaf8-1555314397936-src\com\sd\msun\hospital\service\AddAndUpdateResponse.java:209: 错误: 编码GBK的不可映射字符 * 鑾峰彇value灞炴?х殑鍊笺?? ^ C:\Users\weigu\AppData\Local\Temp\org.apache.cxf.jaxws.endpoint.dynamic.JaxWsDynamicClientFactory@ceddaf8-1555314397936-src\com\sd\msun\hospital\service\AddAndUpdateResponse.java:209: 错误: 编码GBK的不可映射字符 * 鑾峰彇value灞炴?х殑鍊笺?? ^ C:\Users\weigu\AppData\Local\Temp\org.apache.cxf.jaxws.endpoint.dynamic.JaxWsDynamicClientFactory@ceddaf8-1555314397936-src\com\sd\msun\hospital\service\AddAndUpdateResponse.java:209: 错误: 编码GBK的不可映射字符 * 鑾峰彇value灞炴?х殑鍊笺?? ^ C:\Users\weigu\AppData\Local\Temp\org.apache.cxf.jaxws.endpoint.dynamic.JaxWsDynamicClientFactory@ceddaf8-1555314397936-src\com\sd\msun\hospital\service\AddAndUpdateResponse.java:221: 错误: 编码GBK的不可映射字符 * 璁剧疆value灞炴?х殑鍊笺?? ^ C:\Users\weigu\AppData\Local\Temp\org.apache.cxf.jaxws.endpoint.dynamic.JaxWsDynamicClientFactory@ceddaf8-1555314397936-src\com\sd\msun\hospital\service\AddAndUpdateResponse.java:221: 错误: 编码GBK的不可映射字符 * 璁剧疆value灞炴?х殑鍊笺?? ^ C:\Users\weigu\AppData\Local\Temp\org.apache.cxf.jaxws.endpoint.dynamic.JaxWsDynamicClientFactory@ceddaf8-1555314397936-src\com\sd\msun\hospital\service\AddAndUpdateResponse.java:221: 错误: 编码GBK的不可映射字符 * 璁剧疆value灞炴?х殑鍊笺?? ^ C:\Users\weigu\AppData\Local\Temp\org.apache.cxf.jaxws.endpoint.dynamic.JaxWsDynamicClientFactory@ceddaf8-1555314397936-src\com\sd\msun\hospital\service\Delete.java:10: 错误: 编码GBK的不可映射字符 * <p>delete complex type鐨? Java 绫汇?? ^ C:\Users\weigu\AppData\Local\Temp\org.apache.cxf.jaxws.endpoint.dynamic.JaxWsDynamicClientFactory@ceddaf8-1555314397936-src\com\sd\msun\hospital\service\Delete.java:10: 错误: 编码GBK的不可映射字符 * <p>delete complex type鐨? Java 绫汇?? ^ C:\Users\weigu\AppData\Local\Temp\org.apache.cxf.jaxws.endpoint.dynamic.JaxWsDynamicClientFactory@ceddaf8-1555314397936-src\com\sd\msun\hospital\service\Delete.java:10: 错误: 编码GBK的不可映射字符 * <p>delete complex type鐨? Java 绫汇?? ^ C:\Users\weigu\AppData\Local\Temp\org.apache.cxf.jaxws.endpoint.dynamic.JaxWsDynamicClientFactory@ceddaf8-1555314397936-src\com\sd\msun\hospital\service\Delete.java:12: 错误: 编码GBK的不可映射字符 * <p>浠ヤ笅妯″紡鐗囨鎸囧畾鍖呭惈鍦ㄦ绫讳腑鐨勯鏈熷唴瀹广?? ^ C:\Users\weigu\AppData\Local\Temp\org.apache.cxf.jaxws.endpoint.dynamic.JaxWsDynamicClientFactory@ceddaf8-1555314397936-src\com\sd\msun\hospital\service\Delete.java:12: 错误: 编码GBK的不可映射字符 * <p>浠ヤ笅妯″紡鐗囨鎸囧畾鍖呭惈鍦ㄦ绫讳腑鐨勯鏈熷唴瀹广?? ^ C:\Users\weigu\AppData\Local\Temp\org.apache.cxf.jaxws.endpoint.dynamic.JaxWsDynamicClientFactory@ceddaf8-1555314397936-src\com\sd\msun\hospital\service\Delete.java:37: 错误: 编码GBK的不可映射字符 * 鑾峰彇arg0灞炴?х殑鍊笺?? ^ C:\Users\weigu\AppData\Local\Temp\org.apache.cxf.jaxws.endpoint.dynamic.JaxWsDynamicClientFactory@ceddaf8-1555314397936-src\com\sd\msun\hospital\service\Delete.java:37: 错误: 编码GBK的不可映射字符 * 鑾峰彇arg0灞炴?х殑鍊笺?? ^ C:\Users\weigu\AppData\Local\Temp\org.apache.cxf.jaxws.endpoint.dynamic.JaxWsDynamicClientFactory@ceddaf8-1555314397936-src\com\sd\msun\hospital\service\Delete.java:37: 错误: 编码GBK的不可映射字符 * 鑾峰彇arg0灞炴?х殑鍊笺?? ^ C:\Users\weigu\AppData\Local\Temp\org.apache.cxf.jaxws.endpoint.dynamic.JaxWsDynamicClientFactory@ceddaf8-1555314397936-src\com\sd\msun\hospital\service\Delete.java:49: 错误: 编码GBK的不可映射字符 * 璁剧疆arg0灞炴?х殑鍊笺?? ^ C:\Users\weigu\AppData\Local\Temp\org.apache.cxf.jaxws.endpoint.dynamic.JaxWsDynamicClientFactory@ceddaf8-1555314397936-src\com\sd\msun\hospital\service\Delete.java:49: 错误: 编码GBK的不可映射字符 * 璁剧疆arg0灞炴?х殑鍊笺?? ^ C:\Users\weigu\AppData\Local\Temp\org.apache.cxf.jaxws.endpoint.dynamic.JaxWsDynamicClientFactory@ceddaf8-1555314397936-src\com\sd\msun\hospital\service\Delete.java:49: 错误: 编码GBK的不可映射字符 * 璁剧疆arg0灞炴?х殑鍊笺?? ^ C:\Users\weigu\AppData\Local\Temp\org.apache.cxf.jaxws.endpoint.dynamic.JaxWsDynamicClientFactory@ceddaf8-1555314397936-src\com\sd\msun\hospital\service\DeleteResponse.java:13: 错误: 编码GBK的不可映射字符 * <p>deleteResponse complex type鐨? Java 绫汇?? ^ C:\Users\weigu\AppData\Local\Temp\org.apache.cxf.jaxws.endpoint.dynamic.JaxWsDynamicClientFactory@ceddaf8-1555314397936-src\com\sd\msun\hospital\service\DeleteResponse.java:13: 错误: 编码GBK的不可映射字符 * <p>deleteResponse complex type鐨? Java 绫汇?? ^ C:\Users\weigu\AppData\Local\Temp\org.apache.cxf.jaxws.endpoint.dynamic.JaxWsDynamicClientFactory@ceddaf8-1555314397936-src\com\sd\msun\hospital\service\DeleteResponse.java:13: 错误: 编码GBK的不可映射字符 * <p>deleteResponse complex type鐨? Java 绫汇?? ^ C:\Users\weigu\AppData\Local\Temp\org.apache.cxf.jaxws.endpoint.dynamic.JaxWsDynamicClientFactory@ceddaf8-1555314397936-src\com\sd\msun\hospital\service\DeleteResponse.java:15: 错误: 编码GBK的不可映射字符 * <p>浠ヤ笅妯″紡鐗囨鎸囧畾鍖呭惈鍦ㄦ绫讳腑鐨勯鏈熷唴瀹广?? ^ C:\Users\weigu\AppData\Local\Temp\org.apache.cxf.jaxws.endpoint.dynamic.JaxWsDynamicClientFactory@ceddaf8-1555314397936-src\com\sd\msun\hospital\service\DeleteResponse.java:15: 错误: 编码GBK的不可映射字符 * <p>浠ヤ笅妯″紡鐗囨鎸囧畾鍖呭惈鍦ㄦ绫讳腑鐨勯鏈熷唴瀹广?? ^ C:\Users\weigu\AppData\Local\Temp\org.apache.cxf.jaxws.endpoint.dynamic.JaxWsDynamicClientFactory@ceddaf8-1555314397936-src\com\sd\msun\hospital\service\DeleteResponse.java:62: 错误: 编码GBK的不可映射字符 * 鑾峰彇return灞炴?х殑鍊笺?? ^ C:\Users\weigu\AppData\Local\Temp\org.apache.cxf.jaxws.endpoint.dynamic.JaxWsDynamicClientFactory@ceddaf8-1555314397936-src\com\sd\msun\hospital\service\DeleteResponse.java:62: 错误: 编码GBK的不可映射字符 * 鑾峰彇return灞炴?х殑鍊笺?? ^ C:\Users\weigu\AppData\Local\Temp\org.apache.cxf.jaxws.endpoint.dynamic.JaxWsDynamicClientFactory@ceddaf8-1555314397936-src\com\sd\msun\hospital\service\DeleteResponse.java:62: 错误: 编码GBK的不可映射字符 * 鑾峰彇return灞炴?х殑鍊笺?? ^ C:\Users\weigu\AppData\Local\Temp\org.apache.cxf.jaxws.endpoint.dynamic.JaxWsDynamicClientFactory@ceddaf8-1555314397936-src\com\sd\msun\hospital\service\DeleteResponse.java:74: 错误: 编码GBK的不可映射字符 * 璁剧疆return灞炴?х殑鍊笺?? ^ C:\Users\weigu\AppData\Local\Temp\org.apache.cxf.jaxws.endpoint.dynamic.JaxWsDynamicClientFactory@ceddaf8-1555314397936-src\com\sd\msun\hospital\service\DeleteResponse.java:74: 错误: 编码GBK的不可映射字符 * 璁剧疆return灞炴?х殑鍊笺?? ^ C:\Users\weigu\AppData\Local\Temp\org.apache.cxf.jaxws.endpoint.dynamic.JaxWsDynamicClientFactory@ceddaf8-1555314397936-src\com\sd\msun\hospital\service\DeleteResponse.java:74: 错误: 编码GBK的不可映射字符 * 璁剧疆return灞炴?х殑鍊笺?? ^ C:\Users\weigu\AppData\Local\Temp\org.apache.cxf.jaxws.endpoint.dynamic.JaxWsDynamicClientFactory@ceddaf8-1555314397936-src\com\sd\msun\hospital\service\DeleteResponse.java:87: 错误: 编码GBK的不可映射字符 * <p>anonymous complex type鐨? Java 绫汇?? ^ C:\Users\weigu\AppData\Local\Temp\org.apache.cxf.jaxws.endpoint.dynamic.JaxWsDynamicClientFactory@ceddaf8-1555314397936-src\com\sd\msun\hospital\service\DeleteResponse.java:87: 错误: 编码GBK的不可映射字符 * <p>anonymous complex type鐨? Java 绫汇?? ^ C:\Users\weigu\AppData\Local\Temp\org.apache.cxf.jaxws.endpoint.dynamic.JaxWsDynamicClientFactory@ceddaf8-1555314397936-src\com\sd\msun\hospital\service\DeleteResponse.java:87: 错误: 编码GBK的不可映射字符 * <p>anonymous complex type鐨? Java 绫汇?? ^ C:\Users\weigu\AppData\Local\Temp\org.apache.cxf.jaxws.endpoint.dynamic.JaxWsDynamicClientFactory@ceddaf8-1555314397936-src\com\sd\msun\hospital\service\DeleteResponse.java:89: 错误: 编码GBK的不可映射字符 * <p>浠ヤ笅妯″紡鐗囨鎸囧畾鍖呭惈鍦ㄦ绫讳腑鐨勯鏈熷唴瀹广?? ^ C:\Users\weigu\AppData\Local\Temp\org.apache.cxf.jaxws.endpoint.dynamic.JaxWsDynamicClientFactory@ceddaf8-1555314397936-src\com\sd\msun\hospital\service\DeleteResponse.java:89: 错误: 编码GBK的不可映射字符 * <p>浠ヤ笅妯″紡鐗囨鎸囧畾鍖呭惈鍦ㄦ绫讳腑鐨勯鏈熷唴瀹广?? ^ C:\Users\weigu\AppData\Local\Temp\org.apache.cxf.jaxws.endpoint.dynamic.JaxWsDynamicClientFactory@ceddaf8-1555314397936-src\com\sd\msun\hospital\service\DeleteResponse.java:155: 错误: 编码GBK的不可映射字符 * <p>anonymous complex type鐨? Java 绫汇?? ^ C:\Users\weigu\AppData\Local\Temp\org.apache.cxf.jaxws.endpoint.dynamic.JaxWsDynamicClientFactory@ceddaf8-1555314397936-src\com\sd\msun\hospital\service\DeleteResponse.java:155: 错误: 编码GBK的不可映射字符 * <p>anonymous complex type鐨? Java 绫汇?? ^ C:\Users\weigu\AppData\Local\Temp\org.apache.cxf.jaxws.endpoint.dynamic.JaxWsDynamicClientFactory@ceddaf8-1555314397936-src\com\sd\msun\hospital\service\DeleteResponse.java:155: 错误: 编码GBK的不可映射字符 * <p>anonymous complex type鐨? Java 绫汇?? ^ C:\Users\weigu\AppData\Local\Temp\org.apache.cxf.jaxws.endpoint.dynamic.JaxWsDynamicClientFactory@ceddaf8-1555314397936-src\com\sd\msun\hospital\service\DeleteResponse.java:157: 错误: 编码GBK的不可映射字符 * <p>浠ヤ笅妯″紡鐗囨鎸囧畾鍖呭惈鍦ㄦ绫讳腑鐨勯鏈熷唴瀹广?? ^ C:\Users\weigu\AppData\Local\Temp\org.apache.cxf.jaxws.endpoint.dynamic.JaxWsDynamicClientFactory@ceddaf8-1555314397936-src\com\sd\msun\hospital\service\DeleteResponse.java:157: 错误: 编码GBK的不可映射字符 * <p>浠ヤ笅妯″紡鐗囨鎸囧畾鍖呭惈鍦ㄦ绫讳腑鐨勯鏈熷唴瀹广?? ^ C:\Users\weigu\AppData\Local\Temp\org.apache.cxf.jaxws.endpoint.dynamic.JaxWsDynamicClientFactory@ceddaf8-1555314397936-src\com\sd\msun\hospital\service\DeleteResponse.java:185: 错误: 编码GBK的不可映射字符 * 鑾峰彇key灞炴?х殑鍊笺?? ^ C:\Users\weigu\AppData\Local\Temp\org.apache.cxf.jaxws.endpoint.dynamic.JaxWsDynamicClientFactory@ceddaf8-1555314397936-src\com\sd\msun\hospital\service\DeleteResponse.java:185: 错误: 编码GBK的不可映射字符 * 鑾峰彇key灞炴?х殑鍊笺?? ^ C:\Users\weigu\AppData\Local\Temp\org.apache.cxf.jaxws.endpoint.dynamic.JaxWsDynamicClientFactory@ceddaf8-1555314397936-src\com\sd\msun\hospital\service\DeleteResponse.java:185: 错误: 编码GBK的不可映射字符 * 鑾峰彇key灞炴?х殑鍊笺?? ^ C:\Users\weigu\AppData\Local\Temp\org.apache.cxf.jaxws.endpoint.dynamic.JaxWsDynamicClientFactory@ceddaf8-1555314397936-src\com\sd\msun\hospital\service\DeleteResponse.java:197: 错误: 编码GBK的不可映射字符 * 璁剧疆key灞炴?х殑鍊笺?? ^ C:\Users\weigu\AppData\Local\Temp\org.apache.cxf.jaxws.endpoint.dynamic.JaxWsDynamicClientFactory@ceddaf8-1555314397936-src\com\sd\msun\hospital\service\DeleteResponse.java:197: 错误: 编码GBK的不可映射字符 * 璁剧疆key灞炴?х殑鍊笺?? ^ C:\Users\weigu\AppData\Local\Temp\org.apache.cxf.jaxws.endpoint.dynamic.JaxWsDynamicClientFactory@ceddaf8-1555314397936-src\com\sd\msun\hospital\service\DeleteResponse.java:197: 错误: 编码GBK的不可映射字符 * 璁剧疆key灞炴?х殑鍊笺?? ^ C:\Users\weigu\AppData\Local\Temp\org.apache.cxf.jaxws.endpoint.dynamic.JaxWsDynamicClientFactory@ceddaf8-1555314397936-src\com\sd\msun\hospital\service\DeleteResponse.java:209: 错误: 编码GBK的不可映射字符 * 鑾峰彇value灞炴?х殑鍊笺?? ^ C:\Users\weigu\AppData\Local\Temp\org.apache.cxf.jaxws.endpoint.dynamic.JaxWsDynamicClientFactory@ceddaf8-1555314397936-src\com\sd\msun\hospital\service\DeleteResponse.java:209: 错误: 编码GBK的不可映射字符 * 鑾峰彇value灞炴?х殑鍊笺?? ^ C:\Users\weigu\AppData\Local\Temp\org.apache.cxf.jaxws.endpoint.dynamic.JaxWsDynamicClientFactory@ceddaf8-1555314397936-src\com\sd\msun\hospital\service\DeleteResponse.java:209: 错误: 编码GBK的不可映射字符 * 鑾峰彇value灞炴?х殑鍊笺?? ^ C:\Users\weigu\AppData\Local\Temp\org.apache.cxf.jaxws.endpoint.dynamic.JaxWsDynamicClientFactory@ceddaf8-1555314397936-src\com\sd\msun\hospital\service\DeleteResponse.java:221: 错误: 编码GBK的不可映射字符 * 璁剧疆value灞炴?х殑鍊笺?? ^ C:\Users\weigu\AppData\Local\Temp\org.apache.cxf.jaxws.endpoint.dynamic.JaxWsDynamicClientFactory@ceddaf8-1555314397936-src\com\sd\msun\hospital\service\DeleteResponse.java:221: 错误: 编码GBK的不可映射字符 * 璁剧疆value灞炴?х殑鍊笺?? ^ C:\Users\weigu\AppData\Local\Temp\org.apache.cxf.jaxws.endpoint.dynamic.JaxWsDynamicClientFactory@ceddaf8-1555314397936-src\com\sd\msun\hospital\service\DeleteResponse.java:221: 错误: 编码GBK的不可映射字符 * 璁剧疆value灞炴?х殑鍊笺?? ^ C:\Users\weigu\AppData\Local\Temp\org.apache.cxf.jaxws.endpoint.dynamic.JaxWsDynamicClientFactory@ceddaf8-1555314397936-src\com\sd\msun\hospital\service\GetAppointResult.java:10: 错误: 编码GBK的不可映射字符 * <p>getAppointResult complex type鐨? Java 绫汇?? ^ C:\Users\weigu\AppData\Local\Temp\org.apache.cxf.jaxws.endpoint.dynamic.JaxWsDynamicClientFactory@ceddaf8-1555314397936-src\com\sd\msun\hospital\service\GetAppointResult.java:10: 错误: 编码GBK的不可映射字符 * <p>getAppointResult complex type鐨? Java 绫汇?? ^ C:\Users\weigu\AppData\Local\Temp\org.apache.cxf.jaxws.endpoint.dynamic.JaxWsDynamicClientFactory@ceddaf8-1555314397936-src\com\sd\msun\hospital\service\GetAppointResult.java:10: 错误: 编码GBK的不可映射字符 * <p>getAppointResult complex type鐨? Java 绫汇?? ^ C:\Users\weigu\AppData\Local\Temp\org.apache.cxf.jaxws.endpoint.dynamic.JaxWsDynamicClientFactory@ceddaf8-1555314397936-src\com\sd\msun\hospital\service\GetAppointResult.java:12: 错误: 编码GBK的不可映射字符 * <p>浠ヤ笅妯″紡鐗囨鎸囧畾鍖呭惈鍦ㄦ绫讳腑鐨勯鏈熷唴瀹广?? ^ C:\Users\weigu\AppData\Local\Temp\org.apache.cxf.jaxws.endpoint.dynamic.JaxWsDynamicClientFactory@ceddaf8-1555314397936-src\com\sd\msun\hospital\service\GetAppointResult.java:12: 错误: 编码GBK的不可映射字符 * <p>浠ヤ笅妯″紡鐗囨鎸囧畾鍖呭惈鍦ㄦ绫讳腑鐨勯鏈熷唴瀹广?? ^ C:\Users\weigu\AppData\Local\Temp\org.apache.cxf.jaxws.endpoint.dynamic.JaxWsDynamicClientFactory@ceddaf8-1555314397936-src\com\sd\msun\hospital\service\GetAppointResult.java:37: 错误: 编码GBK的不可映射字符 * 鑾峰彇arg0灞炴?х殑鍊笺?? ^ C:\Users\weigu\AppData\Local\Temp\org.apache.cxf.jaxws.endpoint.dynamic.JaxWsDynamicClientFactory@ceddaf8-1555314397936-src\com\sd\msun\hospital\service\GetAppointResult.java:37: 错误: 编码GBK的不可映射字符 * 鑾峰彇arg0灞炴?х殑鍊笺?? ^ ```

往本地maven库打jar包的时候提示访问路径拒绝访问

下面是错误提示 ![图片说明](https://img-ask.csdn.net/upload/201510/09/1444385233_691566.png) 我的打包命令如下 mvn install:install-file -Dfile=D:\maven\apache-maven-3.1.0\repository -DgroupId=org.jsoup -DartifactId=jsoup -Dversion=1.8.3 -Dpackaging=jar

maven在eclipse中执行install命令控制台输出(如下)是什么情况:

在eclipse中执行install命令控制台输出(如下)是什么情况: [INFO] Downloading: https://repo.maven.apache.org/maven2/org/apache/maven/plugins/maven-install-plugin/2.4/maven-install-plugin-2.4.pom [INFO] BUILD FAILURE [INFO] Total time: 26.617 s [INFO] Finished at: 2016-08-03T12:06:15+08:00 [INFO] Final Memory: 8M/155M [ERROR] Plugin org.apache.maven.plugins:maven-install-plugin:2.4 or one of its dependencies could not be resolved: Failed to read artifact descriptor for org.apache.maven.plugins:maven-install-plugin:jar:2.4: Could not transfer artifact org.apache.maven.plugins:maven-install-plugin:pom:2.4 from/to central (https://repo.maven.apache.org/maven2): Connect to repo.maven.apache.org:443 [repo.maven.apache.org/151.101.24.215] failed: Connection timed out: connect -> [Help 1] [ERROR] [ERROR] To see the full stack trace of the errors, re-run Maven with the -e switch. [ERROR] Re-run Maven using the -X switch to enable full debug logging. [ERROR] [ERROR] For more information about the errors and possible solutions, please read the following articles: [ERROR] [Help 1] http://cwiki.apache.org/confluence/display/MAVEN/PluginResolutionException

请问下在maven项目中的Deployment Assembly无法添加Maven Dependencies该如何解决?

**1.首先将项目部署到tomcat中出现如下错误** ![图片说明](https://img-ask.csdn.net/upload/201910/06/1570340554_981518.png) **2.根据网上查询发现是maven项目中的Deployment Assembly没有添加Maven Dependencies** ![图片说明](https://img-ask.csdn.net/upload/201910/06/1570340659_533071.png) **3.但是不管怎么添加Maven Dependencies都无法成功添加,实在不知道什么原因,希望能得到解决办法**

使用IDEA和maven做注册时候遇到如下问题:

"E:\IntelliJ IDEA 2016.2.1\jdk1.8.0_91\bin\java" "-Dmaven.home=E:\IntelliJ IDEA 2016.2.1\plugins\maven\lib\maven3" "-Dclassworlds.conf=E:\IntelliJ IDEA 2016.2.1\plugins\maven\lib\maven3\bin\m2.conf" -Didea.launcher.port=7533 "-Didea.launcher.bin.path=E:\IntelliJ IDEA 2016.2.1\bin" -Dfile.encoding=UTF-8 -classpath "E:\IntelliJ IDEA 2016.2.1\plugins\maven\lib\maven3\boot\plexus-classworlds-2.4.jar;E:\IntelliJ IDEA 2016.2.1\lib\idea_rt.jar" com.intellij.rt.execution.application.AppMain org.codehaus.classworlds.Launcher -Didea.version=2016.2.1 tomcat:run [INFO] Scanning for projects... [INFO] [INFO] ------------------------------------------------------------------------ [INFO] Building zhuce Maven Webapp 1.0-SNAPSHOT [INFO] ------------------------------------------------------------------------ [INFO] [INFO] >>> tomcat-maven-plugin:1.1:run (default-cli) @ zhuce >>> [WARNING] The POM for com.google.guava:guava:jar:15.0 is invalid, transitive dependencies (if any) will not be available, enable debug logging for more details [WARNING] The POM for javax.servlet:javax.servlet-api:jar:3.1.0 is invalid, transitive dependencies (if any) will not be available, enable debug logging for more details [WARNING] The POM for org.glassfish.jersey.containers:jersey-container-grizzly2-servlet:jar:2.13 is invalid, transitive dependencies (if any) will not be available, enable debug logging for more details [WARNING] The POM for org.glassfish.jersey.containers:jersey-container-servlet-core:jar:2.13 is invalid, transitive dependencies (if any) will not be available, enable debug logging for more details [WARNING] The POM for commons-io:commons-io:jar:2.4 is invalid, transitive dependencies (if any) will not be available, enable debug logging for more details [WARNING] The POM for org.glassfish.jersey.core:jersey-client:jar:2.13 is invalid, transitive dependencies (if any) will not be available, enable debug logging for more details [WARNING] The POM for org.apache.bval:bval-jsr303:jar:0.5 is invalid, transitive dependencies (if any) will not be available, enable debug logging for more details [WARNING] The POM for log4j:log4j:jar:1.2.14 is invalid, transitive dependencies (if any) will not be available, enable debug logging for more details [WARNING] The POM for org.apache.httpcomponents:httpclient:jar:4.1 is invalid, transitive dependencies (if any) will not be available, enable debug logging for more details [WARNING] The POM for com.tustcs.java:base:jar:1.0 is invalid, transitive dependencies (if any) will not be available, enable debug logging for more details [WARNING] The POM for org.json:json:jar:20140107 is invalid, transitive dependencies (if any) will not be available, enable debug logging for more details [INFO] [INFO] --- maven-resources-plugin:2.5:resources (default-resources) @ zhuce --- [debug] execute contextualize [WARNING] Using platform encoding (UTF-8 actually) to copy filtered resources, i.e. build is platform dependent! [INFO] Copying 0 resource [INFO] [INFO] --- maven-compiler-plugin:2.3.2:compile (default-compile) @ zhuce --- [WARNING] File encoding has not been set, using platform encoding UTF-8, i.e. build is platform dependent! [INFO] Compiling 2 source files to F:\zhuce\target\classes [INFO] ------------------------------------------------------------- [ERROR] COMPILATION ERROR : [INFO] ------------------------------------------------------------- [ERROR] Failure executing javac, but could not parse the error: 错误: 读取C:\Users\ZILI\.m2\repository\com\google\guava\guava\15.0\guava-15.0.jar时出错; error in opening zip file 错误: 读取C:\Users\ZILI\.m2\repository\javax\servlet\javax.servlet-api\3.1.0\javax.servlet-api-3.1.0.jar时出错; error in opening zip file 错误: 读取C:\Users\ZILI\.m2\repository\org\glassfish\jersey\containers\jersey-container-grizzly2-servlet\2.13\jersey-container-grizzly2-servlet-2.13.jar时出错; error in opening zip file 错误: 读取C:\Users\ZILI\.m2\repository\org\glassfish\jersey\containers\jersey-container-servlet-core\2.13\jersey-container-servlet-core-2.13.jar时出错; error in opening zip file 错误: 读取C:\Users\ZILI\.m2\repository\commons-io\commons-io\2.4\commons-io-2.4.jar时出错; error in opening zip file 错误: 读取C:\Users\ZILI\.m2\repository\org\glassfish\jersey\core\jersey-client\2.13\jersey-client-2.13.jar时出错; error in opening zip file 错误: 读取C:\Users\ZILI\.m2\repository\org\apache\bval\bval-jsr303\0.5\bval-jsr303-0.5.jar时出错; error in opening zip file 错误: 读取C:\Users\ZILI\.m2\repository\log4j\log4j\1.2.14\log4j-1.2.14.jar时出错; error in opening zip file 错误: 读取C:\Users\ZILI\.m2\repository\org\apache\httpcomponents\httpclient\4.1\httpclient-4.1.jar时出错; error in opening zip file 错误: 读取C:\Users\ZILI\.m2\repository\com\tustcs\java\base\1.0\base-1.0.jar时出错; error in opening zip file 错误: 读取C:\Users\ZILI\.m2\repository\org\json\json\20140107\json-20140107.jar时出错; error in opening zip file 11 个错误 [INFO] 1 error [INFO] ------------------------------------------------------------- [INFO] ------------------------------------------------------------------------ [INFO] BUILD FAILURE [INFO] ------------------------------------------------------------------------ [INFO] Total time: 13.436s [INFO] Finished at: Mon Oct 10 10:44:37 CST 2016 [INFO] Final Memory: 10M/77M [INFO] ------------------------------------------------------------------------ [ERROR] Failed to execute goal org.apache.maven.plugins:maven-compiler-plugin:2.3.2:compile (default-compile) on project zhuce: Compilation failure [ERROR] Failure executing javac, but could not parse the error: [ERROR] 错误: 读取C:\Users\ZILI\.m2\repository\com\google\guava\guava\15.0\guava-15.0.jar时出错; error in opening zip file [ERROR] 错误: 读取C:\Users\ZILI\.m2\repository\javax\servlet\javax.servlet-api\3.1.0\javax.servlet-api-3.1.0.jar时出错; error in opening zip file [ERROR] 错误: 读取C:\Users\ZILI\.m2\repository\org\glassfish\jersey\containers\jersey-container-grizzly2-servlet\2.13\jersey-container-grizzly2-servlet-2.13.jar时出错; error in opening zip file [ERROR] 错误: 读取C:\Users\ZILI\.m2\repository\org\glassfish\jersey\containers\jersey-container-servlet-core\2.13\jersey-container-servlet-core-2.13.jar时出错; error in opening zip file [ERROR] 错误: 读取C:\Users\ZILI\.m2\repository\commons-io\commons-io\2.4\commons-io-2.4.jar时出错; error in opening zip file [ERROR] 错误: 读取C:\Users\ZILI\.m2\repository\org\glassfish\jersey\core\jersey-client\2.13\jersey-client-2.13.jar时出错; error in opening zip file [ERROR] 错误: 读取C:\Users\ZILI\.m2\repository\org\apache\bval\bval-jsr303\0.5\bval-jsr303-0.5.jar时出错; error in opening zip file [ERROR] 错误: 读取C:\Users\ZILI\.m2\repository\log4j\log4j\1.2.14\log4j-1.2.14.jar时出错; error in opening zip file [ERROR] 错误: 读取C:\Users\ZILI\.m2\repository\org\apache\httpcomponents\httpclient\4.1\httpclient-4.1.jar时出错; error in opening zip file [ERROR] 错误: 读取C:\Users\ZILI\.m2\repository\com\tustcs\java\base\1.0\base-1.0.jar时出错; error in opening zip file [ERROR] 错误: 读取C:\Users\ZILI\.m2\repository\org\json\json\20140107\json-20140107.jar时出错; error in opening zip file [ERROR] 11 个错误 [ERROR] -> [Help 1] [ERROR] [ERROR] To see the full stack trace of the errors, re-run Maven with the -e switch. [ERROR] Re-run Maven using the -X switch to enable full debug logging. [ERROR] [ERROR] For more information about the errors and possible solutions, please read the following articles: [ERROR] [Help 1] http://cwiki.apache.org/confluence/display/MAVEN/MojoFailureException Process finished with exit code 1 ``` ```

maven项目 上传图片问题 往图片服务器上传 图片上传失败

第一次上传 老是上传失败 但同一张图片第二次上传就能传上去 不知道为什么 报错如下: ``` java.io.IOException: recv package size -1 != 10 at org.csource.fastdfs.ProtoCommon.recvHeader(ProtoCommon.java:214) at org.csource.fastdfs.ProtoCommon.recvPackage(ProtoCommon.java:250) at org.csource.fastdfs.TrackerClient.getStoreStorage(TrackerClient.java:143) at org.csource.fastdfs.StorageClient.newWritableStorageConnection(StorageClient.java:1938) at org.csource.fastdfs.StorageClient.do_upload_file(StorageClient.java:703) at org.csource.fastdfs.StorageClient.upload_file(StorageClient.java:208) at org.csource.fastdfs.StorageClient.upload_file(StorageClient.java:226) at org.csource.fastdfs.StorageClient1.upload_file1(StorageClient1.java:112) at com.lx.cctshop.tools.FastDFSClient.uploadFile(FastDFSClient.java:63) at com.lx.cctshop.tools.FastDFSClient.uploadFile(FastDFSClient.java:72) at com.lx.cctshop.controller.ItemController.uploadImage(ItemController.java:81) at sun.reflect.NativeMethodAccessorImpl.invoke0(Native Method) at sun.reflect.NativeMethodAccessorImpl.invoke(NativeMethodAccessorImpl.java:57) at sun.reflect.DelegatingMethodAccessorImpl.invoke(DelegatingMethodAccessorImpl.java:43) at java.lang.reflect.Method.invoke(Method.java:606) at org.springframework.web.method.support.InvocableHandlerMethod.doInvoke(InvocableHandlerMethod.java:222) at org.springframework.web.method.support.InvocableHandlerMethod.invokeForRequest(InvocableHandlerMethod.java:137) at org.springframework.web.servlet.mvc.method.annotation.ServletInvocableHandlerMethod.invokeAndHandle(ServletInvocableHandlerMethod.java:110) at org.springframework.web.servlet.mvc.method.annotation.RequestMappingHandlerAdapter.invokeHandlerMethod(RequestMappingHandlerAdapter.java:814) at org.springframework.web.servlet.mvc.method.annotation.RequestMappingHandlerAdapter.handleInternal(RequestMappingHandlerAdapter.java:737) at org.springframework.web.servlet.mvc.method.AbstractHandlerMethodAdapter.handle(AbstractHandlerMethodAdapter.java:85) at org.springframework.web.servlet.DispatcherServlet.doDispatch(DispatcherServlet.java:959) at org.springframework.web.servlet.DispatcherServlet.doService(DispatcherServlet.java:893) at org.springframework.web.servlet.FrameworkServlet.processRequest(FrameworkServlet.java:969) at org.springframework.web.servlet.FrameworkServlet.doPost(FrameworkServlet.java:871) at javax.servlet.http.HttpServlet.service(HttpServlet.java:647) at org.springframework.web.servlet.FrameworkServlet.service(FrameworkServlet.java:845) at javax.servlet.http.HttpServlet.service(HttpServlet.java:728) at org.apache.catalina.core.ApplicationFilterChain.internalDoFilter(ApplicationFilterChain.java:305) at org.apache.catalina.core.ApplicationFilterChain.doFilter(ApplicationFilterChain.java:210) at org.apache.tomcat.websocket.server.WsFilter.doFilter(WsFilter.java:51) at org.apache.catalina.core.ApplicationFilterChain.internalDoFilter(ApplicationFilterChain.java:243) at org.apache.catalina.core.ApplicationFilterChain.doFilter(ApplicationFilterChain.java:210) at org.springframework.web.filter.CharacterEncodingFilter.doFilterInternal(CharacterEncodingFilter.java:121) at org.springframework.web.filter.OncePerRequestFilter.doFilter(OncePerRequestFilter.java:107) at org.apache.catalina.core.ApplicationFilterChain.internalDoFilter(ApplicationFilterChain.java:243) at org.apache.catalina.core.ApplicationFilterChain.doFilter(ApplicationFilterChain.java:210) at org.apache.catalina.core.StandardWrapperValve.invoke(StandardWrapperValve.java:222) at org.apache.catalina.core.StandardContextValve.invoke(StandardContextValve.java:123) at org.apache.catalina.authenticator.AuthenticatorBase.invoke(AuthenticatorBase.java:502) at org.apache.catalina.core.StandardHostValve.invoke(StandardHostValve.java:171) at org.apache.catalina.valves.ErrorReportValve.invoke(ErrorReportValve.java:100) at org.apache.catalina.valves.AccessLogValve.invoke(AccessLogValve.java:953) at org.apache.catalina.core.StandardEngineValve.invoke(StandardEngineValve.java:118) at org.apache.catalina.connector.CoyoteAdapter.service(CoyoteAdapter.java:408) at org.apache.coyote.http11.AbstractHttp11Processor.process(AbstractHttp11Processor.java:1041) at org.apache.coyote.AbstractProtocol$AbstractConnectionHandler.process(AbstractProtocol.java:603) at org.apache.tomcat.util.net.JIoEndpoint$SocketProcessor.run(JIoEndpoint.java:310) at java.util.concurrent.ThreadPoolExecutor.runWorker(ThreadPoolExecutor.java:1145) at java.util.concurrent.ThreadPoolExecutor$Worker.run(ThreadPoolExecutor.java:615) at java.lang.Thread.run(Thread.java:745) ```

maven release:perform no scm url

今天运行maven打包命令的时候发现打包失败。之前很正常。 异常如下: ![图片说明](https://img-ask.csdn.net/upload/201508/10/1439219367_364633.png) POM配置如下: ![图片说明](https://img-ask.csdn.net/upload/201508/10/1439219384_943972.png) ![图片说明](https://img-ask.csdn.net/upload/201508/10/1439219393_325616.png) 环境描述 JDK + maven + ​git 无法从NO SCM URL 错误信息中分析出问题出在那。。。。 请大神们指点一下

maven多模块项目,构建子模块失败

初学maven,构建多模块项目时,父模块能正常构建,子模块构建时产生如下异常: ![整体目录](https://img-ask.csdn.net/upload/201602/29/1456678246_496145.jpg) 我更新过本地仓库:D:\maven_repository,原本是没有配置parent标签的relativePath属性,eclipse自动就给出了错误提示,配了后,错误提示消失了,个人分析,“relativePath”的配置是正确的,但是还是无法正确构建成功。不知道有没有前辈有遇到过该问题或者有该情况解决办法,万望“拔刀相助”,不吝赐教,小弟这厢先谢过啦! 工作空间目录如下:![工作空间目录](https://img-ask.csdn.net/upload/201602/29/1456678259_626157.jpg) 尝试过在Eclipse中通过clean install 之执行过:![指令操作](https://img-ask.csdn.net/upload/201602/29/1456678273_91604.jpg) 构建子模块时,控制台完整的异常信息如下: [INFO] Scanning for projects... [ERROR] [ERROR] Some problems were encountered while processing the POMs: [FATAL] Non-resolvable parent POM for com.jikexueyuan:helloweb-entity:1.0-SNAPSHOT: Failure to find com.jikexueyuan:helloweb-parent:pom:1.0 in https://repo.maven.apache.org/maven2 was cached in the local repository, resolution will not be reattempted until the update interval of central has elapsed or updates are forced and 'parent.relativePath' points at wrong local POM @ line 5, column 11 @ [ERROR] The build could not read 1 project -> [Help 1] [ERROR] [ERROR] The project com.jikexueyuan:helloweb-entity:1.0-SNAPSHOT (D:\TrueTimeWorkspace\helloweb\modules\helloweb-entity\pom.xml) has 1 error [ERROR] Non-resolvable parent POM for com.jikexueyuan:helloweb-entity:1.0-SNAPSHOT: Failure to find com.jikexueyuan:helloweb-parent:pom:1.0 in https://repo.maven.apache.org/maven2 was cached in the local repository, resolution will not be reattempted until the update interval of central has elapsed or updates are forced and 'parent.relativePath' points at wrong local POM @ line 5, column 11 -> [Help 2] [ERROR] [ERROR] To see the full stack trace of the errors, re-run Maven with the -e switch. [ERROR] Re-run Maven using the -X switch to enable full debug logging. [ERROR] [ERROR] For more information about the errors and possible solutions, please read the following articles: [ERROR] [Help 1] http://cwiki.apache.org/confluence/display/MAVEN/ProjectBuildingException [ERROR] [Help 2] http://cwiki.apache.org/confluence/display/MAVEN/UnresolvableModelException

maven 编译报错的问题

错误如下: [root@node1-246 emm-trunk01]# mvn clean install [INFO] Scanning for projects... [ERROR] The build could not read 8 projects -> [Help 1] [ERROR] [ERROR] The project com.polysaas.emm:emm-device:0.0.1-SNAPSHOT (/opt/emm-trunk01/emm-device/pom.xml) has 5 errors [ERROR] Non-parseable POM /root/.m2/repository/org/springframework/boot/spring-boot-starter-parent/1.0.1.RELEASE/spring-boot-starter-parent-1.0.1.RELEASE.pom: start tag unexpected character ; (position: TEXT seen ...,window.analytics}};for(var i=0;i<window.analytics.methods.length;... @32:406) @ /root/.m2/repository/org/springframework/boot/spring-boot-starter-parent/1.0.1.RELEASE/spring-boot-starter-parent-1.0.1.RELEASE.pom, line 32, column 406 -> [Help 2] [ERROR] 'dependencies.dependency.version' for org.springframework.boot:spring-boot-starter-web:jar is missing. @ com.polysaas.emm:emm-device:[unknown-version], /opt/emm-trunk01/emm-device/pom.xml, line 50, column 15 [ERROR] 'dependencies.dependency.version' for org.springframework.boot:spring-boot-starter-jetty:jar is missing. @ com.polysaas.emm:emm-device:[unknown-version], /opt/emm-trunk01/emm-device/pom.xml, line 60, column 15 [ERROR] 'dependencies.dependency.version' for org.springframework.boot:spring-boot-starter-actuator:jar is missing. @ com.polysaas.emm:emm-device:[unknown-version], /opt/emm-trunk01/emm-device/pom.xml, line 64, column 15 [ERROR] 'dependencies.dependency.version' for org.springframework.boot:spring-boot-starter-test:jar is missing. @ com.polysaas.emm:emm-device:[unknown-version], /opt/emm-trunk01/emm-device/pom.xml, line 68, column 15 [ERROR] [ERROR] The project com.polysaas.emm:emm-pms:0.0.1-SNAPSHOT (/opt/emm-trunk01/emm-pms/pom.xml) has 5 errors [ERROR] Non-parseable POM /root/.m2/repository/org/springframework/boot/spring-boot-starter-parent/1.1.7.RELEASE/spring-boot-starter-parent-1.1.7.RELEASE.pom: start tag unexpected character ; (position: TEXT seen ...,window.analytics}};for(var i=0;i<window.analytics.methods.length;... @32:406) @ /root/.m2/repository/org/springframework/boot/spring-boot-starter-parent/1.1.7.RELEASE/spring-boot-starter-parent-1.1.7.RELEASE.pom, line 32, column 406 -> [Help 2] 代码是从svn上down下来的,在其他机器上编译没问题,新装的机器上 编译出错了,maven 用3.0.4 和 3.0.5 都是这个问题(maven是解压指定目录的),linux下maven的设置如下: MAVEN_HOME=/opt/maven PATH=$MAVEN_HOME/bin:$PATH export PATH USER LOGNAME MAIL HOSTNAME HISTSIZE HISTCONTROL EMM_LOG_BASE EMM_LOG_BASE MAVEN_HOME 谢谢!

在中国程序员是青春饭吗?

今年,我也32了 ,为了不给大家误导,咨询了猎头、圈内好友,以及年过35岁的几位老程序员……舍了老脸去揭人家伤疤……希望能给大家以帮助,记得帮我点赞哦。 目录: 你以为的人生 一次又一次的伤害 猎头界的真相 如何应对互联网行业的「中年危机」 一、你以为的人生 刚入行时,拿着傲人的工资,想着好好干,以为我们的人生是这样的: 等真到了那一天,你会发现,你的人生很可能是这样的: ...

程序员请照顾好自己,周末病魔差点一套带走我。

程序员在一个周末的时间,得了重病,差点当场去世,还好及时挽救回来了。

和黑客斗争的 6 天!

互联网公司工作,很难避免不和黑客们打交道,我呆过的两家互联网公司,几乎每月每天每分钟都有黑客在公司网站上扫描。有的是寻找 Sql 注入的缺口,有的是寻找线上服务器可能存在的漏洞,大部分都...

点沙成金:英特尔芯片制造全过程揭密

“亚马逊丛林里的蝴蝶扇动几下翅膀就可能引起两周后美国德州的一次飓风……” 这句人人皆知的话最初用来描述非线性系统中微小参数的变化所引起的系统极大变化。 而在更长的时间尺度内,我们所生活的这个世界就是这样一个异常复杂的非线性系统…… 水泥、穹顶、透视——关于时间与技艺的蝴蝶效应 公元前3000年,古埃及人将尼罗河中挖出的泥浆与纳特龙盐湖中的矿物盐混合,再掺入煅烧石灰石制成的石灰,由此得来了人...

上班一个月,后悔当初着急入职的选择了

最近有个老铁,告诉我说,上班一个月,后悔当初着急入职现在公司了。他之前在美图做手机研发,今年美图那边今年也有一波组织优化调整,他是其中一个,在协商离职后,当时捉急找工作上班,因为有房贷供着,不能没有收入来源。所以匆忙选了一家公司,实际上是一个大型外包公司,主要派遣给其他手机厂商做外包项目。**当时承诺待遇还不错,所以就立马入职去上班了。但是后面入职后,发现薪酬待遇这块并不是HR所说那样,那个HR自...

女程序员,为什么比男程序员少???

昨天看到一档综艺节目,讨论了两个话题:(1)中国学生的数学成绩,平均下来看,会比国外好?为什么?(2)男生的数学成绩,平均下来看,会比女生好?为什么?同时,我又联想到了一个技术圈经常讨...

副业收入是我做程序媛的3倍,工作外的B面人生是怎样的?

提到“程序员”,多数人脑海里首先想到的大约是:为人木讷、薪水超高、工作枯燥…… 然而,当离开工作岗位,撕去层层标签,脱下“程序员”这身外套,有的人生动又有趣,马上展现出了完全不同的A/B面人生! 不论是简单的爱好,还是正经的副业,他们都干得同样出色。偶尔,还能和程序员的特质结合,产生奇妙的“化学反应”。 @Charlotte:平日素颜示人,周末美妆博主 大家都以为程序媛也个个不修边幅,但我们也许...

如果你是老板,你会不会踢了这样的员工?

有个好朋友ZS,是技术总监,昨天问我:“有一个老下属,跟了我很多年,做事勤勤恳恳,主动性也很好。但随着公司的发展,他的进步速度,跟不上团队的步伐了,有点...

我入职阿里后,才知道原来简历这么写

私下里,有不少读者问我:“二哥,如何才能写出一份专业的技术简历呢?我总感觉自己写的简历太烂了,所以投了无数份,都石沉大海了。”说实话,我自己好多年没有写过简历了,但我认识的一个同行,他在阿里,给我说了一些他当年写简历的方法论,我感觉太牛逼了,实在是忍不住,就分享了出来,希望能够帮助到你。 01、简历的本质 作为简历的撰写者,你必须要搞清楚一点,简历的本质是什么,它就是为了来销售你的价值主张的。往深...

外包程序员的幸福生活

今天给你们讲述一个外包程序员的幸福生活。男主是Z哥,不是在外包公司上班的那种,是一名自由职业者,接外包项目自己干。接下来讲的都是真人真事。 先给大家介绍一下男主,Z哥,老程序员,是我十多年前的老同事,技术大牛,当过CTO,也创过业。因为我俩都爱好喝酒、踢球,再加上住的距离不算远,所以一直也断断续续的联系着,我对Z哥的状况也有大概了解。 Z哥几年前创业失败,后来他开始干起了外包,利用自己的技术能...

C++11:一些微小的变化(新的数据类型、template表达式内的空格、nullptr、std::nullptr_t)

本文介绍一些C++的两个新特性,它们虽然微小,但对你的编程十分重要 一、Template表达式内的空格 C++11标准之前建议在“在两个template表达式的闭符之间放一个空格”的要求已经过时了 例如: vector&lt;list&lt;int&gt; &gt;; //C++11之前 vector&lt;list&lt;int&gt;&gt;; //C++11 二、nullptr ...

优雅的替换if-else语句

场景 日常开发,if-else语句写的不少吧??当逻辑分支非常多的时候,if-else套了一层又一层,虽然业务功能倒是实现了,但是看起来是真的很不优雅,尤其是对于我这种有强迫症的程序"猿",看到这么多if-else,脑袋瓜子就嗡嗡的,总想着解锁新姿势:干掉过多的if-else!!!本文将介绍三板斧手段: 优先判断条件,条件不满足的,逻辑及时中断返回; 采用策略模式+工厂模式; 结合注解,锦...

深入剖析Springboot启动原理的底层源码,再也不怕面试官问了!

大家现在应该都对Springboot很熟悉,但是你对他的启动原理了解吗?

离职半年了,老东家又发 offer,回不回?

有小伙伴问松哥这个问题,他在上海某公司,在离职了几个月后,前公司的领导联系到他,希望他能够返聘回去,他很纠结要不要回去? 俗话说好马不吃回头草,但是这个小伙伴既然感到纠结了,我觉得至少说明了两个问题:1.曾经的公司还不错;2.现在的日子也不是很如意。否则应该就不会纠结了。 老实说,松哥之前也有过类似的经历,今天就来和小伙伴们聊聊回头草到底吃不吃。 首先一个基本观点,就是离职了也没必要和老东家弄的苦...

为什么你不想学习?只想玩?人是如何一步一步废掉的

不知道是不是只有我这样子,还是你们也有过类似的经历。 上学的时候总有很多光辉历史,学年名列前茅,或者单科目大佬,但是虽然慢慢地长大了,你开始懈怠了,开始废掉了。。。 什么?你说不知道具体的情况是怎么样的? 我来告诉你: 你常常潜意识里或者心理觉得,自己真正的生活或者奋斗还没有开始。总是幻想着自己还拥有大把时间,还有无限的可能,自己还能逆风翻盘,只不是自己还没开始罢了,自己以后肯定会变得特别厉害...

为什么程序员做外包会被瞧不起?

二哥,有个事想询问下您的意见,您觉得应届生值得去外包吗?公司虽然挺大的,中xx,但待遇感觉挺低,马上要报到,挺纠结的。

当HR压你价,说你只值7K,你该怎么回答?

当HR压你价,说你只值7K时,你可以流畅地回答,记住,是流畅,不能犹豫。 礼貌地说:“7K是吗?了解了。嗯~其实我对贵司的面试官印象很好。只不过,现在我的手头上已经有一份11K的offer。来面试,主要也是自己对贵司挺有兴趣的,所以过来看看……”(未完) 这段话主要是陪HR互诈的同时,从公司兴趣,公司职员印象上,都给予对方正面的肯定,既能提升HR的好感度,又能让谈判气氛融洽,为后面的发挥留足空间。...

面试:第十六章:Java中级开发(16k)

HashMap底层实现原理,红黑树,B+树,B树的结构原理 Spring的AOP和IOC是什么?它们常见的使用场景有哪些?Spring事务,事务的属性,传播行为,数据库隔离级别 Spring和SpringMVC,MyBatis以及SpringBoot的注解分别有哪些?SpringMVC的工作原理,SpringBoot框架的优点,MyBatis框架的优点 SpringCould组件有哪些,他们...

面试阿里p7,被按在地上摩擦,鬼知道我经历了什么?

面试阿里p7被问到的问题(当时我只知道第一个):@Conditional是做什么的?@Conditional多个条件是什么逻辑关系?条件判断在什么时候执...

面试了一个 31 岁程序员,让我有所触动,30岁以上的程序员该何去何从?

最近面试了一个31岁8年经验的程序猿,让我有点感慨,大龄程序猿该何去何从。

【阿里P6面经】二本,curd两年,疯狂复习,拿下阿里offer

二本的读者,在老东家不断学习,最后逆袭

大三实习生,字节跳动面经分享,已拿Offer

说实话,自己的算法,我一个不会,太难了吧

程序员垃圾简历长什么样?

已经连续五年参加大厂校招、社招的技术面试工作,简历看的不下于万份 这篇文章会用实例告诉你,什么是差的程序员简历! 疫情快要结束了,各个公司也都开始春招了,作为即将红遍大江南北的新晋UP主,那当然要为小伙伴们做点事(手动狗头)。 就在公众号里公开征简历,义务帮大家看,并一一点评。《启舰:春招在即,义务帮大家看看简历吧》 一石激起千层浪,三天收到两百多封简历。 花光了两个星期的所有空闲时...

《经典算法案例》01-08:如何使用质数设计扫雷(Minesweeper)游戏

我们都玩过Windows操作系统中的经典游戏扫雷(Minesweeper),如果把质数当作一颗雷,那么,表格中红色的数字哪些是雷(质数)?您能找出多少个呢?文中用列表的方式罗列了10000以内的自然数、质数(素数),6的倍数等,方便大家观察质数的分布规律及特性,以便对算法求解有指导意义。另外,判断质数是初学算法,理解算法重要性的一个非常好的案例。

《Oracle Java SE编程自学与面试指南》最佳学习路线图(2020最新版)

正确选择比瞎努力更重要!

面试官:你连SSO都不懂,就别来面试了

大厂竟然要考我SSO,卧槽。

微软为一人收购一公司?破解索尼程序、写黑客小说,看他彪悍的程序人生!...

作者 | 伍杏玲出品 | CSDN(ID:CSDNnews)格子衬衫、常掉发、双肩包、修电脑、加班多……这些似乎成了大众给程序员的固定标签。近几年流行的“跨界风”开始刷新人们对程序员的...

终于,月薪过5万了!

来看几个问题想不想月薪超过5万?想不想进入公司架构组?想不想成为项目组的负责人?想不想成为spring的高手,超越99%的对手?那么本文内容是你必须要掌握的。本文主要详解bean的生命...

我说我懂多线程,面试官立马给我发了offer

不小心拿了几个offer,有点烦

自从喜欢上了B站这12个UP主,我越来越觉得自己是个废柴了!

不怕告诉你,我自从喜欢上了这12个UP主,哔哩哔哩成为了我手机上最耗电的软件,几乎每天都会看,可是吧,看的越多,我就越觉得自己是个废柴,唉,老天不公啊,不信你看看…… 间接性踌躇满志,持续性混吃等死,都是因为你们……但是,自己的学习力在慢慢变强,这是不容忽视的,推荐给你们! 都说B站是个宝,可是有人不会挖啊,没事,今天咱挖好的送你一箩筐,首先啊,我在B站上最喜欢看这个家伙的视频了,为啥 ,咱撇...

立即提问
相关内容推荐